FailedConsole Output

Started by remote host 50.17.198.52
[EnvInject] - Loading node environment variables.
Building in workspace /var/lib/jenkins/jobs/test-customer-diagnostics/workspace
Run condition [And] enabling prebuild for step [BuilderChain]
[EnvInject] - Injecting environment variables from a build step.
[EnvInject] - Injecting as environment variables the properties content 
OS=centos7
TESTNAME=crdt
GITHUB_REPO=rhcarvalho
GIT_BRANCH=pre-flight-checks
INSTANCE_TYPE=c4.xlarge
OS_ROOT=/data/src/github.com/openshift/origin

[EnvInject] - Variables injected successfully.
[workspace] $ /bin/sh -xe /tmp/hudson5874989675881326823.sh
+ vagrant origin-local-checkout --replace --repo openshift-ansible --user rhcarvalho --branch pre-flight-checks
You don't seem to have the GOPATH environment variable set on your system.
See: 'go help gopath' for more details about GOPATH.
Waiting for the cloning process to finish
Checking repo integrity for /var/lib/jenkins/jobs/test-customer-diagnostics/workspace/openshift-ansible
~/jobs/test-customer-diagnostics/workspace/openshift-ansible ~/jobs/test-customer-diagnostics/workspace
~/jobs/test-customer-diagnostics/workspace
Replacing: /var/lib/jenkins/jobs/test-customer-diagnostics/workspace/openshift-ansible
~/jobs/test-customer-diagnostics/workspace/openshift-ansible ~/jobs/test-customer-diagnostics/workspace
Already on 'pre-flight-checks'
Your branch is ahead of 'origin/pre-flight-checks' by 2 commits.
  (use "git push" to publish your local commits)
HEAD is now at 905c193 Run integration tests in Travis
Deleted branch tpr_pre-flight-checks_brenton (was d289fb7).
~/jobs/test-customer-diagnostics/workspace
Origin repositories cloned into /var/lib/jenkins/jobs/test-customer-diagnostics/workspace
+ '[' -n 7 ']'
+ set +x


*****Locally Merging Pull Request: https://github.com/rhcarvalho/openshift-ansible/pull/7
+ test_pull_requests --local_merge_pull_request 7 --repo openshift-ansible --config /var/lib/jenkins/.test_pull_requests_crdt.json
  Checking if current base repo commit ID matches what we expect
Local merging pull request #7 for repo 'openshift-ansible' against base repo commit id 905c193da0ec7d812c38ba4bc4551fa4c283bbf7
+ pushd openshift-ansible
+ git checkout pre-flight-checks
Already on 'pre-flight-checks'
+ git checkout -b tpr_pre-flight-checks_brenton
Switched to a new branch 'tpr_pre-flight-checks_brenton'
+ git pull git@github.com:brenton/openshift-ansible.git pre-flight-checks
From github.com:brenton/openshift-ansible
 * branch            pre-flight-checks -> FETCH_HEAD
+ git pull git@github.com:brenton/openshift-ansible.git pre-flight-checks --tags
From github.com:brenton/openshift-ansible
 * branch            pre-flight-checks -> FETCH_HEAD
+ git checkout pre-flight-checks
Switched to branch 'pre-flight-checks'
+ git merge tpr_pre-flight-checks_brenton
+ git submodule update --recursive
+ popd
~/jobs/test-customer-diagnostics/workspace/openshift-ansible ~/jobs/test-customer-diagnostics/workspace
Auto-merging playbooks/byo/preflight/Dockerfile
Merge made by the 'recursive' strategy.
 hack/build-images.sh                               | 89 ++++++++++++++++++++++
 hack/build-release.sh                              |  1 +
 hack/common.sh                                     |  2 +
 hack/push-release.sh                               | 56 ++++++++++++++
 .../byo/preflight/Dockerfile                       |  3 +-
 5 files changed, 150 insertions(+), 1 deletion(-)
 create mode 100755 hack/build-images.sh
 create mode 100755 hack/build-release.sh
 create mode 100755 hack/common.sh
 create mode 100755 hack/push-release.sh
 rename Dockerfile.preflight => playbooks/byo/preflight/Dockerfile (85%)
Already up-to-date.
Updating 905c193..428e29d
Fast-forward
 hack/build-images.sh                               | 89 ++++++++++++++++++++++
 hack/build-release.sh                              |  1 +
 hack/common.sh                                     |  2 +
 hack/push-release.sh                               | 56 ++++++++++++++
 .../byo/preflight/Dockerfile                       |  3 +-
 5 files changed, 150 insertions(+), 1 deletion(-)
 create mode 100755 hack/build-images.sh
 create mode 100755 hack/build-release.sh
 create mode 100755 hack/common.sh
 create mode 100755 hack/push-release.sh
 rename Dockerfile.preflight => playbooks/byo/preflight/Dockerfile (85%)
~/jobs/test-customer-diagnostics/workspace
+ vagrant origin-local-checkout --replace
You don't seem to have the GOPATH environment variable set on your system.
See: 'go help gopath' for more details about GOPATH.
Waiting for the cloning process to finish
Checking repo integrity for /var/lib/jenkins/jobs/test-customer-diagnostics/workspace/origin
~/jobs/test-customer-diagnostics/workspace/origin ~/jobs/test-customer-diagnostics/workspace
~/jobs/test-customer-diagnostics/workspace
Replacing: /var/lib/jenkins/jobs/test-customer-diagnostics/workspace/origin
~/jobs/test-customer-diagnostics/workspace/origin ~/jobs/test-customer-diagnostics/workspace
From https://github.com/openshift/origin
   69afb3a..cbc0af0  master     -> origin/master
Already on 'master'
Your branch is behind 'origin/master' by 2 commits, and can be fast-forwarded.
  (use "git pull" to update your local branch)
HEAD is now at cbc0af0 bump(github.com/openshift/origin-web-console): 1265ebcb846113e5471da1149b69a4e9ff45f05e
Removing .vagrant-openshift.json
Removing .vagrant/
fatal: branch name required
~/jobs/test-customer-diagnostics/workspace
Checking repo integrity for /var/lib/jenkins/jobs/test-customer-diagnostics/workspace/source-to-image
~/jobs/test-customer-diagnostics/workspace/source-to-image ~/jobs/test-customer-diagnostics/workspace
~/jobs/test-customer-diagnostics/workspace
Replacing: /var/lib/jenkins/jobs/test-customer-diagnostics/workspace/source-to-image
~/jobs/test-customer-diagnostics/workspace/source-to-image ~/jobs/test-customer-diagnostics/workspace
Already on 'master'
HEAD is now at 28109cf Merge pull request #653 from PI-Victor/fix_failure_message
fatal: branch name required
~/jobs/test-customer-diagnostics/workspace
Checking repo integrity for /var/lib/jenkins/jobs/test-customer-diagnostics/workspace/origin-web-console
~/jobs/test-customer-diagnostics/workspace/origin-web-console ~/jobs/test-customer-diagnostics/workspace
~/jobs/test-customer-diagnostics/workspace
Replacing: /var/lib/jenkins/jobs/test-customer-diagnostics/workspace/origin-web-console
~/jobs/test-customer-diagnostics/workspace/origin-web-console ~/jobs/test-customer-diagnostics/workspace
From https://github.com/openshift/origin-web-console
   1fb702b..1265ebc  master     -> origin/master
Already on 'master'
Your branch is behind 'origin/master' by 2 commits, and can be fast-forwarded.
  (use "git pull" to update your local branch)
HEAD is now at 1265ebc Merge pull request #839 from juanvallejo/jvallejo/add-detail-other-svc-types
fatal: branch name required
~/jobs/test-customer-diagnostics/workspace
Origin repositories cloned into /var/lib/jenkins/jobs/test-customer-diagnostics/workspace
+ pushd origin
~/jobs/test-customer-diagnostics/workspace/origin ~/jobs/test-customer-diagnostics/workspace
+ INSTANCE_NAME=origin_crdt-centos7-14
+ GIT_URL=https://github.com/rhcarvalho/openshift-ansible
++ echo https://github.com/rhcarvalho/openshift-ansible
++ sed s,https://,,
+ OCRDT_LOCAL_PATH=github.com/rhcarvalho/openshift-ansible
+ CRDT_DIR=/data/src/github.com/rhcarvalho/openshift-ansible
+ env
+ sort
_=/bin/env
BUILD_CAUSE=REMOTECAUSE
BUILD_CAUSE_REMOTECAUSE=true
BUILD_DISPLAY_NAME=#14
BUILD_ID=14
BUILD_NUMBER=14
BUILD_TAG=jenkins-test-customer-diagnostics-14
BUILD_URL=https://ci.openshift.redhat.com/jenkins/job/test-customer-diagnostics/14/
CRDT_PULL_ID=7
EXECUTOR_NUMBER=36
GIT_BRANCH=pre-flight-checks
GITHUB_REPO=rhcarvalho
HOME=/var/lib/jenkins
HUDSON_COOKIE=ec23089c-3a09-41a7-b044-2c0fd0a49204
HUDSON_HOME=/var/lib/jenkins
HUDSON_SERVER_COOKIE=ec11f8b2841c966f
HUDSON_URL=https://ci.openshift.redhat.com/jenkins/
INSTANCE_TYPE=c4.xlarge
JENKINS_HOME=/var/lib/jenkins
JENKINS_SERVER_COOKIE=ec11f8b2841c966f
JENKINS_URL=https://ci.openshift.redhat.com/jenkins/
JOB_BASE_NAME=test-customer-diagnostics
JOB_NAME=test-customer-diagnostics
JOB_URL=https://ci.openshift.redhat.com/jenkins/job/test-customer-diagnostics/
LANG=en_US.UTF-8
LOGNAME=jenkins
MERGE=true
NLSPATH=/usr/dt/lib/nls/msg/%L/%N.cat
NODE_LABELS=master
NODE_NAME=master
OLDPWD=/var/lib/jenkins/jobs/test-customer-diagnostics/workspace
OS=centos7
OS_ROOT=/data/src/github.com/openshift/origin
PATH=/sbin:/usr/sbin:/bin:/usr/bin
PWD=/var/lib/jenkins/jobs/test-customer-diagnostics/workspace/origin
ROOT_BUILD_CAUSE=REMOTECAUSE
ROOT_BUILD_CAUSE_REMOTECAUSE=true
SHELL=/bin/bash
SHLVL=3
TESTNAME=crdt
USER=jenkins
WORKSPACE=/var/lib/jenkins/jobs/test-customer-diagnostics/workspace
XFILESEARCHPATH=/usr/dt/app-defaults/%L/Dt
+ vagrant origin-init --stage deps --os centos7 --instance-type c4.xlarge origin_crdt-centos7-14
Reading AWS credentials from /var/lib/jenkins/.awscred
Searching devenv-centos7-base_* for latest base AMI (required_name_tag=)
Found: ami-5e456949 (devenv-centos7-base_2503)
++ seq 0 2
+ for i in '$(seq 0 2)'
+ vagrant up --provider aws
Bringing machine 'openshiftdev' up with 'aws' provider...
==> openshiftdev: Warning! The AWS provider doesn't support any of the Vagrant
==> openshiftdev: high-level network configurations (`config.vm.network`). They
==> openshiftdev: will be silently ignored.
==> openshiftdev: Warning! You're launching this instance into a VPC without an
==> openshiftdev: elastic IP. Please verify you're properly connected to a VPN so
==> openshiftdev: you can access this machine, otherwise Vagrant will not be able
==> openshiftdev: to SSH into it.
==> openshiftdev: Launching an instance with the following settings...
==> openshiftdev:  -- Type: c4.xlarge
==> openshiftdev:  -- AMI: ami-5e456949
==> openshiftdev:  -- Region: us-east-1
==> openshiftdev:  -- Keypair: libra
==> openshiftdev:  -- Subnet ID: subnet-cf57c596
==> openshiftdev:  -- User Data: yes
==> openshiftdev:  -- User Data: 
==> openshiftdev: #cloud-config
==> openshiftdev: 
==> openshiftdev: growpart:
==> openshiftdev:   mode: auto
==> openshiftdev:   devices: ['/']
==> openshiftdev: runcmd:
==> openshiftdev: - [ sh, -xc, "sed -i s/^Defaults.*requiretty/#Defaults requiretty/g /etc/sudoers"]
==> openshiftdev:         
==> openshiftdev:  -- Block Device Mapping: [{"DeviceName"=>"/dev/sda1", "Ebs.VolumeSize"=>25, "Ebs.VolumeType"=>"gp2"}, {"DeviceName"=>"/dev/sdb", "Ebs.VolumeSize"=>25, "Ebs.VolumeType"=>"gp2"}]
==> openshiftdev:  -- Terminate On Shutdown: false
==> openshiftdev:  -- Monitoring: false
==> openshiftdev:  -- EBS optimized: false
==> openshiftdev:  -- Assigning a public IP address in a VPC: false
==> openshiftdev: Waiting for instance to become "ready"...
==> openshiftdev: Waiting for SSH to become available...
==> openshiftdev: Machine is booted and ready for use!
==> openshiftdev: Running provisioner: setup (shell)...
    openshiftdev: Running: /tmp/vagrant-shell20161209-1330-1s47vyg.sh
+ break
+ vagrant sync-customer-diagnostics -c -s
Running ssh/sudo command 'rm -rf /data/src/github.com/openshift/openshift-ansible-bare; 
' with timeout 14400. Attempt #0
Running ssh/sudo command 'mkdir -p /centos/.ssh;
mv /tmp/file20161209-3768-96k16l /centos/.ssh/config &&
chown centos:centos /centos/.ssh/config &&
chmod 0600 /centos/.ssh/config' with timeout 14400. Attempt #0
Running ssh/sudo command 'mkdir -p /data/src/github.com/openshift/' with timeout 14400. Attempt #0
Running ssh/sudo command 'mkdir -p /data/src/github.com/openshift/builder && chown -R centos:centos /data/src/github.com/openshift/' with timeout 14400. Attempt #0
Running ssh/sudo command 'set -e
rm -fr /data/src/github.com/openshift/openshift-ansible-bare;

if [ ! -d /data/src/github.com/openshift/openshift-ansible-bare ]; then
git clone --quiet --bare https://github.com/openshift/openshift-ansible.git /data/src/github.com/openshift/openshift-ansible-bare >/dev/null
fi
' with timeout 14400. Attempt #0
Synchronizing local sources
Synchronizing [openshift-ansible@pre-flight-checks] from openshift-ansible...
Warning: Permanently added '54.147.194.77' (ECDSA) to the list of known hosts.
Running ssh/sudo command 'set -e

if [ -d /data/src/github.com/openshift/openshift-ansible-bare ]; then
rm -rf /data/src/github.com/openshift/openshift-ansible
echo 'Cloning openshift-ansible ...'
git clone --quiet --recurse-submodules /data/src/github.com/openshift/openshift-ansible-bare /data/src/github.com/openshift/openshift-ansible

else
MISSING_REPO+='openshift-ansible-bare'
fi

if [ -n "$MISSING_REPO" ]; then
echo 'Missing required upstream repositories:'
echo $MISSING_REPO
echo 'To fix, execute command: vagrant clone-upstream-repos'
fi
' with timeout 14400. Attempt #0
Cloning openshift-ansible ...
+ vagrant ssh -c 'sudo yum install -y ansible python-docker-py pyOpenSSL'
Loaded plugins: fastestmirror
http://mirror.es.its.nyu.edu/epel/7/x86_64/repodata/d6e4b781ff69ea32a354dcefe700f0b9e77985e511348f7ec883518ab84cb0ea-updateinfo.xml.bz2: [Errno 14] HTTP Error 404 - Not Found
Trying other mirror.
To address this issue please refer to the below knowledge base article 

https://access.redhat.com/articles/1320623

If above article doesn't help to resolve this issue please create a bug on https://bugs.centos.org/

Determining fastest mirrors
 * base: mirror.vcu.edu
 * epel: mirror.symnds.com
 * extras: mirrors.advancedhosters.com
 * updates: mirror.atlanticmetro.net
Resolving Dependencies
--> Running transaction check
---> Package ansible.noarch 0:2.2.0.0-4.el7 will be installed
--> Processing Dependency: sshpass for package: ansible-2.2.0.0-4.el7.noarch
--> Processing Dependency: python-paramiko for package: ansible-2.2.0.0-4.el7.noarch
--> Processing Dependency: python-keyczar for package: ansible-2.2.0.0-4.el7.noarch
--> Processing Dependency: python-jinja2 for package: ansible-2.2.0.0-4.el7.noarch
--> Processing Dependency: python-httplib2 for package: ansible-2.2.0.0-4.el7.noarch
---> Package pyOpenSSL.x86_64 0:0.13.1-3.el7 will be installed
---> Package python-docker-py.noarch 0:1.7.2-1.el7 will be installed
--> Processing Dependency: python-websocket-client >= 0.32.0 for package: python-docker-py-1.7.2-1.el7.noarch
--> Running transaction check
---> Package python-httplib2.noarch 0:0.7.7-3.el7 will be installed
---> Package python-jinja2.noarch 0:2.7.2-2.el7 will be installed
--> Processing Dependency: python-babel >= 0.8 for package: python-jinja2-2.7.2-2.el7.noarch
--> Processing Dependency: python-markupsafe for package: python-jinja2-2.7.2-2.el7.noarch
---> Package python-keyczar.noarch 0:0.71c-2.el7 will be installed
--> Processing Dependency: python-crypto for package: python-keyczar-0.71c-2.el7.noarch
---> Package python-websocket-client.noarch 0:0.32.0-116.el7 will be installed
---> Package python2-paramiko.noarch 0:1.16.1-1.el7 will be installed
--> Processing Dependency: python2-ecdsa for package: python2-paramiko-1.16.1-1.el7.noarch
---> Package sshpass.x86_64 0:1.05-5.el7 will be installed
--> Running transaction check
---> Package python-babel.noarch 0:0.9.6-8.el7 will be installed
---> Package python-markupsafe.x86_64 0:0.11-10.el7 will be installed
---> Package python2-crypto.x86_64 0:2.6.1-10.el7 will be installed
--> Processing Dependency: libtomcrypt.so.0()(64bit) for package: python2-crypto-2.6.1-10.el7.x86_64
---> Package python2-ecdsa.noarch 0:0.13-4.el7 will be installed
--> Running transaction check
---> Package libtomcrypt.x86_64 0:1.17-23.el7 will be installed
--> Processing Dependency: libtommath >= 0.42.0 for package: libtomcrypt-1.17-23.el7.x86_64
--> Processing Dependency: libtommath.so.0()(64bit) for package: libtomcrypt-1.17-23.el7.x86_64
--> Running transaction check
---> Package libtommath.x86_64 0:0.42.0-4.el7 will be installed
--> Finished Dependency Resolution

Dependencies Resolved

================================================================================
 Package                      Arch        Version             Repository   Size
================================================================================
Installing:
 ansible                      noarch      2.2.0.0-4.el7       epel        4.6 M
 pyOpenSSL                    x86_64      0.13.1-3.el7        base        133 k
 python-docker-py             noarch      1.7.2-1.el7         extras       77 k
Installing for dependencies:
 libtomcrypt                  x86_64      1.17-23.el7         epel        224 k
 libtommath                   x86_64      0.42.0-4.el7        epel         35 k
 python-babel                 noarch      0.9.6-8.el7         base        1.4 M
 python-httplib2              noarch      0.7.7-3.el7         epel         70 k
 python-jinja2                noarch      2.7.2-2.el7         base        515 k
 python-keyczar               noarch      0.71c-2.el7         epel        218 k
 python-markupsafe            x86_64      0.11-10.el7         base         25 k
 python-websocket-client      noarch      0.32.0-116.el7      extras       56 k
 python2-crypto               x86_64      2.6.1-10.el7        epel        475 k
 python2-ecdsa                noarch      0.13-4.el7          epel         83 k
 python2-paramiko             noarch      1.16.1-1.el7        epel        257 k
 sshpass                      x86_64      1.05-5.el7          epel         21 k

Transaction Summary
================================================================================
Install  3 Packages (+12 Dependent packages)

Total download size: 8.1 M
Installed size: 36 M
Downloading packages:
--------------------------------------------------------------------------------
Total                                              3.1 MB/s | 8.1 MB  00:02     
Running transaction check
Running transaction test
Transaction test succeeded
Running transaction
  Installing : sshpass-1.05-5.el7.x86_64                                   1/15 
  Installing : python-babel-0.9.6-8.el7.noarch                             2/15 
  Installing : python-websocket-client-0.32.0-116.el7.noarch               3/15 
  Installing : libtommath-0.42.0-4.el7.x86_64                              4/15 
  Installing : libtomcrypt-1.17-23.el7.x86_64                              5/15 
  Installing : python2-crypto-2.6.1-10.el7.x86_64                          6/15 
  Installing : python-keyczar-0.71c-2.el7.noarch                           7/15 
  Installing : python2-ecdsa-0.13-4.el7.noarch                             8/15 
  Installing : python2-paramiko-1.16.1-1.el7.noarch                        9/15 
  Installing : python-httplib2-0.7.7-3.el7.noarch                         10/15 
  Installing : python-markupsafe-0.11-10.el7.x86_64                       11/15 
  Installing : python-jinja2-2.7.2-2.el7.noarch                           12/15 
  Installing : ansible-2.2.0.0-4.el7.noarch                               13/15 
  Installing : python-docker-py-1.7.2-1.el7.noarch                        14/15 
  Installing : pyOpenSSL-0.13.1-3.el7.x86_64                              15/15 
  Verifying  : python-keyczar-0.71c-2.el7.noarch                           1/15 
  Verifying  : python-markupsafe-0.11-10.el7.x86_64                        2/15 
  Verifying  : python-jinja2-2.7.2-2.el7.noarch                            3/15 
  Verifying  : pyOpenSSL-0.13.1-3.el7.x86_64                               4/15 
  Verifying  : python-httplib2-0.7.7-3.el7.noarch                          5/15 
  Verifying  : python2-ecdsa-0.13-4.el7.noarch                             6/15 
  Verifying  : libtomcrypt-1.17-23.el7.x86_64                              7/15 
  Verifying  : ansible-2.2.0.0-4.el7.noarch                                8/15 
  Verifying  : libtommath-0.42.0-4.el7.x86_64                              9/15 
  Verifying  : python-websocket-client-0.32.0-116.el7.noarch              10/15 
  Verifying  : python-docker-py-1.7.2-1.el7.noarch                        11/15 
  Verifying  : python2-crypto-2.6.1-10.el7.x86_64                         12/15 
  Verifying  : python-babel-0.9.6-8.el7.noarch                            13/15 
  Verifying  : python2-paramiko-1.16.1-1.el7.noarch                       14/15 
  Verifying  : sshpass-1.05-5.el7.x86_64                                  15/15 

Installed:
  ansible.noarch 0:2.2.0.0-4.el7            pyOpenSSL.x86_64 0:0.13.1-3.el7    
  python-docker-py.noarch 0:1.7.2-1.el7    

Dependency Installed:
  libtomcrypt.x86_64 0:1.17-23.el7                                              
  libtommath.x86_64 0:0.42.0-4.el7                                              
  python-babel.noarch 0:0.9.6-8.el7                                             
  python-httplib2.noarch 0:0.7.7-3.el7                                          
  python-jinja2.noarch 0:2.7.2-2.el7                                            
  python-keyczar.noarch 0:0.71c-2.el7                                           
  python-markupsafe.x86_64 0:0.11-10.el7                                        
  python-websocket-client.noarch 0:0.32.0-116.el7                               
  python2-crypto.x86_64 0:2.6.1-10.el7                                          
  python2-ecdsa.noarch 0:0.13-4.el7                                             
  python2-paramiko.noarch 0:1.16.1-1.el7                                        
  sshpass.x86_64 0:1.05-5.el7                                                   

Complete!
+ vagrant ssh -c 'if [ ! -d /tmp/openshift ] ; then mkdir /tmp/openshift ; fi ; sudo chmod 777 /tmp/openshift'
+ vagrant test-customer-diagnostics
***************************************************
Running make test-integration...
# TODO: remove `sudo` when the CI environment can run docker CLI commads without it.
sudo go test -v ./test/integration/...
 [WARNING]: provided hosts list is empty, only localhost is available


PLAY [localhost] ***************************************************************

TASK [setup] *******************************************************************
ok: [localhost]

TASK [build and tag image] *****************************************************
changed: [localhost]

PLAY RECAP *********************************************************************
localhost                  : ok=2    changed=1    unreachable=0    failed=0   

=== RUN   TestBYOCentOS7
=== RUN   TestCallbackPlugin
=== RUN   TestPing
=== RUN   TestFail
=== RUN   TestInstallMissingRequired
=== RUN   TestUpgradeDependencyMissing
=== RUN   TestYumRepoBroken
=== RUN   TestYumRepoDisabled
=== RUN   TestYumRepoUnreachable
=== RUN   TestCorrectAosVersion
=== RUN   TestIncorrectAosVersion
=== RUN   TestMultipleAosVersion
--- PASS: TestFail (0.46s)
--- PASS: TestCallbackPlugin (0.52s)
--- PASS: TestPing (0.78s)
--- PASS: TestInstallMissingRequired (7.53s)
--- PASS: TestUpgradeDependencyMissing (10.99s)
--- PASS: TestYumRepoBroken (11.10s)
--- FAIL: TestYumRepoDisabled (7.93s)
	preflight_test.go:115: got exit code 2, want 0
	preflight_test.go:133: 
		$ (cd /data/src/github.com/openshift/openshift-ansible/test/integration/preflight && ansible-playbook yum_content/test-yum-repo-disabled.yml)
		...
		
		TASK [test should succeed; nothing blocks a yum update] ************************
		ok: [localhost -> check-yum-update-repo-disabled]
		
		TASK [delete test container] ***************************************************
		fatal: [localhost]: FAILED! => {"changed": false, "failed": true, "msg": "Error removing container 8a79b3fa5614db573f3b01aa399c776570dda5c18173023cb13fe2b4d9a0a750: 500 Server Error: Internal Server Error (\"Unable to remove filesystem for 8a79b3fa5614db573f3b01aa399c776570dda5c18173023cb13fe2b4d9a0a750: remove /var/lib/docker/containers/8a79b3fa5614db573f3b01aa399c776570dda5c18173023cb13fe2b4d9a0a750/shm: device or resource busy\")"}
			to retry, use: --limit @/data/src/github.com/openshift/openshift-ansible/test/integration/preflight/yum_content/test-yum-repo-disabled.retry
		
		PLAY RECAP *********************************************************************
		localhost                  : ok=4    changed=1    unreachable=0    failed=1   
--- PASS: TestYumRepoUnreachable (9.83s)
--- PASS: TestCorrectAosVersion (10.16s)
--- PASS: TestIncorrectAosVersion (8.63s)
--- PASS: TestBYOCentOS7 (27.21s)
--- PASS: TestMultipleAosVersion (7.57s)
FAIL
exit status 1
FAIL	_/data/src/github.com/openshift/openshift-ansible/test/integration/preflight	202.596s
make: *** [test-integration] Error 1
Error while running ssh/sudo command: 
set -e
pushd /data/src/github.com/openshift//openshift-ansible/ >/dev/null
export PATH=$GOPATH/bin:$PATH

echo '***************************************************'
echo 'Running make test-integration...'
time make test-integration
echo 'Finished make test-integration'
echo '***************************************************'

popd >/dev/null
        
The SSH command responded with a non-zero exit status. Vagrant
assumes that this means the command failed. The output for this command
should be in the log above. Please read the output to determine what
went wrong.
Build step 'Execute shell' marked build as failure
Publish artifacts to S3 Bucket Build is still running
Publish artifacts to S3 Bucket Using S3 profile: Jenkins-AWS
Publish artifacts to S3 Bucket No file(s) found: origin/artifacts/**
Publish artifacts to S3 Bucket ‘origin/artifacts/**’ doesn’t match anything, but ‘**’ does. Perhaps that’s what you mean?
[description-setter] Could not determine description.
[PostBuildScript] - Execution post build scripts.
[workspace] $ /bin/sh -xe /tmp/hudson5617761710455949216.sh
+ INSTANCE_NAME=origin_crdt-centos7-14
+ pushd origin
~/jobs/test-customer-diagnostics/workspace/origin ~/jobs/test-customer-diagnostics/workspace
+ '[' -f .vagrant-openshift.json ']'
+ /usr/bin/vagrant destroy -f
==> openshiftdev: Terminating the instance...
==> openshiftdev: Running cleanup tasks for 'shell' provisioner...
+ popd
~/jobs/test-customer-diagnostics/workspace
[BFA] Scanning build for known causes...
[BFA] Found failure cause(s):
[BFA] Unit or Integration Test Failed
[BFA] Done. 0s
Finished: FAILURE