Console Output

Started by remote host 50.17.198.52
[EnvInject] - Loading node environment variables.
Building in workspace /var/lib/jenkins/jobs/test-openshift-restclient-java/workspace
[workspace] $ /bin/sh -xe /tmp/jenkins5561284940925909633.sh
+ export JAVA_HOME=/usr/lib/jvm/java-1.8.0
+ JAVA_HOME=/usr/lib/jvm/java-1.8.0
+ export MAVEN_HOME=/usr/share/maven
+ MAVEN_HOME=/usr/share/maven
+ /usr/share/maven/bin/mvn -version
Apache Maven 3.0.5 (Red Hat 3.0.5-17)
Maven home: /usr/share/maven
Java version: 1.8.0_151, vendor: Oracle Corporation
Java home: /usr/lib/jvm/java-1.8.0-openjdk-1.8.0.151-5.b12.el7_4.x86_64/jre
Default locale: en_US, platform encoding: UTF-8
OS name: "linux", version: "3.10.0-693.11.6.el7.x86_64", arch: "amd64", family: "unix"
+ PROJECT_NAME=openshift-restclient-java
+ rm -rf openshift-restclient-java
+ git clone git@github.com:openshift/openshift-restclient-java.git
Cloning into 'openshift-restclient-java'...
+ '[' -n 350 ']'
+ set +x


*****Locally Merging Pull Request: https://github.com/openshift/openshift-restclient-java/pull/350
+ test_pull_requests --local_merge_pull_request 350 --repo openshift-restclient-java --config /var/lib/jenkins/.test_pull_requests_java_client.json
WARNING: Cache won't persist between runs.
  *** Starting with empty cache
Rate limit remaining: 4946
  Checking if current base repo commit ID matches what we expect
Local merging pull request #350 for repo 'openshift-restclient-java' against base repo commit id 1939942e913164e17aa3a29cc333c9b53ee4b8e1 from pr branch commit id a974a6d1c3881f98873c86f3c295e65703cf70d5
+ pushd openshift-restclient-java
+ git checkout master
Already on 'master'
+ git checkout -b tpr_issue-348_jeffmaury
Switched to a new branch 'tpr_issue-348_jeffmaury'
+ git pull git@github.com:jeffmaury/openshift-restclient-java.git issue-348
From github.com:jeffmaury/openshift-restclient-java
 * branch            issue-348  -> FETCH_HEAD
+ git pull git@github.com:jeffmaury/openshift-restclient-java.git issue-348 --tags
From github.com:jeffmaury/openshift-restclient-java
 * branch            issue-348  -> FETCH_HEAD
 * [new tag]         remove     -> remove
+ git checkout master
Switched to branch 'master'
+ git merge tpr_issue-348_jeffmaury
+ git submodule update --recursive
+ popd

Rate limit resets in: 2684s, at 2018-09-18T13:00:01-04:00 (1537290001)
Rate limit remaining: 4942; delta: 4
Rate limit is not too low.
Would run.
Cache stats: Hits: 0, Misses: 4, Bypass: 0
      (raw): [:fresh, 0, :invalid, 0, :miss, 4, :unacceptable, 0, :valid, 0]

Done
~/jobs/test-openshift-restclient-java/workspace/openshift-restclient-java ~/jobs/test-openshift-restclient-java/workspace
Updating 1939942..a974a6d
Fast-forward
 pom.xml                                            |  7 +---
 .../restclient/api/capabilities/PodExec.java       | 48 +++++++++++++---------
 .../capability/resources/PodLogRetrievalAsync.java | 31 +++++++-------
 .../restclient/okhttp/OpenShiftAuthenticator.java  |  4 +-
 .../internal/restclient/okhttp/WatchClient.java    | 40 +++++-------------
 .../restclient/okhttp/WebSocketAdapter.java        | 48 ----------------------
 .../restclient/api/capabilities/IPodExec.java      |  7 ++--
 .../resources/IPodLogRetrievalAsync.java           |  7 ++--
 .../internal/restclient/TypeMapperFixture.java     |  4 +-
 .../api/capabilities/PodExecIntegrationTest.java   | 16 ++++----
 .../restclient/api/capabilities/PodExecTest.java   |  9 ++--
 .../PodLogRetrievalAsyncIntegrationTest.java       |  7 ++--
 .../resources/PodLogRetrievalAsyncTest.java        |  9 ++--
 .../restclient/okhttp/WatchClientTest.java         |  8 ++--
 14 files changed, 91 insertions(+), 154 deletions(-)
 delete mode 100644 src/main/java/com/openshift/internal/restclient/okhttp/WebSocketAdapter.java
Already up-to-date.
Updating 1939942..a974a6d
Fast-forward
 pom.xml                                            |  7 +---
 .../restclient/api/capabilities/PodExec.java       | 48 +++++++++++++---------
 .../capability/resources/PodLogRetrievalAsync.java | 31 +++++++-------
 .../restclient/okhttp/OpenShiftAuthenticator.java  |  4 +-
 .../internal/restclient/okhttp/WatchClient.java    | 40 +++++-------------
 .../restclient/okhttp/WebSocketAdapter.java        | 48 ----------------------
 .../restclient/api/capabilities/IPodExec.java      |  7 ++--
 .../resources/IPodLogRetrievalAsync.java           |  7 ++--
 .../internal/restclient/TypeMapperFixture.java     |  4 +-
 .../api/capabilities/PodExecIntegrationTest.java   | 16 ++++----
 .../restclient/api/capabilities/PodExecTest.java   |  9 ++--
 .../PodLogRetrievalAsyncIntegrationTest.java       |  7 ++--
 .../resources/PodLogRetrievalAsyncTest.java        |  9 ++--
 .../restclient/okhttp/WatchClientTest.java         |  8 ++--
 14 files changed, 91 insertions(+), 154 deletions(-)
 delete mode 100644 src/main/java/com/openshift/internal/restclient/okhttp/WebSocketAdapter.java
~/jobs/test-openshift-restclient-java/workspace
+ set +x



+ pushd openshift-restclient-java
~/jobs/test-openshift-restclient-java/workspace/openshift-restclient-java ~/jobs/test-openshift-restclient-java/workspace
+ set +e
+ /usr/share/maven/bin/mvn clean package verify
[INFO] Scanning for projects...
[INFO]                                                                         
[INFO] ------------------------------------------------------------------------
[INFO] Building OpenShift Java REST Client 6.1.3-SNAPSHOT
[INFO] ------------------------------------------------------------------------
Downloading: https://repo.maven.apache.org/maven2/com/squareup/okhttp3/okhttp/3.11.0/okhttp-3.11.0.pom
3/3 KB   
3/3 KB   
         
Downloaded: https://repo.maven.apache.org/maven2/com/squareup/okhttp3/okhttp/3.11.0/okhttp-3.11.0.pom (3 KB at 8.1 KB/sec)
Downloading: https://repo.maven.apache.org/maven2/com/squareup/okhttp3/parent/3.11.0/parent-3.11.0.pom
3/20 KB   
5/20 KB   
8/20 KB   
11/20 KB   
13/20 KB   
16/20 KB   
19/20 KB   
20/20 KB   
           
Downloaded: https://repo.maven.apache.org/maven2/com/squareup/okhttp3/parent/3.11.0/parent-3.11.0.pom (20 KB at 1126.6 KB/sec)
Downloading: https://repo.maven.apache.org/maven2/com/squareup/okio/okio/1.14.0/okio-1.14.0.pom
2/2 KB     
         
Downloaded: https://repo.maven.apache.org/maven2/com/squareup/okio/okio/1.14.0/okio-1.14.0.pom (2 KB at 215.1 KB/sec)
Downloading: https://repo.maven.apache.org/maven2/com/squareup/okio/okio-parent/1.14.0/okio-parent-1.14.0.pom
3/5 KB   
5/5 KB   
         
Downloaded: https://repo.maven.apache.org/maven2/com/squareup/okio/okio-parent/1.14.0/okio-parent-1.14.0.pom (5 KB at 395.8 KB/sec)
Downloading: https://repo.maven.apache.org/maven2/com/squareup/okhttp3/okhttp/3.11.0/okhttp-3.11.0.jar
Downloading: https://repo.maven.apache.org/maven2/com/squareup/okio/okio/1.14.0/okio-1.14.0.jar
3/404 KB   
5/404 KB   
8/404 KB   
8/404 KB   3/84 KB   
11/404 KB   3/84 KB   
11/404 KB   6/84 KB   
13/404 KB   6/84 KB   
13/404 KB   9/84 KB   
16/404 KB   9/84 KB   
16/404 KB   11/84 KB   
19/404 KB   11/84 KB   
19/404 KB   14/84 KB   
19/404 KB   16/84 KB   
21/404 KB   16/84 KB   
21/404 KB   19/84 KB   
24/404 KB   19/84 KB   
24/404 KB   22/84 KB   
27/404 KB   22/84 KB   
27/404 KB   25/84 KB   
29/404 KB   25/84 KB   
29/404 KB   27/84 KB   
32/404 KB   27/84 KB   
32/404 KB   30/84 KB   
32/404 KB   32/84 KB   
36/404 KB   32/84 KB   
40/404 KB   32/84 KB   
44/404 KB   32/84 KB   
44/404 KB   36/84 KB   
48/404 KB   36/84 KB   
48/404 KB   40/84 KB   
48/404 KB   44/84 KB   
48/404 KB   48/84 KB   
52/404 KB   48/84 KB   
56/404 KB   48/84 KB   
60/404 KB   48/84 KB   
60/404 KB   52/84 KB   
64/404 KB   52/84 KB   
64/404 KB   56/84 KB   
64/404 KB   60/84 KB   
64/404 KB   64/84 KB   
68/404 KB   64/84 KB   
72/404 KB   64/84 KB   
76/404 KB   64/84 KB   
76/404 KB   68/84 KB   
80/404 KB   68/84 KB   
80/404 KB   72/84 KB   
80/404 KB   76/84 KB   
80/404 KB   80/84 KB   
80/404 KB   84/84 KB   
84/404 KB   84/84 KB   
88/404 KB   84/84 KB   
92/404 KB   84/84 KB   
96/404 KB   84/84 KB   
100/404 KB   84/84 KB   
104/404 KB   84/84 KB   
108/404 KB   84/84 KB   
112/404 KB   84/84 KB   
116/404 KB   84/84 KB   
120/404 KB   84/84 KB   
124/404 KB   84/84 KB   
128/404 KB   84/84 KB   
                        
132/404 KB              
Downloaded: https://repo.maven.apache.org/maven2/com/squareup/okio/okio/1.14.0/okio-1.14.0.jar (84 KB at 3221.0 KB/sec)
136/404 KB   
140/404 KB   
144/404 KB   
148/404 KB   
152/404 KB   
156/404 KB   
160/404 KB   
164/404 KB   
168/404 KB   
172/404 KB   
176/404 KB   
180/404 KB   
184/404 KB   
188/404 KB   
192/404 KB   
196/404 KB   
200/404 KB   
204/404 KB   
208/404 KB   
212/404 KB   
216/404 KB   
220/404 KB   
224/404 KB   
228/404 KB   
232/404 KB   
236/404 KB   
240/404 KB   
244/404 KB   
248/404 KB   
252/404 KB   
256/404 KB   
260/404 KB   
264/404 KB   
268/404 KB   
272/404 KB   
276/404 KB   
280/404 KB   
284/404 KB   
288/404 KB   
292/404 KB   
296/404 KB   
300/404 KB   
304/404 KB   
308/404 KB   
312/404 KB   
316/404 KB   
320/404 KB   
324/404 KB   
328/404 KB   
332/404 KB   
336/404 KB   
340/404 KB   
344/404 KB   
348/404 KB   
352/404 KB   
356/404 KB   
360/404 KB   
364/404 KB   
368/404 KB   
372/404 KB   
376/404 KB   
380/404 KB   
384/404 KB   
388/404 KB   
392/404 KB   
396/404 KB   
400/404 KB   
404/404 KB   
404/404 KB   
             
Downloaded: https://repo.maven.apache.org/maven2/com/squareup/okhttp3/okhttp/3.11.0/okhttp-3.11.0.jar (404 KB at 7920.5 KB/sec)
[INFO] 
[INFO] --- maven-clean-plugin:2.4.1:clean (default-clean) @ openshift-restclient-java ---
[INFO] 
[INFO] --- maven-enforcer-plugin:3.0.0-M1:enforce (enforce-java-version) @ openshift-restclient-java ---
[INFO] 
[INFO] --- maven-enforcer-plugin:3.0.0-M1:enforce (enforce-maven-version) @ openshift-restclient-java ---
[INFO] 
[INFO] --- properties-maven-plugin:1.0-alpha-1:read-project-properties (default) @ openshift-restclient-java ---
[INFO] 
[INFO] --- maven-resources-plugin:2.5:resources (default-resources) @ openshift-restclient-java ---
[debug] execute contextualize
[INFO] Using 'UTF-8' encoding to copy filtered resources.
[INFO] skip non existing resourceDirectory /var/lib/jenkins/jobs/test-openshift-restclient-java/workspace/openshift-restclient-java/src/main/resources
[INFO] 
[INFO] --- maven-compiler-plugin:2.3.1:compile (default-compile) @ openshift-restclient-java ---
[INFO] Compiling 296 source files to /var/lib/jenkins/jobs/test-openshift-restclient-java/workspace/openshift-restclient-java/target/classes
[WARNING] /var/lib/jenkins/jobs/test-openshift-restclient-java/workspace/openshift-restclient-java/src/main/java/com/openshift/restclient/model/IContainer.java:[21,44] [deprecation] IVolume in com.openshift.restclient.model.volume has been deprecated

[WARNING] /var/lib/jenkins/jobs/test-openshift-restclient-java/workspace/openshift-restclient-java/src/main/java/com/openshift/restclient/model/image/ITagReference.java:[14,37] [deprecation] Annotatable in com.openshift.restclient.model has been deprecated

[WARNING] /var/lib/jenkins/jobs/test-openshift-restclient-java/workspace/openshift-restclient-java/src/main/java/com/openshift/internal/restclient/model/volume/VolumeMount.java:[24,44] [deprecation] IVolume in com.openshift.restclient.model.volume has been deprecated

[WARNING] /var/lib/jenkins/jobs/test-openshift-restclient-java/workspace/openshift-restclient-java/src/main/java/com/openshift/internal/restclient/model/volume/AbstractVolume.java:[24,44] [deprecation] IVolume in com.openshift.restclient.model.volume has been deprecated

[WARNING] /var/lib/jenkins/jobs/test-openshift-restclient-java/workspace/openshift-restclient-java/src/main/java/com/openshift/internal/restclient/model/volume/EmptyDirVolume.java:[16,44] [deprecation] IVolume in com.openshift.restclient.model.volume has been deprecated

[WARNING] /var/lib/jenkins/jobs/test-openshift-restclient-java/workspace/openshift-restclient-java/src/main/java/com/openshift/internal/restclient/model/Container.java:[40,44] [deprecation] IVolume in com.openshift.restclient.model.volume has been deprecated

[WARNING] /var/lib/jenkins/jobs/test-openshift-restclient-java/workspace/openshift-restclient-java/src/main/java/com/openshift/restclient/model/IResource.java:[25,45] [deprecation] Annotatable in com.openshift.restclient.model has been deprecated

[WARNING] /var/lib/jenkins/jobs/test-openshift-restclient-java/workspace/openshift-restclient-java/src/main/java/com/openshift/restclient/model/image/ITagReference.java:[17,39] [deprecation] Annotatable in com.openshift.restclient.model has been deprecated

[WARNING] /var/lib/jenkins/jobs/test-openshift-restclient-java/workspace/openshift-restclient-java/src/main/java/com/openshift/internal/restclient/model/volume/VolumeMount.java:[27,75] [deprecation] IVolume in com.openshift.restclient.model.volume has been deprecated

[WARNING] /var/lib/jenkins/jobs/test-openshift-restclient-java/workspace/openshift-restclient-java/src/main/java/com/openshift/internal/restclient/model/volume/AbstractVolume.java:[26,73] [deprecation] IVolume in com.openshift.restclient.model.volume has been deprecated

[WARNING] /var/lib/jenkins/jobs/test-openshift-restclient-java/workspace/openshift-restclient-java/src/main/java/com/openshift/internal/restclient/model/Build.java:[69,18] [deprecation] getPodName() in IBuild has been deprecated

[WARNING] /var/lib/jenkins/jobs/test-openshift-restclient-java/workspace/openshift-restclient-java/src/main/java/com/openshift/internal/restclient/model/image/ImageStreamImport.java:[73,18] [deprecation] getImageJsonFor(DockerImageURI) in IImageStreamImport has been deprecated

[WARNING] /var/lib/jenkins/jobs/test-openshift-restclient-java/workspace/openshift-restclient-java/src/main/java/com/openshift/internal/restclient/model/volume/EmptyDirVolume.java:[20,42] [deprecation] IVolume in com.openshift.restclient.model.volume has been deprecated

[WARNING] /var/lib/jenkins/jobs/test-openshift-restclient-java/workspace/openshift-restclient-java/src/main/java/com/openshift/internal/restclient/model/Container.java:[207,24] [deprecation] getVolumes() in IContainer has been deprecated

[WARNING] /var/lib/jenkins/jobs/test-openshift-restclient-java/workspace/openshift-restclient-java/src/main/java/com/openshift/internal/restclient/model/Container.java:[198,16] [deprecation] setVolumes(Set<IVolume>) in IContainer has been deprecated

[WARNING] /var/lib/jenkins/jobs/test-openshift-restclient-java/workspace/openshift-restclient-java/src/main/java/com/openshift/internal/restclient/model/Container.java:[198,31] [deprecation] IVolume in com.openshift.restclient.model.volume has been deprecated

[WARNING] /var/lib/jenkins/jobs/test-openshift-restclient-java/workspace/openshift-restclient-java/src/main/java/com/openshift/internal/restclient/model/Container.java:[201,13] [deprecation] IVolume in com.openshift.restclient.model.volume has been deprecated

[WARNING] /var/lib/jenkins/jobs/test-openshift-restclient-java/workspace/openshift-restclient-java/src/main/java/com/openshift/internal/restclient/model/Container.java:[207,15] [deprecation] IVolume in com.openshift.restclient.model.volume has been deprecated

[WARNING] /var/lib/jenkins/jobs/test-openshift-restclient-java/workspace/openshift-restclient-java/src/main/java/com/openshift/internal/restclient/model/Container.java:[208,12] [deprecation] IVolume in com.openshift.restclient.model.volume has been deprecated

[INFO] 
[INFO] --- maven-resources-plugin:2.5:testResources (default-testResources) @ openshift-restclient-java ---
[debug] execute contextualize
[INFO] Using 'UTF-8' encoding to copy filtered resources.
[INFO] Copying 48 resources
[INFO] 
[INFO] --- maven-compiler-plugin:2.3.1:testCompile (default-testCompile) @ openshift-restclient-java ---
[INFO] Compiling 112 source files to /var/lib/jenkins/jobs/test-openshift-restclient-java/workspace/openshift-restclient-java/target/test-classes
[WARNING] /var/lib/jenkins/jobs/test-openshift-restclient-java/workspace/openshift-restclient-java/src/test/java/com/openshift/internal/restclient/model/v1/ReplicationControllerTest.java:[55,44] [deprecation] IVolume in com.openshift.restclient.model.volume has been deprecated

[WARNING] /var/lib/jenkins/jobs/test-openshift-restclient-java/workspace/openshift-restclient-java/src/test/java/com/openshift/internal/restclient/model/v1/ReplicationControllerTest.java:[262,41] [deprecation] getVolumes() in IContainer has been deprecated

[WARNING] /var/lib/jenkins/jobs/test-openshift-restclient-java/workspace/openshift-restclient-java/src/test/java/com/openshift/internal/restclient/model/v1/ReplicationControllerTest.java:[262,68] [deprecation] IVolume in com.openshift.restclient.model.volume has been deprecated

[WARNING] /var/lib/jenkins/jobs/test-openshift-restclient-java/workspace/openshift-restclient-java/src/test/java/com/openshift/internal/restclient/model/v1/ServiceTest.java:[50,45] [deprecation] getPortalIP() in IService has been deprecated

[WARNING] /var/lib/jenkins/jobs/test-openshift-restclient-java/workspace/openshift-restclient-java/src/test/java/com/openshift/internal/restclient/APIModelVersionTest.java:[25,83] [deprecation] v1beta3 in OpenShiftAPIVersion has been deprecated

[WARNING] /var/lib/jenkins/jobs/test-openshift-restclient-java/workspace/openshift-restclient-java/src/test/java/com/openshift/internal/restclient/ResourceFactoryTest.java:[45,51] [deprecation] CONFIG in ResourceKind has been deprecated

[WARNING] /var/lib/jenkins/jobs/test-openshift-restclient-java/workspace/openshift-restclient-java/src/test/java/com/openshift/internal/restclient/ResourceFactoryTest.java:[46,50] [deprecation] v1beta3 in OpenShiftAPIVersion has been deprecated

[WARNING] /var/lib/jenkins/jobs/test-openshift-restclient-java/workspace/openshift-restclient-java/src/test/java/com/openshift/internal/restclient/model/properties/ResourcePropertiesRegistryTest.java:[39,98] [deprecation] v1beta3 in KubernetesAPIVersion has been deprecated

[WARNING] /var/lib/jenkins/jobs/test-openshift-restclient-java/workspace/openshift-restclient-java/src/test/java/com/openshift/internal/restclient/model/properties/ResourcePropertiesRegistryTest.java:[46,102] [deprecation] v1beta3 in KubernetesAPIVersion has been deprecated

[WARNING] /var/lib/jenkins/jobs/test-openshift-restclient-java/workspace/openshift-restclient-java/src/test/java/com/openshift/internal/restclient/model/properties/ResourcePropertiesRegistryTest.java:[48,73] [deprecation] v1beta3 in KubernetesAPIVersion has been deprecated

[WARNING] /var/lib/jenkins/jobs/test-openshift-restclient-java/workspace/openshift-restclient-java/src/test/java/com/openshift/internal/restclient/model/properties/ResourcePropertiesRegistryTest.java:[50,41] [deprecation] v1beta3 in KubernetesAPIVersion has been deprecated

[WARNING] /var/lib/jenkins/jobs/test-openshift-restclient-java/workspace/openshift-restclient-java/src/test/java/com/openshift/internal/restclient/model/properties/ResourcePropertiesRegistryTest.java:[56,98] [deprecation] v1beta3 in KubernetesAPIVersion has been deprecated

[WARNING] /var/lib/jenkins/jobs/test-openshift-restclient-java/workspace/openshift-restclient-java/src/test/java/com/openshift/internal/restclient/model/properties/ResourcePropertiesRegistryTest.java:[58,77] [deprecation] v1beta3 in KubernetesAPIVersion has been deprecated

[WARNING] /var/lib/jenkins/jobs/test-openshift-restclient-java/workspace/openshift-restclient-java/src/test/java/com/openshift/internal/restclient/model/properties/ResourcePropertiesRegistryTest.java:[60,41] [deprecation] v1beta3 in KubernetesAPIVersion has been deprecated

[WARNING] /var/lib/jenkins/jobs/test-openshift-restclient-java/workspace/openshift-restclient-java/src/test/java/com/openshift/internal/restclient/model/properties/ResourcePropertiesRegistryTest.java:[66,95] [deprecation] v1beta3 in OpenShiftAPIVersion has been deprecated

[WARNING] /var/lib/jenkins/jobs/test-openshift-restclient-java/workspace/openshift-restclient-java/src/test/java/com/openshift/internal/restclient/model/properties/ResourcePropertiesRegistryTest.java:[73,99] [deprecation] v1beta3 in OpenShiftAPIVersion has been deprecated

[WARNING] /var/lib/jenkins/jobs/test-openshift-restclient-java/workspace/openshift-restclient-java/src/test/java/com/openshift/internal/restclient/model/properties/ResourcePropertiesRegistryTest.java:[75,71] [deprecation] v1beta3 in OpenShiftAPIVersion has been deprecated

[WARNING] /var/lib/jenkins/jobs/test-openshift-restclient-java/workspace/openshift-restclient-java/src/test/java/com/openshift/internal/restclient/model/properties/ResourcePropertiesRegistryTest.java:[77,40] [deprecation] v1beta3 in OpenShiftAPIVersion has been deprecated

[WARNING] /var/lib/jenkins/jobs/test-openshift-restclient-java/workspace/openshift-restclient-java/src/test/java/com/openshift/internal/restclient/model/properties/ResourcePropertiesRegistryTest.java:[83,95] [deprecation] v1beta3 in OpenShiftAPIVersion has been deprecated

[WARNING] /var/lib/jenkins/jobs/test-openshift-restclient-java/workspace/openshift-restclient-java/src/test/java/com/openshift/internal/restclient/model/properties/ResourcePropertiesRegistryTest.java:[85,75] [deprecation] v1beta3 in OpenShiftAPIVersion has been deprecated

[WARNING] /var/lib/jenkins/jobs/test-openshift-restclient-java/workspace/openshift-restclient-java/src/test/java/com/openshift/internal/restclient/model/properties/ResourcePropertiesRegistryTest.java:[87,40] [deprecation] v1beta3 in OpenShiftAPIVersion has been deprecated

[INFO] 
[INFO] --- maven-surefire-plugin:2.12:test (default-test) @ openshift-restclient-java ---
[INFO] Surefire report directory: /var/lib/jenkins/jobs/test-openshift-restclient-java/workspace/openshift-restclient-java/target/surefire-reports

-------------------------------------------------------
 T E S T S
-------------------------------------------------------
Running com.openshift.internal.restclient.apis.extensions.model.v1beta1.ScaleTest
Tests run: 5, Failures: 0, Errors: 0, Skipped: 0, Time elapsed: 0.057 sec
Running com.openshift.internal.restclient.apis.TypeMetaFactoryTest
Tests run: 3, Failures: 0, Errors: 0, Skipped: 0, Time elapsed: 0.008 sec
Running com.openshift.internal.restclient.capability.resources.DockerManifestComparatorTest
Tests run: 1, Failures: 0, Errors: 0, Skipped: 0, Time elapsed: 0.077 sec
Running com.openshift.internal.restclient.capability.resources.TagCapabilityTest
Tests run: 1, Failures: 0, Errors: 0, Skipped: 0, Time elapsed: 0.129 sec
Running com.openshift.internal.restclient.capability.resources.PodLogRetrievalAsyncTest
log4j: reset attribute= "false".
log4j: Threshold ="null".
log4j: Retreiving an instance of org.apache.log4j.Logger.
log4j: Setting [com.openshift] additivity to [true].
log4j: Level value for com.openshift is  [debug].
log4j: com.openshift level set to DEBUG
log4j: Level value for root is  [warn].
log4j: root level set to WARN
log4j: Class name: [org.apache.log4j.ConsoleAppender]
log4j: Parsing layout of class: "org.apache.log4j.PatternLayout"
log4j: Setting property [conversionPattern] to [%d{yyyy-MM-dd HH:mm:ss}|%-5p|[%t]| %10c.%10M %3x | %m%n].
log4j: Adding appender named [STDOUT] to category [root].
2018-09-18 12:15:25|WARN |[main]| com.openshift.internal.restclient.DefaultClient.initMasterVersion     | Exception while trying to determine master version of openshift and kubernetes
java.net.MalformedURLException: no protocol: version/openshift
	at java.net.URL.<init>(URL.java:593)
	at java.net.URL.<init>(URL.java:490)
	at com.openshift.internal.restclient.DefaultClient.initMasterVersion(DefaultClient.java:445)
	at com.openshift.internal.restclient.DefaultClient.<init>(DefaultClient.java:95)
	at com.openshift.internal.restclient.capability.resources.PodLogRetrievalAsyncTest.setUp(PodLogRetrievalAsyncTest.java:59)
	at sun.reflect.NativeMethodAccessorImpl.invoke0(Native Method)
	at sun.reflect.NativeMethodAccessorImpl.invoke(NativeMethodAccessorImpl.java:62)
	at sun.reflect.DelegatingMethodAccessorImpl.invoke(DelegatingMethodAccessorImpl.java:43)
	at java.lang.reflect.Method.invoke(Method.java:498)
	at org.junit.runners.model.FrameworkMethod$1.runReflectiveCall(FrameworkMethod.java:44)
	at org.junit.internal.runners.model.ReflectiveCallable.run(ReflectiveCallable.java:15)
	at org.junit.runners.model.FrameworkMethod.invokeExplosively(FrameworkMethod.java:41)
	at org.junit.internal.runners.statements.RunBefores.evaluate(RunBefores.java:27)
	at org.junit.runners.BlockJUnit4ClassRunner.runNotIgnored(BlockJUnit4ClassRunner.java:79)
	at org.junit.runners.BlockJUnit4ClassRunner.runChild(BlockJUnit4ClassRunner.java:71)
	at org.junit.runners.BlockJUnit4ClassRunner.runChild(BlockJUnit4ClassRunner.java:49)
	at org.junit.runners.ParentRunner$3.run(ParentRunner.java:193)
	at org.junit.runners.ParentRunner$1.schedule(ParentRunner.java:52)
	at org.junit.runners.ParentRunner.runChildren(ParentRunner.java:191)
	at org.junit.runners.ParentRunner.access$000(ParentRunner.java:42)
	at org.junit.runners.ParentRunner$2.evaluate(ParentRunner.java:184)
	at org.junit.runners.ParentRunner.run(ParentRunner.java:236)
	at org.mockito.internal.runners.JUnit45AndHigherRunnerImpl.run(JUnit45AndHigherRunnerImpl.java:38)
	at org.mockito.runners.MockitoJUnitRunner.run(MockitoJUnitRunner.java:63)
	at org.apache.maven.surefire.junit4.JUnit4Provider.execute(JUnit4Provider.java:236)
	at org.apache.maven.surefire.junit4.JUnit4Provider.executeTestSet(JUnit4Provider.java:134)
	at org.apache.maven.surefire.junit4.JUnit4Provider.invoke(JUnit4Provider.java:113)
	at sun.reflect.NativeMethodAccessorImpl.invoke0(Native Method)
	at sun.reflect.NativeMethodAccessorImpl.invoke(NativeMethodAccessorImpl.java:62)
	at sun.reflect.DelegatingMethodAccessorImpl.invoke(DelegatingMethodAccessorImpl.java:43)
	at java.lang.reflect.Method.invoke(Method.java:498)
	at org.apache.maven.surefire.util.ReflectionUtils.invokeMethodWithArray(ReflectionUtils.java:189)
	at org.apache.maven.surefire.booter.ProviderFactory$ProviderProxy.invoke(ProviderFactory.java:165)
	at org.apache.maven.surefire.booter.ProviderFactory.invokeProvider(ProviderFactory.java:85)
	at org.apache.maven.surefire.booter.ForkedBooter.runSuitesInProcess(ForkedBooter.java:103)
	at org.apache.maven.surefire.booter.ForkedBooter.main(ForkedBooter.java:74)
2018-09-18 12:15:25|WARN |[main]| com.openshift.internal.restclient.DefaultClient.initMasterVersion     | Exception while trying to determine master version of openshift and kubernetes
java.net.MalformedURLException: no protocol: version
	at java.net.URL.<init>(URL.java:593)
	at java.net.URL.<init>(URL.java:490)
	at com.openshift.internal.restclient.DefaultClient.initMasterVersion(DefaultClient.java:445)
	at com.openshift.internal.restclient.DefaultClient.<init>(DefaultClient.java:96)
	at com.openshift.internal.restclient.capability.resources.PodLogRetrievalAsyncTest.setUp(PodLogRetrievalAsyncTest.java:59)
	at sun.reflect.NativeMethodAccessorImpl.invoke0(Native Method)
	at sun.reflect.NativeMethodAccessorImpl.invoke(NativeMethodAccessorImpl.java:62)
	at sun.reflect.DelegatingMethodAccessorImpl.invoke(DelegatingMethodAccessorImpl.java:43)
	at java.lang.reflect.Method.invoke(Method.java:498)
	at org.junit.runners.model.FrameworkMethod$1.runReflectiveCall(FrameworkMethod.java:44)
	at org.junit.internal.runners.model.ReflectiveCallable.run(ReflectiveCallable.java:15)
	at org.junit.runners.model.FrameworkMethod.invokeExplosively(FrameworkMethod.java:41)
	at org.junit.internal.runners.statements.RunBefores.evaluate(RunBefores.java:27)
	at org.junit.runners.BlockJUnit4ClassRunner.runNotIgnored(BlockJUnit4ClassRunner.java:79)
	at org.junit.runners.BlockJUnit4ClassRunner.runChild(BlockJUnit4ClassRunner.java:71)
	at org.junit.runners.BlockJUnit4ClassRunner.runChild(BlockJUnit4ClassRunner.java:49)
	at org.junit.runners.ParentRunner$3.run(ParentRunner.java:193)
	at org.junit.runners.ParentRunner$1.schedule(ParentRunner.java:52)
	at org.junit.runners.ParentRunner.runChildren(ParentRunner.java:191)
	at org.junit.runners.ParentRunner.access$000(ParentRunner.java:42)
	at org.junit.runners.ParentRunner$2.evaluate(ParentRunner.java:184)
	at org.junit.runners.ParentRunner.run(ParentRunner.java:236)
	at org.mockito.internal.runners.JUnit45AndHigherRunnerImpl.run(JUnit45AndHigherRunnerImpl.java:38)
	at org.mockito.runners.MockitoJUnitRunner.run(MockitoJUnitRunner.java:63)
	at org.apache.maven.surefire.junit4.JUnit4Provider.execute(JUnit4Provider.java:236)
	at org.apache.maven.surefire.junit4.JUnit4Provider.executeTestSet(JUnit4Provider.java:134)
	at org.apache.maven.surefire.junit4.JUnit4Provider.invoke(JUnit4Provider.java:113)
	at sun.reflect.NativeMethodAccessorImpl.invoke0(Native Method)
	at sun.reflect.NativeMethodAccessorImpl.invoke(NativeMethodAccessorImpl.java:62)
	at sun.reflect.DelegatingMethodAccessorImpl.invoke(DelegatingMethodAccessorImpl.java:43)
	at java.lang.reflect.Method.invoke(Method.java:498)
	at org.apache.maven.surefire.util.ReflectionUtils.invokeMethodWithArray(ReflectionUtils.java:189)
	at org.apache.maven.surefire.booter.ProviderFactory$ProviderProxy.invoke(ProviderFactory.java:165)
	at org.apache.maven.surefire.booter.ProviderFactory.invokeProvider(ProviderFactory.java:85)
	at org.apache.maven.surefire.booter.ForkedBooter.runSuitesInProcess(ForkedBooter.java:103)
	at org.apache.maven.surefire.booter.ForkedBooter.main(ForkedBooter.java:74)
2018-09-18 12:15:25|WARN |[main]| com.openshift.internal.restclient.DefaultClient.initMasterVersion     | Exception while trying to determine master version of openshift and kubernetes
java.net.MalformedURLException: no protocol: version/openshift
	at java.net.URL.<init>(URL.java:593)
	at java.net.URL.<init>(URL.java:490)
	at com.openshift.internal.restclient.DefaultClient.initMasterVersion(DefaultClient.java:445)
	at com.openshift.internal.restclient.DefaultClient.<init>(DefaultClient.java:95)
	at com.openshift.internal.restclient.capability.resources.PodLogRetrievalAsyncTest.setUp(PodLogRetrievalAsyncTest.java:59)
	at sun.reflect.NativeMethodAccessorImpl.invoke0(Native Method)
	at sun.reflect.NativeMethodAccessorImpl.invoke(NativeMethodAccessorImpl.java:62)
	at sun.reflect.DelegatingMethodAccessorImpl.invoke(DelegatingMethodAccessorImpl.java:43)
	at java.lang.reflect.Method.invoke(Method.java:498)
	at org.junit.runners.model.FrameworkMethod$1.runReflectiveCall(FrameworkMethod.java:44)
	at org.junit.internal.runners.model.ReflectiveCallable.run(ReflectiveCallable.java:15)
	at org.junit.runners.model.FrameworkMethod.invokeExplosively(FrameworkMethod.java:41)
	at org.junit.internal.runners.statements.RunBefores.evaluate(RunBefores.java:27)
	at org.junit.runners.BlockJUnit4ClassRunner.runNotIgnored(BlockJUnit4ClassRunner.java:79)
	at org.junit.runners.BlockJUnit4ClassRunner.runChild(BlockJUnit4ClassRunner.java:71)
	at org.junit.runners.BlockJUnit4ClassRunner.runChild(BlockJUnit4ClassRunner.java:49)
	at org.junit.runners.ParentRunner$3.run(ParentRunner.java:193)
	at org.junit.runners.ParentRunner$1.schedule(ParentRunner.java:52)
	at org.junit.runners.ParentRunner.runChildren(ParentRunner.java:191)
	at org.junit.runners.ParentRunner.access$000(ParentRunner.java:42)
	at org.junit.runners.ParentRunner$2.evaluate(ParentRunner.java:184)
	at org.junit.runners.ParentRunner.run(ParentRunner.java:236)
	at org.mockito.internal.runners.JUnit45AndHigherRunnerImpl.run(JUnit45AndHigherRunnerImpl.java:38)
	at org.mockito.runners.MockitoJUnitRunner.run(MockitoJUnitRunner.java:63)
	at org.apache.maven.surefire.junit4.JUnit4Provider.execute(JUnit4Provider.java:236)
	at org.apache.maven.surefire.junit4.JUnit4Provider.executeTestSet(JUnit4Provider.java:134)
	at org.apache.maven.surefire.junit4.JUnit4Provider.invoke(JUnit4Provider.java:113)
	at sun.reflect.NativeMethodAccessorImpl.invoke0(Native Method)
	at sun.reflect.NativeMethodAccessorImpl.invoke(NativeMethodAccessorImpl.java:62)
	at sun.reflect.DelegatingMethodAccessorImpl.invoke(DelegatingMethodAccessorImpl.java:43)
	at java.lang.reflect.Method.invoke(Method.java:498)
	at org.apache.maven.surefire.util.ReflectionUtils.invokeMethodWithArray(ReflectionUtils.java:189)
	at org.apache.maven.surefire.booter.ProviderFactory$ProviderProxy.invoke(ProviderFactory.java:165)
	at org.apache.maven.surefire.booter.ProviderFactory.invokeProvider(ProviderFactory.java:85)
	at org.apache.maven.surefire.booter.ForkedBooter.runSuitesInProcess(ForkedBooter.java:103)
	at org.apache.maven.surefire.booter.ForkedBooter.main(ForkedBooter.java:74)
2018-09-18 12:15:25|WARN |[main]| com.openshift.internal.restclient.DefaultClient.initMasterVersion     | Exception while trying to determine master version of openshift and kubernetes
java.net.MalformedURLException: no protocol: version
	at java.net.URL.<init>(URL.java:593)
	at java.net.URL.<init>(URL.java:490)
	at com.openshift.internal.restclient.DefaultClient.initMasterVersion(DefaultClient.java:445)
	at com.openshift.internal.restclient.DefaultClient.<init>(DefaultClient.java:96)
	at com.openshift.internal.restclient.capability.resources.PodLogRetrievalAsyncTest.setUp(PodLogRetrievalAsyncTest.java:59)
	at sun.reflect.NativeMethodAccessorImpl.invoke0(Native Method)
	at sun.reflect.NativeMethodAccessorImpl.invoke(NativeMethodAccessorImpl.java:62)
	at sun.reflect.DelegatingMethodAccessorImpl.invoke(DelegatingMethodAccessorImpl.java:43)
	at java.lang.reflect.Method.invoke(Method.java:498)
	at org.junit.runners.model.FrameworkMethod$1.runReflectiveCall(FrameworkMethod.java:44)
	at org.junit.internal.runners.model.ReflectiveCallable.run(ReflectiveCallable.java:15)
	at org.junit.runners.model.FrameworkMethod.invokeExplosively(FrameworkMethod.java:41)
	at org.junit.internal.runners.statements.RunBefores.evaluate(RunBefores.java:27)
	at org.junit.runners.BlockJUnit4ClassRunner.runNotIgnored(BlockJUnit4ClassRunner.java:79)
	at org.junit.runners.BlockJUnit4ClassRunner.runChild(BlockJUnit4ClassRunner.java:71)
	at org.junit.runners.BlockJUnit4ClassRunner.runChild(BlockJUnit4ClassRunner.java:49)
	at org.junit.runners.ParentRunner$3.run(ParentRunner.java:193)
	at org.junit.runners.ParentRunner$1.schedule(ParentRunner.java:52)
	at org.junit.runners.ParentRunner.runChildren(ParentRunner.java:191)
	at org.junit.runners.ParentRunner.access$000(ParentRunner.java:42)
	at org.junit.runners.ParentRunner$2.evaluate(ParentRunner.java:184)
	at org.junit.runners.ParentRunner.run(ParentRunner.java:236)
	at org.mockito.internal.runners.JUnit45AndHigherRunnerImpl.run(JUnit45AndHigherRunnerImpl.java:38)
	at org.mockito.runners.MockitoJUnitRunner.run(MockitoJUnitRunner.java:63)
	at org.apache.maven.surefire.junit4.JUnit4Provider.execute(JUnit4Provider.java:236)
	at org.apache.maven.surefire.junit4.JUnit4Provider.executeTestSet(JUnit4Provider.java:134)
	at org.apache.maven.surefire.junit4.JUnit4Provider.invoke(JUnit4Provider.java:113)
	at sun.reflect.NativeMethodAccessorImpl.invoke0(Native Method)
	at sun.reflect.NativeMethodAccessorImpl.invoke(NativeMethodAccessorImpl.java:62)
	at sun.reflect.DelegatingMethodAccessorImpl.invoke(DelegatingMethodAccessorImpl.java:43)
	at java.lang.reflect.Method.invoke(Method.java:498)
	at org.apache.maven.surefire.util.ReflectionUtils.invokeMethodWithArray(ReflectionUtils.java:189)
	at org.apache.maven.surefire.booter.ProviderFactory$ProviderProxy.invoke(ProviderFactory.java:165)
	at org.apache.maven.surefire.booter.ProviderFactory.invokeProvider(ProviderFactory.java:85)
	at org.apache.maven.surefire.booter.ForkedBooter.runSuitesInProcess(ForkedBooter.java:103)
	at org.apache.maven.surefire.booter.ForkedBooter.main(ForkedBooter.java:74)
2018-09-18 12:15:25|WARN |[main]| com.openshift.internal.restclient.DefaultClient.initMasterVersion     | Exception while trying to determine master version of openshift and kubernetes
java.net.MalformedURLException: no protocol: version/openshift
	at java.net.URL.<init>(URL.java:593)
	at java.net.URL.<init>(URL.java:490)
	at com.openshift.internal.restclient.DefaultClient.initMasterVersion(DefaultClient.java:445)
	at com.openshift.internal.restclient.DefaultClient.<init>(DefaultClient.java:95)
	at com.openshift.internal.restclient.capability.resources.PodLogRetrievalAsyncTest.setUp(PodLogRetrievalAsyncTest.java:59)
	at sun.reflect.NativeMethodAccessorImpl.invoke0(Native Method)
	at sun.reflect.NativeMethodAccessorImpl.invoke(NativeMethodAccessorImpl.java:62)
	at sun.reflect.DelegatingMethodAccessorImpl.invoke(DelegatingMethodAccessorImpl.java:43)
	at java.lang.reflect.Method.invoke(Method.java:498)
	at org.junit.runners.model.FrameworkMethod$1.runReflectiveCall(FrameworkMethod.java:44)
	at org.junit.internal.runners.model.ReflectiveCallable.run(ReflectiveCallable.java:15)
	at org.junit.runners.model.FrameworkMethod.invokeExplosively(FrameworkMethod.java:41)
	at org.junit.internal.runners.statements.RunBefores.evaluate(RunBefores.java:27)
	at org.junit.runners.BlockJUnit4ClassRunner.runNotIgnored(BlockJUnit4ClassRunner.java:79)
	at org.junit.runners.BlockJUnit4ClassRunner.runChild(BlockJUnit4ClassRunner.java:71)
	at org.junit.runners.BlockJUnit4ClassRunner.runChild(BlockJUnit4ClassRunner.java:49)
	at org.junit.runners.ParentRunner$3.run(ParentRunner.java:193)
	at org.junit.runners.ParentRunner$1.schedule(ParentRunner.java:52)
	at org.junit.runners.ParentRunner.runChildren(ParentRunner.java:191)
	at org.junit.runners.ParentRunner.access$000(ParentRunner.java:42)
	at org.junit.runners.ParentRunner$2.evaluate(ParentRunner.java:184)
	at org.junit.runners.ParentRunner.run(ParentRunner.java:236)
	at org.mockito.internal.runners.JUnit45AndHigherRunnerImpl.run(JUnit45AndHigherRunnerImpl.java:38)
	at org.mockito.runners.MockitoJUnitRunner.run(MockitoJUnitRunner.java:63)
	at org.apache.maven.surefire.junit4.JUnit4Provider.execute(JUnit4Provider.java:236)
	at org.apache.maven.surefire.junit4.JUnit4Provider.executeTestSet(JUnit4Provider.java:134)
	at org.apache.maven.surefire.junit4.JUnit4Provider.invoke(JUnit4Provider.java:113)
	at sun.reflect.NativeMethodAccessorImpl.invoke0(Native Method)
	at sun.reflect.NativeMethodAccessorImpl.invoke(NativeMethodAccessorImpl.java:62)
	at sun.reflect.DelegatingMethodAccessorImpl.invoke(DelegatingMethodAccessorImpl.java:43)
	at java.lang.reflect.Method.invoke(Method.java:498)
	at org.apache.maven.surefire.util.ReflectionUtils.invokeMethodWithArray(ReflectionUtils.java:189)
	at org.apache.maven.surefire.booter.ProviderFactory$ProviderProxy.invoke(ProviderFactory.java:165)
	at org.apache.maven.surefire.booter.ProviderFactory.invokeProvider(ProviderFactory.java:85)
	at org.apache.maven.surefire.booter.ForkedBooter.runSuitesInProcess(ForkedBooter.java:103)
	at org.apache.maven.surefire.booter.ForkedBooter.main(ForkedBooter.java:74)
2018-09-18 12:15:25|WARN |[main]| com.openshift.internal.restclient.DefaultClient.initMasterVersion     | Exception while trying to determine master version of openshift and kubernetes
java.net.MalformedURLException: no protocol: version
	at java.net.URL.<init>(URL.java:593)
	at java.net.URL.<init>(URL.java:490)
	at com.openshift.internal.restclient.DefaultClient.initMasterVersion(DefaultClient.java:445)
	at com.openshift.internal.restclient.DefaultClient.<init>(DefaultClient.java:96)
	at com.openshift.internal.restclient.capability.resources.PodLogRetrievalAsyncTest.setUp(PodLogRetrievalAsyncTest.java:59)
	at sun.reflect.NativeMethodAccessorImpl.invoke0(Native Method)
	at sun.reflect.NativeMethodAccessorImpl.invoke(NativeMethodAccessorImpl.java:62)
	at sun.reflect.DelegatingMethodAccessorImpl.invoke(DelegatingMethodAccessorImpl.java:43)
	at java.lang.reflect.Method.invoke(Method.java:498)
	at org.junit.runners.model.FrameworkMethod$1.runReflectiveCall(FrameworkMethod.java:44)
	at org.junit.internal.runners.model.ReflectiveCallable.run(ReflectiveCallable.java:15)
	at org.junit.runners.model.FrameworkMethod.invokeExplosively(FrameworkMethod.java:41)
	at org.junit.internal.runners.statements.RunBefores.evaluate(RunBefores.java:27)
	at org.junit.runners.BlockJUnit4ClassRunner.runNotIgnored(BlockJUnit4ClassRunner.java:79)
	at org.junit.runners.BlockJUnit4ClassRunner.runChild(BlockJUnit4ClassRunner.java:71)
	at org.junit.runners.BlockJUnit4ClassRunner.runChild(BlockJUnit4ClassRunner.java:49)
	at org.junit.runners.ParentRunner$3.run(ParentRunner.java:193)
	at org.junit.runners.ParentRunner$1.schedule(ParentRunner.java:52)
	at org.junit.runners.ParentRunner.runChildren(ParentRunner.java:191)
	at org.junit.runners.ParentRunner.access$000(ParentRunner.java:42)
	at org.junit.runners.ParentRunner$2.evaluate(ParentRunner.java:184)
	at org.junit.runners.ParentRunner.run(ParentRunner.java:236)
	at org.mockito.internal.runners.JUnit45AndHigherRunnerImpl.run(JUnit45AndHigherRunnerImpl.java:38)
	at org.mockito.runners.MockitoJUnitRunner.run(MockitoJUnitRunner.java:63)
	at org.apache.maven.surefire.junit4.JUnit4Provider.execute(JUnit4Provider.java:236)
	at org.apache.maven.surefire.junit4.JUnit4Provider.executeTestSet(JUnit4Provider.java:134)
	at org.apache.maven.surefire.junit4.JUnit4Provider.invoke(JUnit4Provider.java:113)
	at sun.reflect.NativeMethodAccessorImpl.invoke0(Native Method)
	at sun.reflect.NativeMethodAccessorImpl.invoke(NativeMethodAccessorImpl.java:62)
	at sun.reflect.DelegatingMethodAccessorImpl.invoke(DelegatingMethodAccessorImpl.java:43)
	at java.lang.reflect.Method.invoke(Method.java:498)
	at org.apache.maven.surefire.util.ReflectionUtils.invokeMethodWithArray(ReflectionUtils.java:189)
	at org.apache.maven.surefire.booter.ProviderFactory$ProviderProxy.invoke(ProviderFactory.java:165)
	at org.apache.maven.surefire.booter.ProviderFactory.invokeProvider(ProviderFactory.java:85)
	at org.apache.maven.surefire.booter.ForkedBooter.runSuitesInProcess(ForkedBooter.java:103)
	at org.apache.maven.surefire.booter.ForkedBooter.main(ForkedBooter.java:74)
2018-09-18 12:15:25|DEBUG|[main]| com.openshift.internal.restclient.capability.resources.PodLogRetrievalAsync.      stop     | Unable to stop the watch client
java.lang.Exception
2018-09-18 12:15:25|WARN |[main]| com.openshift.internal.restclient.DefaultClient.initMasterVersion     | Exception while trying to determine master version of openshift and kubernetes
java.net.MalformedURLException: no protocol: version/openshift
	at java.net.URL.<init>(URL.java:593)
	at java.net.URL.<init>(URL.java:490)
	at com.openshift.internal.restclient.DefaultClient.initMasterVersion(DefaultClient.java:445)
	at com.openshift.internal.restclient.DefaultClient.<init>(DefaultClient.java:95)
	at com.openshift.internal.restclient.capability.resources.PodLogRetrievalAsyncTest.setUp(PodLogRetrievalAsyncTest.java:59)
	at sun.reflect.NativeMethodAccessorImpl.invoke0(Native Method)
	at sun.reflect.NativeMethodAccessorImpl.invoke(NativeMethodAccessorImpl.java:62)
	at sun.reflect.DelegatingMethodAccessorImpl.invoke(DelegatingMethodAccessorImpl.java:43)
	at java.lang.reflect.Method.invoke(Method.java:498)
	at org.junit.runners.model.FrameworkMethod$1.runReflectiveCall(FrameworkMethod.java:44)
	at org.junit.internal.runners.model.ReflectiveCallable.run(ReflectiveCallable.java:15)
	at org.junit.runners.model.FrameworkMethod.invokeExplosively(FrameworkMethod.java:41)
	at org.junit.internal.runners.statements.RunBefores.evaluate(RunBefores.java:27)
	at org.junit.runners.BlockJUnit4ClassRunner.runNotIgnored(BlockJUnit4ClassRunner.java:79)
	at org.junit.runners.BlockJUnit4ClassRunner.runChild(BlockJUnit4ClassRunner.java:71)
	at org.junit.runners.BlockJUnit4ClassRunner.runChild(BlockJUnit4ClassRunner.java:49)
	at org.junit.runners.ParentRunner$3.run(ParentRunner.java:193)
	at org.junit.runners.ParentRunner$1.schedule(ParentRunner.java:52)
	at org.junit.runners.ParentRunner.runChildren(ParentRunner.java:191)
	at org.junit.runners.ParentRunner.access$000(ParentRunner.java:42)
	at org.junit.runners.ParentRunner$2.evaluate(ParentRunner.java:184)
	at org.junit.runners.ParentRunner.run(ParentRunner.java:236)
	at org.mockito.internal.runners.JUnit45AndHigherRunnerImpl.run(JUnit45AndHigherRunnerImpl.java:38)
	at org.mockito.runners.MockitoJUnitRunner.run(MockitoJUnitRunner.java:63)
	at org.apache.maven.surefire.junit4.JUnit4Provider.execute(JUnit4Provider.java:236)
	at org.apache.maven.surefire.junit4.JUnit4Provider.executeTestSet(JUnit4Provider.java:134)
	at org.apache.maven.surefire.junit4.JUnit4Provider.invoke(JUnit4Provider.java:113)
	at sun.reflect.NativeMethodAccessorImpl.invoke0(Native Method)
	at sun.reflect.NativeMethodAccessorImpl.invoke(NativeMethodAccessorImpl.java:62)
	at sun.reflect.DelegatingMethodAccessorImpl.invoke(DelegatingMethodAccessorImpl.java:43)
	at java.lang.reflect.Method.invoke(Method.java:498)
	at org.apache.maven.surefire.util.ReflectionUtils.invokeMethodWithArray(ReflectionUtils.java:189)
	at org.apache.maven.surefire.booter.ProviderFactory$ProviderProxy.invoke(ProviderFactory.java:165)
	at org.apache.maven.surefire.booter.ProviderFactory.invokeProvider(ProviderFactory.java:85)
	at org.apache.maven.surefire.booter.ForkedBooter.runSuitesInProcess(ForkedBooter.java:103)
	at org.apache.maven.surefire.booter.ForkedBooter.main(ForkedBooter.java:74)
2018-09-18 12:15:25|WARN |[main]| com.openshift.internal.restclient.DefaultClient.initMasterVersion     | Exception while trying to determine master version of openshift and kubernetes
java.net.MalformedURLException: no protocol: version
	at java.net.URL.<init>(URL.java:593)
	at java.net.URL.<init>(URL.java:490)
	at com.openshift.internal.restclient.DefaultClient.initMasterVersion(DefaultClient.java:445)
	at com.openshift.internal.restclient.DefaultClient.<init>(DefaultClient.java:96)
	at com.openshift.internal.restclient.capability.resources.PodLogRetrievalAsyncTest.setUp(PodLogRetrievalAsyncTest.java:59)
	at sun.reflect.NativeMethodAccessorImpl.invoke0(Native Method)
	at sun.reflect.NativeMethodAccessorImpl.invoke(NativeMethodAccessorImpl.java:62)
	at sun.reflect.DelegatingMethodAccessorImpl.invoke(DelegatingMethodAccessorImpl.java:43)
	at java.lang.reflect.Method.invoke(Method.java:498)
	at org.junit.runners.model.FrameworkMethod$1.runReflectiveCall(FrameworkMethod.java:44)
	at org.junit.internal.runners.model.ReflectiveCallable.run(ReflectiveCallable.java:15)
	at org.junit.runners.model.FrameworkMethod.invokeExplosively(FrameworkMethod.java:41)
	at org.junit.internal.runners.statements.RunBefores.evaluate(RunBefores.java:27)
	at org.junit.runners.BlockJUnit4ClassRunner.runNotIgnored(BlockJUnit4ClassRunner.java:79)
	at org.junit.runners.BlockJUnit4ClassRunner.runChild(BlockJUnit4ClassRunner.java:71)
	at org.junit.runners.BlockJUnit4ClassRunner.runChild(BlockJUnit4ClassRunner.java:49)
	at org.junit.runners.ParentRunner$3.run(ParentRunner.java:193)
	at org.junit.runners.ParentRunner$1.schedule(ParentRunner.java:52)
	at org.junit.runners.ParentRunner.runChildren(ParentRunner.java:191)
	at org.junit.runners.ParentRunner.access$000(ParentRunner.java:42)
	at org.junit.runners.ParentRunner$2.evaluate(ParentRunner.java:184)
	at org.junit.runners.ParentRunner.run(ParentRunner.java:236)
	at org.mockito.internal.runners.JUnit45AndHigherRunnerImpl.run(JUnit45AndHigherRunnerImpl.java:38)
	at org.mockito.runners.MockitoJUnitRunner.run(MockitoJUnitRunner.java:63)
	at org.apache.maven.surefire.junit4.JUnit4Provider.execute(JUnit4Provider.java:236)
	at org.apache.maven.surefire.junit4.JUnit4Provider.executeTestSet(JUnit4Provider.java:134)
	at org.apache.maven.surefire.junit4.JUnit4Provider.invoke(JUnit4Provider.java:113)
	at sun.reflect.NativeMethodAccessorImpl.invoke0(Native Method)
	at sun.reflect.NativeMethodAccessorImpl.invoke(NativeMethodAccessorImpl.java:62)
	at sun.reflect.DelegatingMethodAccessorImpl.invoke(DelegatingMethodAccessorImpl.java:43)
	at java.lang.reflect.Method.invoke(Method.java:498)
	at org.apache.maven.surefire.util.ReflectionUtils.invokeMethodWithArray(ReflectionUtils.java:189)
	at org.apache.maven.surefire.booter.ProviderFactory$ProviderProxy.invoke(ProviderFactory.java:165)
	at org.apache.maven.surefire.booter.ProviderFactory.invokeProvider(ProviderFactory.java:85)
	at org.apache.maven.surefire.booter.ForkedBooter.runSuitesInProcess(ForkedBooter.java:103)
	at org.apache.maven.surefire.booter.ForkedBooter.main(ForkedBooter.java:74)
2018-09-18 12:15:25|DEBUG|[main]| com.openshift.internal.restclient.ApiTypeMapper.readEndpoint     | https://localhost:8443/api
2018-09-18 12:15:25|DEBUG|[main]| com.openshift.internal.restclient.ApiTypeMapper.readEndpoint     | https://localhost:8443/oapi
2018-09-18 12:15:25|DEBUG|[main]| com.openshift.internal.restclient.ApiTypeMapper.readEndpoint     | https://localhost:8443/apis
2018-09-18 12:15:25|DEBUG|[main]| com.openshift.internal.restclient.ApiTypeMapper.readEndpoint     | https://localhost:8443/api/v1
2018-09-18 12:15:25|DEBUG|[main]| com.openshift.internal.restclient.ApiTypeMapper.readEndpoint     | https://localhost:8443/oapi/v1
2018-09-18 12:15:25|DEBUG|[main]| com.openshift.internal.restclient.ApiTypeMapper.readEndpoint     | https://localhost:8443/apis/autoscaling/v1
2018-09-18 12:15:25|DEBUG|[main]| com.openshift.internal.restclient.ApiTypeMapper.readEndpoint     | https://localhost:8443/apis/batch/v1
2018-09-18 12:15:25|DEBUG|[main]| com.openshift.internal.restclient.ApiTypeMapper.readEndpoint     | https://localhost:8443/apis/extensions/v1beta1
2018-09-18 12:15:25|WARN |[main]| com.openshift.internal.restclient.DefaultClient.initMasterVersion     | Exception while trying to determine master version of openshift and kubernetes
java.net.MalformedURLException: no protocol: version/openshift
	at java.net.URL.<init>(URL.java:593)
	at java.net.URL.<init>(URL.java:490)
	at com.openshift.internal.restclient.DefaultClient.initMasterVersion(DefaultClient.java:445)
	at com.openshift.internal.restclient.DefaultClient.<init>(DefaultClient.java:95)
	at com.openshift.internal.restclient.capability.resources.PodLogRetrievalAsyncTest.setUp(PodLogRetrievalAsyncTest.java:59)
	at sun.reflect.NativeMethodAccessorImpl.invoke0(Native Method)
	at sun.reflect.NativeMethodAccessorImpl.invoke(NativeMethodAccessorImpl.java:62)
	at sun.reflect.DelegatingMethodAccessorImpl.invoke(DelegatingMethodAccessorImpl.java:43)
	at java.lang.reflect.Method.invoke(Method.java:498)
	at org.junit.runners.model.FrameworkMethod$1.runReflectiveCall(FrameworkMethod.java:44)
	at org.junit.internal.runners.model.ReflectiveCallable.run(ReflectiveCallable.java:15)
	at org.junit.runners.model.FrameworkMethod.invokeExplosively(FrameworkMethod.java:41)
	at org.junit.internal.runners.statements.RunBefores.evaluate(RunBefores.java:27)
	at org.junit.runners.BlockJUnit4ClassRunner.runNotIgnored(BlockJUnit4ClassRunner.java:79)
	at org.junit.runners.BlockJUnit4ClassRunner.runChild(BlockJUnit4ClassRunner.java:71)
	at org.junit.runners.BlockJUnit4ClassRunner.runChild(BlockJUnit4ClassRunner.java:49)
	at org.junit.runners.ParentRunner$3.run(ParentRunner.java:193)
	at org.junit.runners.ParentRunner$1.schedule(ParentRunner.java:52)
	at org.junit.runners.ParentRunner.runChildren(ParentRunner.java:191)
	at org.junit.runners.ParentRunner.access$000(ParentRunner.java:42)
	at org.junit.runners.ParentRunner$2.evaluate(ParentRunner.java:184)
	at org.junit.runners.ParentRunner.run(ParentRunner.java:236)
	at org.mockito.internal.runners.JUnit45AndHigherRunnerImpl.run(JUnit45AndHigherRunnerImpl.java:38)
	at org.mockito.runners.MockitoJUnitRunner.run(MockitoJUnitRunner.java:63)
	at org.apache.maven.surefire.junit4.JUnit4Provider.execute(JUnit4Provider.java:236)
	at org.apache.maven.surefire.junit4.JUnit4Provider.executeTestSet(JUnit4Provider.java:134)
	at org.apache.maven.surefire.junit4.JUnit4Provider.invoke(JUnit4Provider.java:113)
	at sun.reflect.NativeMethodAccessorImpl.invoke0(Native Method)
	at sun.reflect.NativeMethodAccessorImpl.invoke(NativeMethodAccessorImpl.java:62)
	at sun.reflect.DelegatingMethodAccessorImpl.invoke(DelegatingMethodAccessorImpl.java:43)
	at java.lang.reflect.Method.invoke(Method.java:498)
	at org.apache.maven.surefire.util.ReflectionUtils.invokeMethodWithArray(ReflectionUtils.java:189)
	at org.apache.maven.surefire.booter.ProviderFactory$ProviderProxy.invoke(ProviderFactory.java:165)
	at org.apache.maven.surefire.booter.ProviderFactory.invokeProvider(ProviderFactory.java:85)
	at org.apache.maven.surefire.booter.ForkedBooter.runSuitesInProcess(ForkedBooter.java:103)
	at org.apache.maven.surefire.booter.ForkedBooter.main(ForkedBooter.java:74)
2018-09-18 12:15:25|WARN |[main]| com.openshift.internal.restclient.DefaultClient.initMasterVersion     | Exception while trying to determine master version of openshift and kubernetes
java.net.MalformedURLException: no protocol: version
	at java.net.URL.<init>(URL.java:593)
	at java.net.URL.<init>(URL.java:490)
	at com.openshift.internal.restclient.DefaultClient.initMasterVersion(DefaultClient.java:445)
	at com.openshift.internal.restclient.DefaultClient.<init>(DefaultClient.java:96)
	at com.openshift.internal.restclient.capability.resources.PodLogRetrievalAsyncTest.setUp(PodLogRetrievalAsyncTest.java:59)
	at sun.reflect.NativeMethodAccessorImpl.invoke0(Native Method)
	at sun.reflect.NativeMethodAccessorImpl.invoke(NativeMethodAccessorImpl.java:62)
	at sun.reflect.DelegatingMethodAccessorImpl.invoke(DelegatingMethodAccessorImpl.java:43)
	at java.lang.reflect.Method.invoke(Method.java:498)
	at org.junit.runners.model.FrameworkMethod$1.runReflectiveCall(FrameworkMethod.java:44)
	at org.junit.internal.runners.model.ReflectiveCallable.run(ReflectiveCallable.java:15)
	at org.junit.runners.model.FrameworkMethod.invokeExplosively(FrameworkMethod.java:41)
	at org.junit.internal.runners.statements.RunBefores.evaluate(RunBefores.java:27)
	at org.junit.runners.BlockJUnit4ClassRunner.runNotIgnored(BlockJUnit4ClassRunner.java:79)
	at org.junit.runners.BlockJUnit4ClassRunner.runChild(BlockJUnit4ClassRunner.java:71)
	at org.junit.runners.BlockJUnit4ClassRunner.runChild(BlockJUnit4ClassRunner.java:49)
	at org.junit.runners.ParentRunner$3.run(ParentRunner.java:193)
	at org.junit.runners.ParentRunner$1.schedule(ParentRunner.java:52)
	at org.junit.runners.ParentRunner.runChildren(ParentRunner.java:191)
	at org.junit.runners.ParentRunner.access$000(ParentRunner.java:42)
	at org.junit.runners.ParentRunner$2.evaluate(ParentRunner.java:184)
	at org.junit.runners.ParentRunner.run(ParentRunner.java:236)
	at org.mockito.internal.runners.JUnit45AndHigherRunnerImpl.run(JUnit45AndHigherRunnerImpl.java:38)
	at org.mockito.runners.MockitoJUnitRunner.run(MockitoJUnitRunner.java:63)
	at org.apache.maven.surefire.junit4.JUnit4Provider.execute(JUnit4Provider.java:236)
	at org.apache.maven.surefire.junit4.JUnit4Provider.executeTestSet(JUnit4Provider.java:134)
	at org.apache.maven.surefire.junit4.JUnit4Provider.invoke(JUnit4Provider.java:113)
	at sun.reflect.NativeMethodAccessorImpl.invoke0(Native Method)
	at sun.reflect.NativeMethodAccessorImpl.invoke(NativeMethodAccessorImpl.java:62)
	at sun.reflect.DelegatingMethodAccessorImpl.invoke(DelegatingMethodAccessorImpl.java:43)
	at java.lang.reflect.Method.invoke(Method.java:498)
	at org.apache.maven.surefire.util.ReflectionUtils.invokeMethodWithArray(ReflectionUtils.java:189)
	at org.apache.maven.surefire.booter.ProviderFactory$ProviderProxy.invoke(ProviderFactory.java:165)
	at org.apache.maven.surefire.booter.ProviderFactory.invokeProvider(ProviderFactory.java:85)
	at org.apache.maven.surefire.booter.ForkedBooter.runSuitesInProcess(ForkedBooter.java:103)
	at org.apache.maven.surefire.booter.ForkedBooter.main(ForkedBooter.java:74)
2018-09-18 12:15:25|DEBUG|[main]| com.openshift.internal.restclient.ApiTypeMapper.readEndpoint     | https://localhost:8443/api
2018-09-18 12:15:25|DEBUG|[main]| com.openshift.internal.restclient.ApiTypeMapper.readEndpoint     | https://localhost:8443/oapi
2018-09-18 12:15:25|DEBUG|[main]| com.openshift.internal.restclient.ApiTypeMapper.readEndpoint     | https://localhost:8443/apis
2018-09-18 12:15:25|DEBUG|[main]| com.openshift.internal.restclient.ApiTypeMapper.readEndpoint     | https://localhost:8443/api/v1
2018-09-18 12:15:25|DEBUG|[main]| com.openshift.internal.restclient.ApiTypeMapper.readEndpoint     | https://localhost:8443/oapi/v1
2018-09-18 12:15:25|DEBUG|[main]| com.openshift.internal.restclient.ApiTypeMapper.readEndpoint     | https://localhost:8443/apis/autoscaling/v1
2018-09-18 12:15:25|DEBUG|[main]| com.openshift.internal.restclient.ApiTypeMapper.readEndpoint     | https://localhost:8443/apis/batch/v1
2018-09-18 12:15:25|DEBUG|[main]| com.openshift.internal.restclient.ApiTypeMapper.readEndpoint     | https://localhost:8443/apis/extensions/v1beta1
Tests run: 5, Failures: 1, Errors: 0, Skipped: 0, Time elapsed: 0.556 sec <<< FAILURE!
Running com.openshift.internal.restclient.capability.resources.ProjectTemplateProcessingTest
Tests run: 5, Failures: 0, Errors: 0, Skipped: 0, Time elapsed: 0.061 sec
Running com.openshift.internal.restclient.capability.resources.DeploymentTraceabilityTest
Tests run: 2, Failures: 0, Errors: 0, Skipped: 0, Time elapsed: 0.011 sec
Running com.openshift.internal.restclient.capability.resources.IPodLogRetrievalAsyncOptionsTest
Tests run: 6, Failures: 0, Errors: 0, Skipped: 0, Time elapsed: 0.003 sec
Running com.openshift.internal.restclient.capability.resources.AssociationCapabilityTest
Tests run: 1, Failures: 0, Errors: 0, Skipped: 0, Time elapsed: 0 sec
Running com.openshift.internal.restclient.capability.resources.OpenShiftBinaryPodLogRetrievalTest
2018-09-18 12:15:25|DEBUG|[main]| com.openshift.internal.restclient.capability.resources.AbstractOpenShiftBinaryCapability.initProcessBuilder     | OpenShift binary args: [/path/to/oc, logs, --token=phWDXIqSspYBZARPQIzqaevHGDIxduQGbhcZuwj48EI, --server=https://localhost:8443, papa-smurf, -n, the-smurfs, -f, -c, smurfland]
2018-09-18 12:15:25|DEBUG|[main]| com.openshift.internal.restclient.capability.resources.AbstractOpenShiftBinaryCapability.initProcessBuilder     | OpenShift binary args: [/path/to/oc, logs, --token=phWDXIqSspYBZARPQIzqaevHGDIxduQGbhcZuwj48EI, --server=https://localhost:8443, --insecure-skip-tls-verify=true, papa-smurf, -n, the-smurfs, -f, -c, smurfland]
Tests run: 2, Failures: 0, Errors: 0, Skipped: 0, Time elapsed: 0.029 sec
Running com.openshift.internal.restclient.capability.resources.DeployCapabilityTest
2018-09-18 12:15:26|DEBUG|[main]| com.openshift.restclient.capability.resources.IDeployCapability.    deploy     | Attempting to deploy latest deployment for config %s.  Loading deployment: %s
2018-09-18 12:15:26|DEBUG|[main]| com.openshift.restclient.capability.resources.IDeployCapability.    deploy     | Attempting to deploy latest deployment for config %s.  Loading deployment: %s
2018-09-18 12:15:26|DEBUG|[main]| com.openshift.restclient.capability.resources.IDeployCapability.    deploy     | Attempting to deploy latest deployment for config %s.  Loading deployment: %s
2018-09-18 12:15:26|DEBUG|[main]| com.openshift.restclient.capability.resources.IDeployCapability.    deploy     | Attempting to deploy latest deployment for config %s.  Loading deployment: %s
2018-09-18 12:15:26|DEBUG|[main]| com.openshift.restclient.capability.resources.IDeployCapability.    deploy     | Skipping deployment because deployment status %s for %s is not in %s
2018-09-18 12:15:26|DEBUG|[main]| com.openshift.restclient.capability.resources.IDeployCapability.    deploy     | Attempting to deploy latest deployment for config %s.  Loading deployment: %s
Tests run: 6, Failures: 0, Errors: 0, Skipped: 0, Time elapsed: 0.028 sec
Running com.openshift.internal.restclient.capability.resources.UpdateableCapabilityTest
Tests run: 1, Failures: 0, Errors: 0, Skipped: 0, Time elapsed: 0 sec
Running com.openshift.internal.restclient.capability.resources.ImageStreamImportCapabilityTest
2018-09-18 12:15:26|DEBUG|[main]| com.openshift.restclient.capability.resources.IImageStreamImportCapability.importImageMetadata     | first trying imagestreamimport against OpenShift server...
Tests run: 1, Failures: 0, Errors: 0, Skipped: 0, Time elapsed: 0.013 sec
Running com.openshift.internal.restclient.capability.resources.AnnotationCapabilityTest
Tests run: 2, Failures: 0, Errors: 0, Skipped: 0, Time elapsed: 0 sec
Running com.openshift.internal.restclient.capability.resources.OpenShiftBinaryPortForwardingTest
2018-09-18 12:15:26|DEBUG|[main]| com.openshift.internal.restclient.capability.resources.AbstractOpenShiftBinaryCapability.initProcessBuilder     | OpenShift binary args: [/path/to/oc, port-forward, --token=phWDXIqSspYBZARPQIzqaevHGDIxduQGbhcZuwj48EI, --server=https://localhost:8443, -n, the-smurfs, papa-smurf, 8443:43]
2018-09-18 12:15:26|DEBUG|[main]| com.openshift.internal.restclient.capability.resources.AbstractOpenShiftBinaryCapability.initProcessBuilder     | OpenShift binary args: [/path/to/oc, port-forward, --token=phWDXIqSspYBZARPQIzqaevHGDIxduQGbhcZuwj48EI, --server=https://localhost:8443, --insecure-skip-tls-verify=true, -n, the-smurfs, papa-smurf, 8080:80, 8443:43]
Tests run: 2, Failures: 0, Errors: 0, Skipped: 0, Time elapsed: 0.014 sec
Running com.openshift.internal.restclient.capability.resources.TemplateTraceabilityTest
Tests run: 3, Failures: 0, Errors: 0, Skipped: 0, Time elapsed: 0.005 sec
Running com.openshift.internal.restclient.capability.resources.PropertyAccessCapabilityTest
Tests run: 4, Failures: 0, Errors: 0, Skipped: 0, Time elapsed: 0.004 sec
Running com.openshift.internal.restclient.capability.resources.OpenShiftBinaryRSyncTest
2018-09-18 12:15:26|DEBUG|[main]| com.openshift.internal.restclient.capability.resources.AbstractOpenShiftBinaryCapability.initProcessBuilder     | OpenShift binary args: [/path/to/oc, rsync, --token=phWDXIqSspYBZARPQIzqaevHGDIxduQGbhcZuwj48EI, --server=https://localhost:8443, -n, the-smurfs, /local/42, papa-smurf:/deployment/42]
2018-09-18 12:15:26|DEBUG|[main]| com.openshift.internal.restclient.capability.resources.AbstractOpenShiftBinaryCapability.initProcessBuilder     | OpenShift binary args: [/path/to/oc, rsync, --token=phWDXIqSspYBZARPQIzqaevHGDIxduQGbhcZuwj48EI, --server=https://localhost:8443, -n, the-smurfs, --insecure-skip-tls-verify=true, --no-perms=true, --exclude=.git, /local/42, papa-smurf:/deployment/42]
2018-09-18 12:15:26|DEBUG|[main]| com.openshift.internal.restclient.capability.resources.AbstractOpenShiftBinaryCapability.initProcessBuilder     | OpenShift binary args: [/path/to/oc, rsync, --token=phWDXIqSspYBZARPQIzqaevHGDIxduQGbhcZuwj48EI, --server=https://localhost:8443, -n, the-smurfs, --exclude=.git, --exclude=.npm, /local/42, papa-smurf:/deployment/42]
Tests run: 3, Failures: 0, Errors: 0, Skipped: 0, Time elapsed: 0.016 sec
Running com.openshift.internal.restclient.capability.resources.DeploymentConfigTraceabilityTest
Tests run: 2, Failures: 0, Errors: 0, Skipped: 0, Time elapsed: 0.002 sec
Running com.openshift.internal.restclient.capability.server.ServerTemplateProcessingTest
Tests run: 3, Failures: 0, Errors: 0, Skipped: 0, Time elapsed: 0.002 sec
Running com.openshift.internal.restclient.model.NamespaceTest
Tests run: 3, Failures: 0, Errors: 0, Skipped: 0, Time elapsed: 0.004 sec
Running com.openshift.internal.restclient.model.ServiceTest
Tests run: 2, Failures: 0, Errors: 0, Skipped: 0, Time elapsed: 0.003 sec
Running com.openshift.internal.restclient.model.build.BuildRequestTest
Tests run: 1, Failures: 0, Errors: 0, Skipped: 0, Time elapsed: 0 sec
Running com.openshift.internal.restclient.model.build.BuildConfigBuilderTest
Tests run: 1, Failures: 0, Errors: 0, Skipped: 0, Time elapsed: 0.011 sec
Running com.openshift.internal.restclient.model.build.WebhookTriggerTest
Tests run: 2, Failures: 0, Errors: 0, Skipped: 0, Time elapsed: 0.001 sec
Running com.openshift.internal.restclient.model.build.BuildConfigTest
Tests run: 3, Failures: 0, Errors: 0, Skipped: 0, Time elapsed: 0.003 sec
Running com.openshift.internal.restclient.model.v1.ResourceTest
Tests run: 2, Failures: 0, Errors: 0, Skipped: 0, Time elapsed: 0.004 sec
Running com.openshift.internal.restclient.model.v1.UserTest
Tests run: 2, Failures: 0, Errors: 0, Skipped: 0, Time elapsed: 0.002 sec
Running com.openshift.internal.restclient.model.v1.BuildTest
Tests run: 5, Failures: 0, Errors: 0, Skipped: 0, Time elapsed: 0.003 sec
Running com.openshift.internal.restclient.model.v1.ListTest
Tests run: 2, Failures: 0, Errors: 0, Skipped: 0, Time elapsed: 0.002 sec
Running com.openshift.internal.restclient.model.v1.SecretVolumeSourceTest
Tests run: 3, Failures: 0, Errors: 0, Skipped: 0, Time elapsed: 0.008 sec
Running com.openshift.internal.restclient.model.v1.ProjectTest
Tests run: 3, Failures: 0, Errors: 0, Skipped: 0, Time elapsed: 0 sec
Running com.openshift.internal.restclient.model.v1.ReplicationControllerTest
Tests run: 20, Failures: 0, Errors: 0, Skipped: 0, Time elapsed: 0.067 sec
Running com.openshift.internal.restclient.model.v1.HostPathVolumeSourceTest
Tests run: 2, Failures: 0, Errors: 0, Skipped: 0, Time elapsed: 0.001 sec
Running com.openshift.internal.restclient.model.v1.EnvironmentVariableTest
Tests run: 4, Failures: 0, Errors: 0, Skipped: 0, Time elapsed: 0.007 sec
Running com.openshift.internal.restclient.model.v1.ServiceTest
Tests run: 16, Failures: 0, Errors: 0, Skipped: 0, Time elapsed: 0.016 sec
Running com.openshift.internal.restclient.model.v1.ImageStreamImportTest
Tests run: 3, Failures: 0, Errors: 0, Skipped: 0, Time elapsed: 0.006 sec
Running com.openshift.internal.restclient.model.v1.SecretTest
Tests run: 3, Failures: 0, Errors: 0, Skipped: 0, Time elapsed: 0.005 sec
Running com.openshift.internal.restclient.model.v1.ConfigMapTest
Tests run: 2, Failures: 0, Errors: 0, Skipped: 0, Time elapsed: 0.002 sec
Running com.openshift.internal.restclient.model.v1.EndpointsTest
2018-09-18 12:15:26|DEBUG|[main]| com.openshift.internal.restclient.ApiTypeMapper.readEndpoint     | https://localhost:8443/api
2018-09-18 12:15:26|DEBUG|[main]| com.openshift.internal.restclient.ApiTypeMapper.readEndpoint     | https://localhost:8443/oapi
2018-09-18 12:15:26|DEBUG|[main]| com.openshift.internal.restclient.ApiTypeMapper.readEndpoint     | https://localhost:8443/apis
2018-09-18 12:15:26|DEBUG|[main]| com.openshift.internal.restclient.ApiTypeMapper.readEndpoint     | https://localhost:8443/api/v1
2018-09-18 12:15:26|DEBUG|[main]| com.openshift.internal.restclient.ApiTypeMapper.readEndpoint     | https://localhost:8443/oapi/v1
2018-09-18 12:15:26|DEBUG|[main]| com.openshift.internal.restclient.ApiTypeMapper.readEndpoint     | https://localhost:8443/apis/autoscaling/v1
2018-09-18 12:15:26|DEBUG|[main]| com.openshift.internal.restclient.ApiTypeMapper.readEndpoint     | https://localhost:8443/apis/batch/v1
2018-09-18 12:15:26|DEBUG|[main]| com.openshift.internal.restclient.ApiTypeMapper.readEndpoint     | https://localhost:8443/apis/extensions/v1beta1
Tests run: 1, Failures: 0, Errors: 0, Skipped: 0, Time elapsed: 0.032 sec
Running com.openshift.internal.restclient.model.v1.TemplateTest
Tests run: 5, Failures: 0, Errors: 0, Skipped: 0, Time elapsed: 0.011 sec
Running com.openshift.internal.restclient.model.v1.DeploymentConfigTest
Tests run: 17, Failures: 0, Errors: 0, Skipped: 0, Time elapsed: 0.022 sec
Running com.openshift.internal.restclient.model.v1.RouteTest
Tests run: 13, Failures: 0, Errors: 0, Skipped: 0, Time elapsed: 0.009 sec
Running com.openshift.internal.restclient.model.v1.ImageStreamTest
Tests run: 5, Failures: 0, Errors: 0, Skipped: 0, Time elapsed: 0.006 sec
Running com.openshift.internal.restclient.model.v1.LifecycleTest
Tests run: 3, Failures: 0, Errors: 0, Skipped: 0, Time elapsed: 0.006 sec
Running com.openshift.internal.restclient.model.v1.PVCTest
Tests run: 6, Failures: 0, Errors: 0, Skipped: 0, Time elapsed: 0.003 sec
Running com.openshift.internal.restclient.model.v1.PVCVolumeSourceTest
Tests run: 3, Failures: 0, Errors: 0, Skipped: 0, Time elapsed: 0.001 sec
Running com.openshift.internal.restclient.model.v1.EventTest
Tests run: 8, Failures: 0, Errors: 0, Skipped: 0, Time elapsed: 0.005 sec
Running com.openshift.internal.restclient.model.v1.ServiceAccountTest
Tests run: 6, Failures: 0, Errors: 0, Skipped: 0, Time elapsed: 0.003 sec
Running com.openshift.internal.restclient.model.v1.EmptyDirVolumeSourceTest
Tests run: 3, Failures: 0, Errors: 0, Skipped: 0, Time elapsed: 0.001 sec
Running com.openshift.internal.restclient.model.v1.UnrecognizedResourceTest
Tests run: 3, Failures: 0, Errors: 0, Skipped: 0, Time elapsed: 0.002 sec
Running com.openshift.internal.restclient.model.v1.ProjectRequestTest
Tests run: 4, Failures: 0, Errors: 0, Skipped: 0, Time elapsed: 0.002 sec
Running com.openshift.internal.restclient.model.v1.ObjectRefTest
Tests run: 9, Failures: 0, Errors: 0, Skipped: 0, Time elapsed: 0.002 sec
Running com.openshift.internal.restclient.model.v1.PersistentVolumeTest
Tests run: 10, Failures: 0, Errors: 0, Skipped: 0, Time elapsed: 0.009 sec
Running com.openshift.internal.restclient.model.v1.RoleBindingTest
Tests run: 4, Failures: 0, Errors: 0, Skipped: 0, Time elapsed: 0.002 sec
Running com.openshift.internal.restclient.model.v1.PipelineBuildConfigTest
Tests run: 9, Failures: 0, Errors: 0, Skipped: 0, Time elapsed: 0.014 sec
Running com.openshift.internal.restclient.model.v1.BuildConfigTest
Tests run: 8, Failures: 0, Errors: 0, Skipped: 0, Time elapsed: 0.005 sec
Running com.openshift.internal.restclient.model.v1.StatusTest
Tests run: 3, Failures: 0, Errors: 0, Skipped: 0, Time elapsed: 0.003 sec
Running com.openshift.internal.restclient.model.v1.PodTest
Tests run: 16, Failures: 0, Errors: 0, Skipped: 0, Time elapsed: 0.02 sec
Running com.openshift.internal.restclient.model.KubernetesResourceTest
Tests run: 17, Failures: 0, Errors: 0, Skipped: 0, Time elapsed: 0.006 sec
Running com.openshift.internal.restclient.model.ProjectTest
Tests run: 1, Failures: 0, Errors: 0, Skipped: 0, Time elapsed: 0 sec
Running com.openshift.internal.restclient.model.template.ParameterTest
Tests run: 12, Failures: 0, Errors: 0, Skipped: 0, Time elapsed: 0.004 sec
Running com.openshift.internal.restclient.model.template.TemplateTest
Tests run: 4, Failures: 0, Errors: 0, Skipped: 0, Time elapsed: 0 sec
Running com.openshift.internal.restclient.model.BuildConfigTest
Tests run: 1, Failures: 0, Errors: 0, Skipped: 0, Time elapsed: 0 sec
Running com.openshift.internal.restclient.model.kubeconfig.KubeClientConfigTest
Tests run: 1, Failures: 0, Errors: 0, Skipped: 0, Time elapsed: 0.087 sec
Running com.openshift.internal.restclient.model.properties.ResourcePropertiesRegistryTest
Tests run: 6, Failures: 0, Errors: 0, Skipped: 0, Time elapsed: 0.009 sec
Running com.openshift.internal.restclient.model.RouteTest
Tests run: 3, Failures: 0, Errors: 0, Skipped: 0, Time elapsed: 0.032 sec
Running com.openshift.internal.restclient.model.StatusTest
Tests run: 2, Failures: 0, Errors: 0, Skipped: 0, Time elapsed: 0.025 sec
Running com.openshift.internal.restclient.model.deploy.DeployRequestTest
Tests run: 1, Failures: 0, Errors: 0, Skipped: 0, Time elapsed: 0.001 sec
Running com.openshift.internal.restclient.URLBuilderTest
2018-09-18 12:15:26|DEBUG|[main]| com.openshift.internal.restclient.ApiTypeMapper.readEndpoint     | https://localhost:8443/api
2018-09-18 12:15:26|DEBUG|[main]| com.openshift.internal.restclient.ApiTypeMapper.readEndpoint     | https://localhost:8443/oapi
2018-09-18 12:15:26|DEBUG|[main]| com.openshift.internal.restclient.ApiTypeMapper.readEndpoint     | https://localhost:8443/apis
2018-09-18 12:15:26|DEBUG|[main]| com.openshift.internal.restclient.ApiTypeMapper.readEndpoint     | https://localhost:8443/api/v1
2018-09-18 12:15:26|DEBUG|[main]| com.openshift.internal.restclient.ApiTypeMapper.readEndpoint     | https://localhost:8443/oapi/v1
2018-09-18 12:15:26|DEBUG|[main]| com.openshift.internal.restclient.ApiTypeMapper.readEndpoint     | https://localhost:8443/apis/autoscaling/v1
2018-09-18 12:15:26|DEBUG|[main]| com.openshift.internal.restclient.ApiTypeMapper.readEndpoint     | https://localhost:8443/apis/batch/v1
2018-09-18 12:15:26|DEBUG|[main]| com.openshift.internal.restclient.ApiTypeMapper.readEndpoint     | https://localhost:8443/apis/extensions/v1beta1
2018-09-18 12:15:26|DEBUG|[main]| com.openshift.internal.restclient.URLBuilder.     build     | Built url: https://localhost:8443/api/v1/namespaces/foo/services?watch=true&resourceVersion=123&foo=bar
2018-09-18 12:15:26|DEBUG|[main]| com.openshift.internal.restclient.ApiTypeMapper.readEndpoint     | https://localhost:8443/api
2018-09-18 12:15:26|DEBUG|[main]| com.openshift.internal.restclient.ApiTypeMapper.readEndpoint     | https://localhost:8443/oapi
2018-09-18 12:15:26|DEBUG|[main]| com.openshift.internal.restclient.ApiTypeMapper.readEndpoint     | https://localhost:8443/apis
2018-09-18 12:15:26|DEBUG|[main]| com.openshift.internal.restclient.ApiTypeMapper.readEndpoint     | https://localhost:8443/api/v1
2018-09-18 12:15:26|DEBUG|[main]| com.openshift.internal.restclient.ApiTypeMapper.readEndpoint     | https://localhost:8443/oapi/v1
2018-09-18 12:15:26|DEBUG|[main]| com.openshift.internal.restclient.ApiTypeMapper.readEndpoint     | https://localhost:8443/apis/autoscaling/v1
2018-09-18 12:15:26|DEBUG|[main]| com.openshift.internal.restclient.ApiTypeMapper.readEndpoint     | https://localhost:8443/apis/batch/v1
2018-09-18 12:15:26|DEBUG|[main]| com.openshift.internal.restclient.ApiTypeMapper.readEndpoint     | https://localhost:8443/apis/extensions/v1beta1
2018-09-18 12:15:26|DEBUG|[main]| com.openshift.internal.restclient.URLBuilder.     build     | Built url: https://localhost:8443/api/v1/namespaces/foo/services?watch=true&resourceVersion=123&x=1&x=2
2018-09-18 12:15:26|DEBUG|[main]| com.openshift.internal.restclient.ApiTypeMapper.readEndpoint     | https://localhost:8443/api
2018-09-18 12:15:26|DEBUG|[main]| com.openshift.internal.restclient.ApiTypeMapper.readEndpoint     | https://localhost:8443/oapi
2018-09-18 12:15:26|DEBUG|[main]| com.openshift.internal.restclient.ApiTypeMapper.readEndpoint     | https://localhost:8443/apis
2018-09-18 12:15:26|DEBUG|[main]| com.openshift.internal.restclient.ApiTypeMapper.readEndpoint     | https://localhost:8443/api/v1
2018-09-18 12:15:26|DEBUG|[main]| com.openshift.internal.restclient.ApiTypeMapper.readEndpoint     | https://localhost:8443/oapi/v1
2018-09-18 12:15:26|DEBUG|[main]| com.openshift.internal.restclient.ApiTypeMapper.readEndpoint     | https://localhost:8443/apis/autoscaling/v1
2018-09-18 12:15:26|DEBUG|[main]| com.openshift.internal.restclient.ApiTypeMapper.readEndpoint     | https://localhost:8443/apis/batch/v1
2018-09-18 12:15:26|DEBUG|[main]| com.openshift.internal.restclient.ApiTypeMapper.readEndpoint     | https://localhost:8443/apis/extensions/v1beta1
2018-09-18 12:15:26|DEBUG|[main]| com.openshift.internal.restclient.URLBuilder.     build     | Built url: https://localhost:8443/oapi/v1/projects/foo
2018-09-18 12:15:26|DEBUG|[main]| com.openshift.internal.restclient.ApiTypeMapper.readEndpoint     | https://localhost:8443/api
2018-09-18 12:15:26|DEBUG|[main]| com.openshift.internal.restclient.ApiTypeMapper.readEndpoint     | https://localhost:8443/oapi
2018-09-18 12:15:26|DEBUG|[main]| com.openshift.internal.restclient.ApiTypeMapper.readEndpoint     | https://localhost:8443/apis
2018-09-18 12:15:26|DEBUG|[main]| com.openshift.internal.restclient.ApiTypeMapper.readEndpoint     | https://localhost:8443/api/v1
2018-09-18 12:15:26|DEBUG|[main]| com.openshift.internal.restclient.ApiTypeMapper.readEndpoint     | https://localhost:8443/oapi/v1
2018-09-18 12:15:26|DEBUG|[main]| com.openshift.internal.restclient.ApiTypeMapper.readEndpoint     | https://localhost:8443/apis/autoscaling/v1
2018-09-18 12:15:26|DEBUG|[main]| com.openshift.internal.restclient.ApiTypeMapper.readEndpoint     | https://localhost:8443/apis/batch/v1
2018-09-18 12:15:26|DEBUG|[main]| com.openshift.internal.restclient.ApiTypeMapper.readEndpoint     | https://localhost:8443/apis/extensions/v1beta1
2018-09-18 12:15:26|DEBUG|[main]| com.openshift.internal.restclient.URLBuilder.     build     | Built url: https://localhost:8443/api/v1/namespaces/foo/services/bar
2018-09-18 12:15:26|DEBUG|[main]| com.openshift.internal.restclient.ApiTypeMapper.readEndpoint     | https://localhost:8443/api
2018-09-18 12:15:26|DEBUG|[main]| com.openshift.internal.restclient.ApiTypeMapper.readEndpoint     | https://localhost:8443/oapi
2018-09-18 12:15:26|DEBUG|[main]| com.openshift.internal.restclient.ApiTypeMapper.readEndpoint     | https://localhost:8443/apis
2018-09-18 12:15:26|DEBUG|[main]| com.openshift.internal.restclient.ApiTypeMapper.readEndpoint     | https://localhost:8443/api/v1
2018-09-18 12:15:26|DEBUG|[main]| com.openshift.internal.restclient.ApiTypeMapper.readEndpoint     | https://localhost:8443/oapi/v1
2018-09-18 12:15:26|DEBUG|[main]| com.openshift.internal.restclient.ApiTypeMapper.readEndpoint     | https://localhost:8443/apis/autoscaling/v1
2018-09-18 12:15:26|DEBUG|[main]| com.openshift.internal.restclient.ApiTypeMapper.readEndpoint     | https://localhost:8443/apis/batch/v1
2018-09-18 12:15:26|DEBUG|[main]| com.openshift.internal.restclient.ApiTypeMapper.readEndpoint     | https://localhost:8443/apis/extensions/v1beta1
2018-09-18 12:15:26|DEBUG|[main]| com.openshift.internal.restclient.URLBuilder.     build     | Built url: https://localhost:8443/api/v1/namespaces/foo/replicationcontrollers/bar/status
2018-09-18 12:15:26|DEBUG|[main]| com.openshift.internal.restclient.ApiTypeMapper.readEndpoint     | https://localhost:8443/api
2018-09-18 12:15:26|DEBUG|[main]| com.openshift.internal.restclient.ApiTypeMapper.readEndpoint     | https://localhost:8443/oapi
2018-09-18 12:15:26|DEBUG|[main]| com.openshift.internal.restclient.ApiTypeMapper.readEndpoint     | https://localhost:8443/apis
2018-09-18 12:15:26|DEBUG|[main]| com.openshift.internal.restclient.ApiTypeMapper.readEndpoint     | https://localhost:8443/api/v1
2018-09-18 12:15:26|DEBUG|[main]| com.openshift.internal.restclient.ApiTypeMapper.readEndpoint     | https://localhost:8443/oapi/v1
2018-09-18 12:15:26|DEBUG|[main]| com.openshift.internal.restclient.ApiTypeMapper.readEndpoint     | https://localhost:8443/apis/autoscaling/v1
2018-09-18 12:15:26|DEBUG|[main]| com.openshift.internal.restclient.ApiTypeMapper.readEndpoint     | https://localhost:8443/apis/batch/v1
2018-09-18 12:15:26|DEBUG|[main]| com.openshift.internal.restclient.ApiTypeMapper.readEndpoint     | https://localhost:8443/apis/extensions/v1beta1
2018-09-18 12:15:26|DEBUG|[main]| com.openshift.internal.restclient.URLBuilder.     build     | Built url: https://localhost:8443/api/v1/namespaces/https:demo-app-8-3gehi:8778/pods/bar/proxy/jolokia/exec/java.util.logging:type=Logging/getLoggerLevel/abc
Tests run: 6, Failures: 0, Errors: 0, Skipped: 0, Time elapsed: 0.167 sec
Running com.openshift.internal.restclient.DefaultClientTest
2018-09-18 12:15:26|DEBUG|[main]| com.openshift.internal.restclient.ApiTypeMapper.readEndpoint     | https://localhost:8443/api
2018-09-18 12:15:26|DEBUG|[main]| com.openshift.internal.restclient.ApiTypeMapper.readEndpoint     | https://localhost:8443/oapi
2018-09-18 12:15:26|DEBUG|[main]| com.openshift.internal.restclient.ApiTypeMapper.readEndpoint     | https://localhost:8443/apis
2018-09-18 12:15:26|DEBUG|[main]| com.openshift.internal.restclient.ApiTypeMapper.readEndpoint     | https://localhost:8443/api/v1
2018-09-18 12:15:26|DEBUG|[main]| com.openshift.internal.restclient.ApiTypeMapper.readEndpoint     | https://localhost:8443/oapi/v1
2018-09-18 12:15:26|DEBUG|[main]| com.openshift.internal.restclient.ApiTypeMapper.readEndpoint     | https://localhost:8443/apis/autoscaling/v1
2018-09-18 12:15:26|DEBUG|[main]| com.openshift.internal.restclient.ApiTypeMapper.readEndpoint     | https://localhost:8443/apis/batch/v1
2018-09-18 12:15:26|DEBUG|[main]| com.openshift.internal.restclient.ApiTypeMapper.readEndpoint     | https://localhost:8443/apis/extensions/v1beta1
2018-09-18 12:15:26|DEBUG|[main]| com.openshift.internal.restclient.ApiTypeMapper.readEndpoint     | https://localhost:8443/api
2018-09-18 12:15:26|DEBUG|[main]| com.openshift.internal.restclient.ApiTypeMapper.readEndpoint     | https://localhost:8443/oapi
2018-09-18 12:15:26|DEBUG|[main]| com.openshift.internal.restclient.ApiTypeMapper.readEndpoint     | https://localhost:8443/apis
2018-09-18 12:15:26|DEBUG|[main]| com.openshift.internal.restclient.ApiTypeMapper.readEndpoint     | https://localhost:8443/api/v1
2018-09-18 12:15:26|DEBUG|[main]| com.openshift.internal.restclient.ApiTypeMapper.readEndpoint     | https://localhost:8443/oapi/v1
2018-09-18 12:15:26|DEBUG|[main]| com.openshift.internal.restclient.ApiTypeMapper.readEndpoint     | https://localhost:8443/apis/autoscaling/v1
2018-09-18 12:15:26|DEBUG|[main]| com.openshift.internal.restclient.ApiTypeMapper.readEndpoint     | https://localhost:8443/apis/batch/v1
2018-09-18 12:15:26|DEBUG|[main]| com.openshift.internal.restclient.ApiTypeMapper.readEndpoint     | https://localhost:8443/apis/extensions/v1beta1
2018-09-18 12:15:26|DEBUG|[main]| com.openshift.internal.restclient.ApiTypeMapper.readEndpoint     | https://localhost:8443/api
2018-09-18 12:15:26|DEBUG|[main]| com.openshift.internal.restclient.ApiTypeMapper.readEndpoint     | https://localhost:8443/oapi
2018-09-18 12:15:26|DEBUG|[main]| com.openshift.internal.restclient.ApiTypeMapper.readEndpoint     | https://localhost:8443/apis
2018-09-18 12:15:26|DEBUG|[main]| com.openshift.internal.restclient.ApiTypeMapper.readEndpoint     | https://localhost:8443/api/v1
2018-09-18 12:15:26|DEBUG|[main]| com.openshift.internal.restclient.ApiTypeMapper.readEndpoint     | https://localhost:8443/oapi/v1
2018-09-18 12:15:26|DEBUG|[main]| com.openshift.internal.restclient.ApiTypeMapper.readEndpoint     | https://localhost:8443/apis/autoscaling/v1
2018-09-18 12:15:26|DEBUG|[main]| com.openshift.internal.restclient.ApiTypeMapper.readEndpoint     | https://localhost:8443/apis/batch/v1
2018-09-18 12:15:26|DEBUG|[main]| com.openshift.internal.restclient.ApiTypeMapper.readEndpoint     | https://localhost:8443/apis/extensions/v1beta1
Tests run: 3, Failures: 0, Errors: 0, Skipped: 0, Time elapsed: 0.046 sec
Running com.openshift.internal.restclient.okhttp.ClientProxyConnectionTest
2018-09-18 12:15:26|INFO |[main]| com.openshift.internal.restclient.okhttp.ClientProxyConnectionTest.testProxySetInOkHttp     | HTTP @ /127.0.0.1:8080
Tests run: 4, Failures: 0, Errors: 0, Skipped: 0, Time elapsed: 0.048 sec
Running com.openshift.internal.restclient.okhttp.WatchClientTest
2018-09-18 12:15:26|WARN |[OkHttp https://openshift.test.com/...]| com.openshift.internal.restclient.DefaultClient. onFailure     | Exception while trying to determine master version of openshift and kubernetes
java.net.ConnectException: Failed to connect to /127.0.0.1:8080
	at okhttp3.internal.connection.RealConnection.connectSocket(RealConnection.java:247)
	at okhttp3.internal.connection.RealConnection.connectTunnel(RealConnection.java:217)
	at okhttp3.internal.connection.RealConnection.connect(RealConnection.java:159)
	at okhttp3.internal.connection.StreamAllocation.findConnection(StreamAllocation.java:257)
	at okhttp3.internal.connection.StreamAllocation.findHealthyConnection(StreamAllocation.java:135)
	at okhttp3.internal.connection.StreamAllocation.newStream(StreamAllocation.java:114)
	at okhttp3.internal.connection.ConnectInterceptor.intercept(ConnectInterceptor.java:42)
	at okhttp3.internal.http.RealInterceptorChain.proceed(RealInterceptorChain.java:147)
	at okhttp3.internal.http.RealInterceptorChain.proceed(RealInterceptorChain.java:121)
	at okhttp3.internal.cache.CacheInterceptor.intercept(CacheInterceptor.java:93)
	at okhttp3.internal.http.RealInterceptorChain.proceed(RealInterceptorChain.java:147)
	at okhttp3.internal.http.RealInterceptorChain.proceed(RealInterceptorChain.java:121)
	at okhttp3.internal.http.BridgeInterceptor.intercept(BridgeInterceptor.java:93)
	at okhttp3.internal.http.RealInterceptorChain.proceed(RealInterceptorChain.java:147)
	at okhttp3.internal.http.RetryAndFollowUpInterceptor.intercept(RetryAndFollowUpInterceptor.java:126)
	at okhttp3.internal.http.RealInterceptorChain.proceed(RealInterceptorChain.java:147)
	at okhttp3.internal.http.RealInterceptorChain.proceed(RealInterceptorChain.java:121)
	at com.openshift.internal.restclient.okhttp.ResponseCodeInterceptor.intercept(ResponseCodeInterceptor.java:55)
	at okhttp3.internal.http.RealInterceptorChain.proceed(RealInterceptorChain.java:147)
	at okhttp3.internal.http.RealInterceptorChain.proceed(RealInterceptorChain.java:121)
	at okhttp3.RealCall.getResponseWithInterceptorChain(RealCall.java:200)
	at okhttp3.RealCall$AsyncCall.execute(RealCall.java:147)
	at okhttp3.internal.NamedRunnable.run(NamedRunnable.java:32)
	at java.util.concurrent.ThreadPoolExecutor.runWorker(ThreadPoolExecutor.java:1149)
	at java.util.concurrent.ThreadPoolExecutor$Worker.run(ThreadPoolExecutor.java:624)
	at java.lang.Thread.run(Thread.java:748)
Caused by: java.net.ConnectException: Connection refused (Connection refused)
	at java.net.PlainSocketImpl.socketConnect(Native Method)
	at java.net.AbstractPlainSocketImpl.doConnect(AbstractPlainSocketImpl.java:350)
	at java.net.AbstractPlainSocketImpl.connectToAddress(AbstractPlainSocketImpl.java:206)
	at java.net.AbstractPlainSocketImpl.connect(AbstractPlainSocketImpl.java:188)
	at java.net.SocksSocketImpl.connect(SocksSocketImpl.java:392)
	at java.net.Socket.connect(Socket.java:589)
	at okhttp3.internal.platform.Platform.connectSocket(Platform.java:129)
	at okhttp3.internal.connection.RealConnection.connectSocket(RealConnection.java:245)
	... 25 more
2018-09-18 12:15:26|WARN |[OkHttp https://openshift.test.com/...]| com.openshift.internal.restclient.DefaultClient. onFailure     | Exception while trying to determine master version of openshift and kubernetes
java.net.ConnectException: Failed to connect to /127.0.0.1:8080
	at okhttp3.internal.connection.RealConnection.connectSocket(RealConnection.java:247)
	at okhttp3.internal.connection.RealConnection.connectTunnel(RealConnection.java:217)
	at okhttp3.internal.connection.RealConnection.connect(RealConnection.java:159)
	at okhttp3.internal.connection.StreamAllocation.findConnection(StreamAllocation.java:257)
	at okhttp3.internal.connection.StreamAllocation.findHealthyConnection(StreamAllocation.java:135)
	at okhttp3.internal.connection.StreamAllocation.newStream(StreamAllocation.java:114)
	at okhttp3.internal.connection.ConnectInterceptor.intercept(ConnectInterceptor.java:42)
	at okhttp3.internal.http.RealInterceptorChain.proceed(RealInterceptorChain.java:147)
	at okhttp3.internal.http.RealInterceptorChain.proceed(RealInterceptorChain.java:121)
	at okhttp3.internal.cache.CacheInterceptor.intercept(CacheInterceptor.java:93)
	at okhttp3.internal.http.RealInterceptorChain.proceed(RealInterceptorChain.java:147)
	at okhttp3.internal.http.RealInterceptorChain.proceed(RealInterceptorChain.java:121)
	at okhttp3.internal.http.BridgeInterceptor.intercept(BridgeInterceptor.java:93)
	at okhttp3.internal.http.RealInterceptorChain.proceed(RealInterceptorChain.java:147)
	at okhttp3.internal.http.RetryAndFollowUpInterceptor.intercept(RetryAndFollowUpInterceptor.java:126)
	at okhttp3.internal.http.RealInterceptorChain.proceed(RealInterceptorChain.java:147)
	at okhttp3.internal.http.RealInterceptorChain.proceed(RealInterceptorChain.java:121)
	at com.openshift.internal.restclient.okhttp.ResponseCodeInterceptor.intercept(ResponseCodeInterceptor.java:55)
	at okhttp3.internal.http.RealInterceptorChain.proceed(RealInterceptorChain.java:147)
	at okhttp3.internal.http.RealInterceptorChain.proceed(RealInterceptorChain.java:121)
	at okhttp3.RealCall.getResponseWithInterceptorChain(RealCall.java:200)
	at okhttp3.RealCall$AsyncCall.execute(RealCall.java:147)
	at okhttp3.internal.NamedRunnable.run(NamedRunnable.java:32)
	at java.util.concurrent.ThreadPoolExecutor.runWorker(ThreadPoolExecutor.java:1149)
	at java.util.concurrent.ThreadPoolExecutor$Worker.run(ThreadPoolExecutor.java:624)
	at java.lang.Thread.run(Thread.java:748)
Caused by: java.net.ConnectException: Connection refused (Connection refused)
	at java.net.PlainSocketImpl.socketConnect(Native Method)
	at java.net.AbstractPlainSocketImpl.doConnect(AbstractPlainSocketImpl.java:350)
	at java.net.AbstractPlainSocketImpl.connectToAddress(AbstractPlainSocketImpl.java:206)
	at java.net.AbstractPlainSocketImpl.connect(AbstractPlainSocketImpl.java:188)
	at java.net.SocksSocketImpl.connect(SocksSocketImpl.java:392)
	at java.net.Socket.connect(Socket.java:589)
	at okhttp3.internal.platform.Platform.connectSocket(Platform.java:129)
	at okhttp3.internal.connection.RealConnection.connectSocket(RealConnection.java:245)
	... 25 more
2018-09-18 12:15:26|WARN |[OkHttp https://openshift.test.com/...]| com.openshift.internal.restclient.DefaultClient. onFailure     | Exception while trying to determine master version of openshift and kubernetes
java.net.ConnectException: Failed to connect to /127.0.0.1:8080
	at okhttp3.internal.connection.RealConnection.connectSocket(RealConnection.java:247)
	at okhttp3.internal.connection.RealConnection.connectTunnel(RealConnection.java:217)
	at okhttp3.internal.connection.RealConnection.connect(RealConnection.java:159)
	at okhttp3.internal.connection.StreamAllocation.findConnection(StreamAllocation.java:257)
	at okhttp3.internal.connection.StreamAllocation.findHealthyConnection(StreamAllocation.java:135)
	at okhttp3.internal.connection.StreamAllocation.newStream(StreamAllocation.java:114)
	at okhttp3.internal.connection.ConnectInterceptor.intercept(ConnectInterceptor.java:42)
	at okhttp3.internal.http.RealInterceptorChain.proceed(RealInterceptorChain.java:147)
	at okhttp3.internal.http.RealInterceptorChain.proceed(RealInterceptorChain.java:121)
	at okhttp3.internal.cache.CacheInterceptor.intercept(CacheInterceptor.java:93)
	at okhttp3.internal.http.RealInterceptorChain.proceed(RealInterceptorChain.java:147)
	at okhttp3.internal.http.RealInterceptorChain.proceed(RealInterceptorChain.java:121)
	at okhttp3.internal.http.BridgeInterceptor.intercept(BridgeInterceptor.java:93)
	at okhttp3.internal.http.RealInterceptorChain.proceed(RealInterceptorChain.java:147)
	at okhttp3.internal.http.RetryAndFollowUpInterceptor.intercept(RetryAndFollowUpInterceptor.java:126)
	at okhttp3.internal.http.RealInterceptorChain.proceed(RealInterceptorChain.java:147)
	at okhttp3.internal.http.RealInterceptorChain.proceed(RealInterceptorChain.java:121)
	at com.openshift.internal.restclient.okhttp.ResponseCodeInterceptor.intercept(ResponseCodeInterceptor.java:55)
	at okhttp3.internal.http.RealInterceptorChain.proceed(RealInterceptorChain.java:147)
	at okhttp3.internal.http.RealInterceptorChain.proceed(RealInterceptorChain.java:121)
	at okhttp3.RealCall.getResponseWithInterceptorChain(RealCall.java:200)
	at okhttp3.RealCall$AsyncCall.execute(RealCall.java:147)
	at okhttp3.internal.NamedRunnable.run(NamedRunnable.java:32)
	at java.util.concurrent.ThreadPoolExecutor.runWorker(ThreadPoolExecutor.java:1149)
	at java.util.concurrent.ThreadPoolExecutor$Worker.run(ThreadPoolExecutor.java:624)
	at java.lang.Thread.run(Thread.java:748)
Caused by: java.net.ConnectException: Connection refused (Connection refused)
	at java.net.PlainSocketImpl.socketConnect(Native Method)
	at java.net.AbstractPlainSocketImpl.doConnect(AbstractPlainSocketImpl.java:350)
	at java.net.AbstractPlainSocketImpl.connectToAddress(AbstractPlainSocketImpl.java:206)
	at java.net.AbstractPlainSocketImpl.connect(AbstractPlainSocketImpl.java:188)
	at java.net.SocksSocketImpl.connect(SocksSocketImpl.java:392)
	at java.net.Socket.connect(Socket.java:589)
	at okhttp3.internal.platform.Platform.connectSocket(Platform.java:129)
	at okhttp3.internal.connection.RealConnection.connectSocket(RealConnection.java:245)
	... 25 more
2018-09-18 12:15:26|WARN |[OkHttp https://openshift.test.com/...]| com.openshift.internal.restclient.DefaultClient. onFailure     | Exception while trying to determine master version of openshift and kubernetes
java.net.ConnectException: Failed to connect to /127.0.0.1:8080
	at okhttp3.internal.connection.RealConnection.connectSocket(RealConnection.java:247)
	at okhttp3.internal.connection.RealConnection.connectTunnel(RealConnection.java:217)
	at okhttp3.internal.connection.RealConnection.connect(RealConnection.java:159)
	at okhttp3.internal.connection.StreamAllocation.findConnection(StreamAllocation.java:257)
	at okhttp3.internal.connection.StreamAllocation.findHealthyConnection(StreamAllocation.java:135)
	at okhttp3.internal.connection.StreamAllocation.newStream(StreamAllocation.java:114)
	at okhttp3.internal.connection.ConnectInterceptor.intercept(ConnectInterceptor.java:42)
	at okhttp3.internal.http.RealInterceptorChain.proceed(RealInterceptorChain.java:147)
	at okhttp3.internal.http.RealInterceptorChain.proceed(RealInterceptorChain.java:121)
	at okhttp3.internal.cache.CacheInterceptor.intercept(CacheInterceptor.java:93)
	at okhttp3.internal.http.RealInterceptorChain.proceed(RealInterceptorChain.java:147)
	at okhttp3.internal.http.RealInterceptorChain.proceed(RealInterceptorChain.java:121)
	at okhttp3.internal.http.BridgeInterceptor.intercept(BridgeInterceptor.java:93)
	at okhttp3.internal.http.RealInterceptorChain.proceed(RealInterceptorChain.java:147)
	at okhttp3.internal.http.RetryAndFollowUpInterceptor.intercept(RetryAndFollowUpInterceptor.java:126)
	at okhttp3.internal.http.RealInterceptorChain.proceed(RealInterceptorChain.java:147)
	at okhttp3.internal.http.RealInterceptorChain.proceed(RealInterceptorChain.java:121)
	at com.openshift.internal.restclient.okhttp.ResponseCodeInterceptor.intercept(ResponseCodeInterceptor.java:55)
	at okhttp3.internal.http.RealInterceptorChain.proceed(RealInterceptorChain.java:147)
	at okhttp3.internal.http.RealInterceptorChain.proceed(RealInterceptorChain.java:121)
	at okhttp3.RealCall.getResponseWithInterceptorChain(RealCall.java:200)
	at okhttp3.RealCall$AsyncCall.execute(RealCall.java:147)
	at okhttp3.internal.NamedRunnable.run(NamedRunnable.java:32)
	at java.util.concurrent.ThreadPoolExecutor.runWorker(ThreadPoolExecutor.java:1149)
	at java.util.concurrent.ThreadPoolExecutor$Worker.run(ThreadPoolExecutor.java:624)
	at java.lang.Thread.run(Thread.java:748)
Caused by: java.net.ConnectException: Connection refused (Connection refused)
	at java.net.PlainSocketImpl.socketConnect(Native Method)
	at java.net.AbstractPlainSocketImpl.doConnect(AbstractPlainSocketImpl.java:350)
	at java.net.AbstractPlainSocketImpl.connectToAddress(AbstractPlainSocketImpl.java:206)
	at java.net.AbstractPlainSocketImpl.connect(AbstractPlainSocketImpl.java:188)
	at java.net.SocksSocketImpl.connect(SocksSocketImpl.java:392)
	at java.net.Socket.connect(Socket.java:589)
	at okhttp3.internal.platform.Platform.connectSocket(Platform.java:129)
	at okhttp3.internal.connection.RealConnection.connectSocket(RealConnection.java:245)
	... 25 more
2018-09-18 12:15:26|DEBUG|[main]| com.openshift.internal.restclient.okhttp.WatchClient. onFailure     | WatchSocket Error for kind Build: java.io.IOException
2018-09-18 12:15:26|DEBUG|[main]| com.openshift.internal.restclient.okhttp.ResponseCodeInterceptor.createOpenShiftException     | 
java.io.IOException
	at com.openshift.internal.restclient.okhttp.WatchClientTest.testOnFailureCallBackNotifiesListener(WatchClientTest.java:50)
	at sun.reflect.NativeMethodAccessorImpl.invoke0(Native Method)
	at sun.reflect.NativeMethodAccessorImpl.invoke(NativeMethodAccessorImpl.java:62)
	at sun.reflect.DelegatingMethodAccessorImpl.invoke(DelegatingMethodAccessorImpl.java:43)
	at java.lang.reflect.Method.invoke(Method.java:498)
	at org.junit.runners.model.FrameworkMethod$1.runReflectiveCall(FrameworkMethod.java:44)
	at org.junit.internal.runners.model.ReflectiveCallable.run(ReflectiveCallable.java:15)
	at org.junit.runners.model.FrameworkMethod.invokeExplosively(FrameworkMethod.java:41)
	at org.junit.internal.runners.statements.InvokeMethod.evaluate(InvokeMethod.java:20)
	at org.junit.runners.BlockJUnit4ClassRunner.runNotIgnored(BlockJUnit4ClassRunner.java:79)
	at org.junit.runners.BlockJUnit4ClassRunner.runChild(BlockJUnit4ClassRunner.java:71)
	at org.junit.runners.BlockJUnit4ClassRunner.runChild(BlockJUnit4ClassRunner.java:49)
	at org.junit.runners.ParentRunner$3.run(ParentRunner.java:193)
	at org.junit.runners.ParentRunner$1.schedule(ParentRunner.java:52)
	at org.junit.runners.ParentRunner.runChildren(ParentRunner.java:191)
	at org.junit.runners.ParentRunner.access$000(ParentRunner.java:42)
	at org.junit.runners.ParentRunner$2.evaluate(ParentRunner.java:184)
	at org.junit.runners.ParentRunner.run(ParentRunner.java:236)
	at org.apache.maven.surefire.junit4.JUnit4Provider.execute(JUnit4Provider.java:236)
	at org.apache.maven.surefire.junit4.JUnit4Provider.executeTestSet(JUnit4Provider.java:134)
	at org.apache.maven.surefire.junit4.JUnit4Provider.invoke(JUnit4Provider.java:113)
	at sun.reflect.NativeMethodAccessorImpl.invoke0(Native Method)
	at sun.reflect.NativeMethodAccessorImpl.invoke(NativeMethodAccessorImpl.java:62)
	at sun.reflect.DelegatingMethodAccessorImpl.invoke(DelegatingMethodAccessorImpl.java:43)
	at java.lang.reflect.Method.invoke(Method.java:498)
	at org.apache.maven.surefire.util.ReflectionUtils.invokeMethodWithArray(ReflectionUtils.java:189)
	at org.apache.maven.surefire.booter.ProviderFactory$ProviderProxy.invoke(ProviderFactory.java:165)
	at org.apache.maven.surefire.booter.ProviderFactory.invokeProvider(ProviderFactory.java:85)
	at org.apache.maven.surefire.booter.ForkedBooter.runSuitesInProcess(ForkedBooter.java:103)
	at org.apache.maven.surefire.booter.ForkedBooter.main(ForkedBooter.java:74)
2018-09-18 12:15:26|DEBUG|[main]| com.openshift.internal.restclient.okhttp.WatchClient. onFailure     | WatchSocket Error for kind Build: java.net.ProtocolException
2018-09-18 12:15:26|DEBUG|[main]| com.openshift.internal.restclient.okhttp.WatchClient. onFailure     | The feature isn't supported
java.net.ProtocolException
	at com.openshift.internal.restclient.okhttp.WatchClientTest.shouldIgnoreUnsupportedFeatureResponseOnFailure(WatchClientTest.java:63)
	at sun.reflect.NativeMethodAccessorImpl.invoke0(Native Method)
	at sun.reflect.NativeMethodAccessorImpl.invoke(NativeMethodAccessorImpl.java:62)
	at sun.reflect.DelegatingMethodAccessorImpl.invoke(DelegatingMethodAccessorImpl.java:43)
	at java.lang.reflect.Method.invoke(Method.java:498)
	at org.junit.runners.model.FrameworkMethod$1.runReflectiveCall(FrameworkMethod.java:44)
	at org.junit.internal.runners.model.ReflectiveCallable.run(ReflectiveCallable.java:15)
	at org.junit.runners.model.FrameworkMethod.invokeExplosively(FrameworkMethod.java:41)
	at org.junit.internal.runners.statements.InvokeMethod.evaluate(InvokeMethod.java:20)
	at org.junit.runners.BlockJUnit4ClassRunner.runNotIgnored(BlockJUnit4ClassRunner.java:79)
	at org.junit.runners.BlockJUnit4ClassRunner.runChild(BlockJUnit4ClassRunner.java:71)
	at org.junit.runners.BlockJUnit4ClassRunner.runChild(BlockJUnit4ClassRunner.java:49)
	at org.junit.runners.ParentRunner$3.run(ParentRunner.java:193)
	at org.junit.runners.ParentRunner$1.schedule(ParentRunner.java:52)
	at org.junit.runners.ParentRunner.runChildren(ParentRunner.java:191)
	at org.junit.runners.ParentRunner.access$000(ParentRunner.java:42)
	at org.junit.runners.ParentRunner$2.evaluate(ParentRunner.java:184)
	at org.junit.runners.ParentRunner.run(ParentRunner.java:236)
	at org.apache.maven.surefire.junit4.JUnit4Provider.execute(JUnit4Provider.java:236)
	at org.apache.maven.surefire.junit4.JUnit4Provider.executeTestSet(JUnit4Provider.java:134)
	at org.apache.maven.surefire.junit4.JUnit4Provider.invoke(JUnit4Provider.java:113)
	at sun.reflect.NativeMethodAccessorImpl.invoke0(Native Method)
	at sun.reflect.NativeMethodAccessorImpl.invoke(NativeMethodAccessorImpl.java:62)
	at sun.reflect.DelegatingMethodAccessorImpl.invoke(DelegatingMethodAccessorImpl.java:43)
	at java.lang.reflect.Method.invoke(Method.java:498)
	at org.apache.maven.surefire.util.ReflectionUtils.invokeMethodWithArray(ReflectionUtils.java:189)
	at org.apache.maven.surefire.booter.ProviderFactory$ProviderProxy.invoke(ProviderFactory.java:165)
	at org.apache.maven.surefire.booter.ProviderFactory.invokeProvider(ProviderFactory.java:85)
	at org.apache.maven.surefire.booter.ForkedBooter.runSuitesInProcess(ForkedBooter.java:103)
	at org.apache.maven.surefire.booter.ForkedBooter.main(ForkedBooter.java:74)
Tests run: 5, Failures: 0, Errors: 0, Skipped: 0, Time elapsed: 0.021 sec
Running com.openshift.internal.restclient.okhttp.BasicChallangeHandlerTest
Tests run: 3, Failures: 0, Errors: 0, Skipped: 0, Time elapsed: 0.003 sec
Running com.openshift.internal.restclient.ApiTypeMapperTest
2018-09-18 12:15:26|DEBUG|[main]| com.openshift.internal.restclient.ApiTypeMapper.readEndpoint     | https://localhost:8443/api
2018-09-18 12:15:26|DEBUG|[main]| com.openshift.internal.restclient.ApiTypeMapper.readEndpoint     | https://localhost:8443/oapi
2018-09-18 12:15:26|DEBUG|[main]| com.openshift.internal.restclient.ApiTypeMapper.readEndpoint     | https://localhost:8443/apis
2018-09-18 12:15:26|DEBUG|[main]| com.openshift.internal.restclient.ApiTypeMapper.readEndpoint     | https://localhost:8443/api/v1
2018-09-18 12:15:26|DEBUG|[main]| com.openshift.internal.restclient.ApiTypeMapper.readEndpoint     | https://localhost:8443/oapi/v1
2018-09-18 12:15:26|DEBUG|[main]| com.openshift.internal.restclient.ApiTypeMapper.readEndpoint     | https://localhost:8443/apis/autoscaling/v1
2018-09-18 12:15:26|DEBUG|[main]| com.openshift.internal.restclient.ApiTypeMapper.readEndpoint     | https://localhost:8443/apis/batch/v1
2018-09-18 12:15:26|DEBUG|[main]| com.openshift.internal.restclient.ApiTypeMapper.readEndpoint     | https://localhost:8443/apis/extensions/v1beta1
2018-09-18 12:15:26|DEBUG|[main]| com.openshift.internal.restclient.ApiTypeMapper.readEndpoint     | https://localhost:8443/api
2018-09-18 12:15:26|DEBUG|[main]| com.openshift.internal.restclient.ApiTypeMapper.readEndpoint     | https://localhost:8443/api
2018-09-18 12:15:26|DEBUG|[main]| com.openshift.internal.restclient.ApiTypeMapper.readEndpoint     | https://localhost:8443/oapi
2018-09-18 12:15:26|DEBUG|[main]| com.openshift.internal.restclient.ApiTypeMapper.readEndpoint     | https://localhost:8443/apis
2018-09-18 12:15:26|DEBUG|[main]| com.openshift.internal.restclient.ApiTypeMapper.readEndpoint     | https://localhost:8443/api/v1
2018-09-18 12:15:26|DEBUG|[main]| com.openshift.internal.restclient.ApiTypeMapper.readEndpoint     | https://localhost:8443/oapi/v1
2018-09-18 12:15:26|DEBUG|[main]| com.openshift.internal.restclient.ApiTypeMapper.readEndpoint     | https://localhost:8443/apis/autoscaling/v1
2018-09-18 12:15:26|DEBUG|[main]| com.openshift.internal.restclient.ApiTypeMapper.readEndpoint     | https://localhost:8443/apis/batch/v1
2018-09-18 12:15:26|DEBUG|[main]| com.openshift.internal.restclient.ApiTypeMapper.readEndpoint     | https://localhost:8443/apis/extensions/v1beta1
2018-09-18 12:15:26|DEBUG|[main]| com.openshift.internal.restclient.ApiTypeMapper.readEndpoint     | https://localhost:8443/api
2018-09-18 12:15:26|DEBUG|[main]| com.openshift.internal.restclient.ApiTypeMapper.readEndpoint     | https://localhost:8443/oapi
2018-09-18 12:15:26|DEBUG|[main]| com.openshift.internal.restclient.ApiTypeMapper.readEndpoint     | https://localhost:8443/apis
2018-09-18 12:15:26|DEBUG|[main]| com.openshift.internal.restclient.ApiTypeMapper.readEndpoint     | https://localhost:8443/api/v1
2018-09-18 12:15:26|DEBUG|[main]| com.openshift.internal.restclient.ApiTypeMapper.readEndpoint     | https://localhost:8443/oapi/v1
2018-09-18 12:15:26|DEBUG|[main]| com.openshift.internal.restclient.ApiTypeMapper.readEndpoint     | https://localhost:8443/apis/autoscaling/v1
2018-09-18 12:15:26|DEBUG|[main]| com.openshift.internal.restclient.ApiTypeMapper.readEndpoint     | https://localhost:8443/apis/batch/v1
2018-09-18 12:15:26|DEBUG|[main]| com.openshift.internal.restclient.ApiTypeMapper.readEndpoint     | https://localhost:8443/apis/extensions/v1beta1
2018-09-18 12:15:26|DEBUG|[main]| com.openshift.internal.restclient.ApiTypeMapper.readEndpoint     | https://localhost:8443/api
2018-09-18 12:15:26|DEBUG|[main]| com.openshift.internal.restclient.ApiTypeMapper.readEndpoint     | https://localhost:8443/oapi
2018-09-18 12:15:26|DEBUG|[main]| com.openshift.internal.restclient.ApiTypeMapper.readEndpoint     | https://localhost:8443/apis
2018-09-18 12:15:26|DEBUG|[main]| com.openshift.internal.restclient.ApiTypeMapper.readEndpoint     | https://localhost:8443/api/v1
2018-09-18 12:15:26|DEBUG|[main]| com.openshift.internal.restclient.ApiTypeMapper.readEndpoint     | https://localhost:8443/oapi/v1
2018-09-18 12:15:26|DEBUG|[main]| com.openshift.internal.restclient.ApiTypeMapper.readEndpoint     | https://localhost:8443/apis/autoscaling/v1
2018-09-18 12:15:26|DEBUG|[main]| com.openshift.internal.restclient.ApiTypeMapper.readEndpoint     | https://localhost:8443/apis/batch/v1
2018-09-18 12:15:26|DEBUG|[main]| com.openshift.internal.restclient.ApiTypeMapper.readEndpoint     | https://localhost:8443/apis/extensions/v1beta1
2018-09-18 12:15:26|DEBUG|[main]| com.openshift.internal.restclient.ApiTypeMapper.readEndpoint     | https://localhost:8443/api
2018-09-18 12:15:26|DEBUG|[main]| com.openshift.internal.restclient.ApiTypeMapper.readEndpoint     | https://localhost:8443/oapi
2018-09-18 12:15:26|DEBUG|[main]| com.openshift.internal.restclient.ApiTypeMapper.readEndpoint     | https://localhost:8443/apis
2018-09-18 12:15:26|DEBUG|[main]| com.openshift.internal.restclient.ApiTypeMapper.readEndpoint     | https://localhost:8443/api/v1
2018-09-18 12:15:26|DEBUG|[main]| com.openshift.internal.restclient.ApiTypeMapper.readEndpoint     | https://localhost:8443/oapi/v1
2018-09-18 12:15:26|DEBUG|[main]| com.openshift.internal.restclient.ApiTypeMapper.readEndpoint     | https://localhost:8443/apis/autoscaling/v1
2018-09-18 12:15:26|DEBUG|[main]| com.openshift.internal.restclient.ApiTypeMapper.readEndpoint     | https://localhost:8443/apis/batch/v1
2018-09-18 12:15:26|DEBUG|[main]| com.openshift.internal.restclient.ApiTypeMapper.readEndpoint     | https://localhost:8443/apis/extensions/v1beta1
Tests run: 5, Failures: 0, Errors: 0, Skipped: 0, Time elapsed: 0.107 sec
Running com.openshift.internal.restclient.api.capabilities.PodExecTest
2018-09-18 12:15:26|WARN |[main]| com.openshift.internal.restclient.DefaultClient.initMasterVersion     | Exception while trying to determine master version of openshift and kubernetes
java.net.MalformedURLException: no protocol: version/openshift
	at java.net.URL.<init>(URL.java:593)
	at java.net.URL.<init>(URL.java:490)
	at com.openshift.internal.restclient.DefaultClient.initMasterVersion(DefaultClient.java:445)
	at com.openshift.internal.restclient.DefaultClient.<init>(DefaultClient.java:95)
	at com.openshift.internal.restclient.api.capabilities.PodExecTest.setUp(PodExecTest.java:51)
	at sun.reflect.NativeMethodAccessorImpl.invoke0(Native Method)
	at sun.reflect.NativeMethodAccessorImpl.invoke(NativeMethodAccessorImpl.java:62)
	at sun.reflect.DelegatingMethodAccessorImpl.invoke(DelegatingMethodAccessorImpl.java:43)
	at java.lang.reflect.Method.invoke(Method.java:498)
	at org.junit.runners.model.FrameworkMethod$1.runReflectiveCall(FrameworkMethod.java:44)
	at org.junit.internal.runners.model.ReflectiveCallable.run(ReflectiveCallable.java:15)
	at org.junit.runners.model.FrameworkMethod.invokeExplosively(FrameworkMethod.java:41)
	at org.junit.internal.runners.statements.RunBefores.evaluate(RunBefores.java:27)
	at org.junit.runners.BlockJUnit4ClassRunner.runNotIgnored(BlockJUnit4ClassRunner.java:79)
	at org.junit.runners.BlockJUnit4ClassRunner.runChild(BlockJUnit4ClassRunner.java:71)
	at org.junit.runners.BlockJUnit4ClassRunner.runChild(BlockJUnit4ClassRunner.java:49)
	at org.junit.runners.ParentRunner$3.run(ParentRunner.java:193)
	at org.junit.runners.ParentRunner$1.schedule(ParentRunner.java:52)
	at org.junit.runners.ParentRunner.runChildren(ParentRunner.java:191)
	at org.junit.runners.ParentRunner.access$000(ParentRunner.java:42)
	at org.junit.runners.ParentRunner$2.evaluate(ParentRunner.java:184)
	at org.junit.runners.ParentRunner.run(ParentRunner.java:236)
	at org.mockito.internal.runners.JUnit45AndHigherRunnerImpl.run(JUnit45AndHigherRunnerImpl.java:38)
	at org.mockito.runners.MockitoJUnitRunner.run(MockitoJUnitRunner.java:63)
	at org.apache.maven.surefire.junit4.JUnit4Provider.execute(JUnit4Provider.java:236)
	at org.apache.maven.surefire.junit4.JUnit4Provider.executeTestSet(JUnit4Provider.java:134)
	at org.apache.maven.surefire.junit4.JUnit4Provider.invoke(JUnit4Provider.java:113)
	at sun.reflect.NativeMethodAccessorImpl.invoke0(Native Method)
	at sun.reflect.NativeMethodAccessorImpl.invoke(NativeMethodAccessorImpl.java:62)
	at sun.reflect.DelegatingMethodAccessorImpl.invoke(DelegatingMethodAccessorImpl.java:43)
	at java.lang.reflect.Method.invoke(Method.java:498)
	at org.apache.maven.surefire.util.ReflectionUtils.invokeMethodWithArray(ReflectionUtils.java:189)
	at org.apache.maven.surefire.booter.ProviderFactory$ProviderProxy.invoke(ProviderFactory.java:165)
	at org.apache.maven.surefire.booter.ProviderFactory.invokeProvider(ProviderFactory.java:85)
	at org.apache.maven.surefire.booter.ForkedBooter.runSuitesInProcess(ForkedBooter.java:103)
	at org.apache.maven.surefire.booter.ForkedBooter.main(ForkedBooter.java:74)
2018-09-18 12:15:26|WARN |[main]| com.openshift.internal.restclient.DefaultClient.initMasterVersion     | Exception while trying to determine master version of openshift and kubernetes
java.net.MalformedURLException: no protocol: version
	at java.net.URL.<init>(URL.java:593)
	at java.net.URL.<init>(URL.java:490)
	at com.openshift.internal.restclient.DefaultClient.initMasterVersion(DefaultClient.java:445)
	at com.openshift.internal.restclient.DefaultClient.<init>(DefaultClient.java:96)
	at com.openshift.internal.restclient.api.capabilities.PodExecTest.setUp(PodExecTest.java:51)
	at sun.reflect.NativeMethodAccessorImpl.invoke0(Native Method)
	at sun.reflect.NativeMethodAccessorImpl.invoke(NativeMethodAccessorImpl.java:62)
	at sun.reflect.DelegatingMethodAccessorImpl.invoke(DelegatingMethodAccessorImpl.java:43)
	at java.lang.reflect.Method.invoke(Method.java:498)
	at org.junit.runners.model.FrameworkMethod$1.runReflectiveCall(FrameworkMethod.java:44)
	at org.junit.internal.runners.model.ReflectiveCallable.run(ReflectiveCallable.java:15)
	at org.junit.runners.model.FrameworkMethod.invokeExplosively(FrameworkMethod.java:41)
	at org.junit.internal.runners.statements.RunBefores.evaluate(RunBefores.java:27)
	at org.junit.runners.BlockJUnit4ClassRunner.runNotIgnored(BlockJUnit4ClassRunner.java:79)
	at org.junit.runners.BlockJUnit4ClassRunner.runChild(BlockJUnit4ClassRunner.java:71)
	at org.junit.runners.BlockJUnit4ClassRunner.runChild(BlockJUnit4ClassRunner.java:49)
	at org.junit.runners.ParentRunner$3.run(ParentRunner.java:193)
	at org.junit.runners.ParentRunner$1.schedule(ParentRunner.java:52)
	at org.junit.runners.ParentRunner.runChildren(ParentRunner.java:191)
	at org.junit.runners.ParentRunner.access$000(ParentRunner.java:42)
	at org.junit.runners.ParentRunner$2.evaluate(ParentRunner.java:184)
	at org.junit.runners.ParentRunner.run(ParentRunner.java:236)
	at org.mockito.internal.runners.JUnit45AndHigherRunnerImpl.run(JUnit45AndHigherRunnerImpl.java:38)
	at org.mockito.runners.MockitoJUnitRunner.run(MockitoJUnitRunner.java:63)
	at org.apache.maven.surefire.junit4.JUnit4Provider.execute(JUnit4Provider.java:236)
	at org.apache.maven.surefire.junit4.JUnit4Provider.executeTestSet(JUnit4Provider.java:134)
	at org.apache.maven.surefire.junit4.JUnit4Provider.invoke(JUnit4Provider.java:113)
	at sun.reflect.NativeMethodAccessorImpl.invoke0(Native Method)
	at sun.reflect.NativeMethodAccessorImpl.invoke(NativeMethodAccessorImpl.java:62)
	at sun.reflect.DelegatingMethodAccessorImpl.invoke(DelegatingMethodAccessorImpl.java:43)
	at java.lang.reflect.Method.invoke(Method.java:498)
	at org.apache.maven.surefire.util.ReflectionUtils.invokeMethodWithArray(ReflectionUtils.java:189)
	at org.apache.maven.surefire.booter.ProviderFactory$ProviderProxy.invoke(ProviderFactory.java:165)
	at org.apache.maven.surefire.booter.ProviderFactory.invokeProvider(ProviderFactory.java:85)
	at org.apache.maven.surefire.booter.ForkedBooter.runSuitesInProcess(ForkedBooter.java:103)
	at org.apache.maven.surefire.booter.ForkedBooter.main(ForkedBooter.java:74)
2018-09-18 12:15:27|WARN |[main]| com.openshift.internal.restclient.DefaultClient.initMasterVersion     | Exception while trying to determine master version of openshift and kubernetes
java.net.MalformedURLException: no protocol: version/openshift
	at java.net.URL.<init>(URL.java:593)
	at java.net.URL.<init>(URL.java:490)
	at com.openshift.internal.restclient.DefaultClient.initMasterVersion(DefaultClient.java:445)
	at com.openshift.internal.restclient.DefaultClient.<init>(DefaultClient.java:95)
	at com.openshift.internal.restclient.api.capabilities.PodExecTest.setUp(PodExecTest.java:51)
	at sun.reflect.NativeMethodAccessorImpl.invoke0(Native Method)
	at sun.reflect.NativeMethodAccessorImpl.invoke(NativeMethodAccessorImpl.java:62)
	at sun.reflect.DelegatingMethodAccessorImpl.invoke(DelegatingMethodAccessorImpl.java:43)
	at java.lang.reflect.Method.invoke(Method.java:498)
	at org.junit.runners.model.FrameworkMethod$1.runReflectiveCall(FrameworkMethod.java:44)
	at org.junit.internal.runners.model.ReflectiveCallable.run(ReflectiveCallable.java:15)
	at org.junit.runners.model.FrameworkMethod.invokeExplosively(FrameworkMethod.java:41)
	at org.junit.internal.runners.statements.RunBefores.evaluate(RunBefores.java:27)
	at org.junit.runners.BlockJUnit4ClassRunner.runNotIgnored(BlockJUnit4ClassRunner.java:79)
	at org.junit.runners.BlockJUnit4ClassRunner.runChild(BlockJUnit4ClassRunner.java:71)
	at org.junit.runners.BlockJUnit4ClassRunner.runChild(BlockJUnit4ClassRunner.java:49)
	at org.junit.runners.ParentRunner$3.run(ParentRunner.java:193)
	at org.junit.runners.ParentRunner$1.schedule(ParentRunner.java:52)
	at org.junit.runners.ParentRunner.runChildren(ParentRunner.java:191)
	at org.junit.runners.ParentRunner.access$000(ParentRunner.java:42)
	at org.junit.runners.ParentRunner$2.evaluate(ParentRunner.java:184)
	at org.junit.runners.ParentRunner.run(ParentRunner.java:236)
	at org.mockito.internal.runners.JUnit45AndHigherRunnerImpl.run(JUnit45AndHigherRunnerImpl.java:38)
	at org.mockito.runners.MockitoJUnitRunner.run(MockitoJUnitRunner.java:63)
	at org.apache.maven.surefire.junit4.JUnit4Provider.execute(JUnit4Provider.java:236)
	at org.apache.maven.surefire.junit4.JUnit4Provider.executeTestSet(JUnit4Provider.java:134)
	at org.apache.maven.surefire.junit4.JUnit4Provider.invoke(JUnit4Provider.java:113)
	at sun.reflect.NativeMethodAccessorImpl.invoke0(Native Method)
	at sun.reflect.NativeMethodAccessorImpl.invoke(NativeMethodAccessorImpl.java:62)
	at sun.reflect.DelegatingMethodAccessorImpl.invoke(DelegatingMethodAccessorImpl.java:43)
	at java.lang.reflect.Method.invoke(Method.java:498)
	at org.apache.maven.surefire.util.ReflectionUtils.invokeMethodWithArray(ReflectionUtils.java:189)
	at org.apache.maven.surefire.booter.ProviderFactory$ProviderProxy.invoke(ProviderFactory.java:165)
	at org.apache.maven.surefire.booter.ProviderFactory.invokeProvider(ProviderFactory.java:85)
	at org.apache.maven.surefire.booter.ForkedBooter.runSuitesInProcess(ForkedBooter.java:103)
	at org.apache.maven.surefire.booter.ForkedBooter.main(ForkedBooter.java:74)
2018-09-18 12:15:27|WARN |[main]| com.openshift.internal.restclient.DefaultClient.initMasterVersion     | Exception while trying to determine master version of openshift and kubernetes
java.net.MalformedURLException: no protocol: version
	at java.net.URL.<init>(URL.java:593)
	at java.net.URL.<init>(URL.java:490)
	at com.openshift.internal.restclient.DefaultClient.initMasterVersion(DefaultClient.java:445)
	at com.openshift.internal.restclient.DefaultClient.<init>(DefaultClient.java:96)
	at com.openshift.internal.restclient.api.capabilities.PodExecTest.setUp(PodExecTest.java:51)
	at sun.reflect.NativeMethodAccessorImpl.invoke0(Native Method)
	at sun.reflect.NativeMethodAccessorImpl.invoke(NativeMethodAccessorImpl.java:62)
	at sun.reflect.DelegatingMethodAccessorImpl.invoke(DelegatingMethodAccessorImpl.java:43)
	at java.lang.reflect.Method.invoke(Method.java:498)
	at org.junit.runners.model.FrameworkMethod$1.runReflectiveCall(FrameworkMethod.java:44)
	at org.junit.internal.runners.model.ReflectiveCallable.run(ReflectiveCallable.java:15)
	at org.junit.runners.model.FrameworkMethod.invokeExplosively(FrameworkMethod.java:41)
	at org.junit.internal.runners.statements.RunBefores.evaluate(RunBefores.java:27)
	at org.junit.runners.BlockJUnit4ClassRunner.runNotIgnored(BlockJUnit4ClassRunner.java:79)
	at org.junit.runners.BlockJUnit4ClassRunner.runChild(BlockJUnit4ClassRunner.java:71)
	at org.junit.runners.BlockJUnit4ClassRunner.runChild(BlockJUnit4ClassRunner.java:49)
	at org.junit.runners.ParentRunner$3.run(ParentRunner.java:193)
	at org.junit.runners.ParentRunner$1.schedule(ParentRunner.java:52)
	at org.junit.runners.ParentRunner.runChildren(ParentRunner.java:191)
	at org.junit.runners.ParentRunner.access$000(ParentRunner.java:42)
	at org.junit.runners.ParentRunner$2.evaluate(ParentRunner.java:184)
	at org.junit.runners.ParentRunner.run(ParentRunner.java:236)
	at org.mockito.internal.runners.JUnit45AndHigherRunnerImpl.run(JUnit45AndHigherRunnerImpl.java:38)
	at org.mockito.runners.MockitoJUnitRunner.run(MockitoJUnitRunner.java:63)
	at org.apache.maven.surefire.junit4.JUnit4Provider.execute(JUnit4Provider.java:236)
	at org.apache.maven.surefire.junit4.JUnit4Provider.executeTestSet(JUnit4Provider.java:134)
	at org.apache.maven.surefire.junit4.JUnit4Provider.invoke(JUnit4Provider.java:113)
	at sun.reflect.NativeMethodAccessorImpl.invoke0(Native Method)
	at sun.reflect.NativeMethodAccessorImpl.invoke(NativeMethodAccessorImpl.java:62)
	at sun.reflect.DelegatingMethodAccessorImpl.invoke(DelegatingMethodAccessorImpl.java:43)
	at java.lang.reflect.Method.invoke(Method.java:498)
	at org.apache.maven.surefire.util.ReflectionUtils.invokeMethodWithArray(ReflectionUtils.java:189)
	at org.apache.maven.surefire.booter.ProviderFactory$ProviderProxy.invoke(ProviderFactory.java:165)
	at org.apache.maven.surefire.booter.ProviderFactory.invokeProvider(ProviderFactory.java:85)
	at org.apache.maven.surefire.booter.ForkedBooter.runSuitesInProcess(ForkedBooter.java:103)
	at org.apache.maven.surefire.booter.ForkedBooter.main(ForkedBooter.java:74)
2018-09-18 12:15:27|DEBUG|[main]| com.openshift.internal.restclient.ApiTypeMapper.readEndpoint     | https://localhost:8443/api
2018-09-18 12:15:27|DEBUG|[main]| com.openshift.internal.restclient.ApiTypeMapper.readEndpoint     | https://localhost:8443/oapi
2018-09-18 12:15:27|DEBUG|[main]| com.openshift.internal.restclient.ApiTypeMapper.readEndpoint     | https://localhost:8443/apis
2018-09-18 12:15:27|DEBUG|[main]| com.openshift.internal.restclient.ApiTypeMapper.readEndpoint     | https://localhost:8443/api/v1
2018-09-18 12:15:27|DEBUG|[main]| com.openshift.internal.restclient.ApiTypeMapper.readEndpoint     | https://localhost:8443/oapi/v1
2018-09-18 12:15:27|DEBUG|[main]| com.openshift.internal.restclient.ApiTypeMapper.readEndpoint     | https://localhost:8443/apis/autoscaling/v1
2018-09-18 12:15:27|DEBUG|[main]| com.openshift.internal.restclient.ApiTypeMapper.readEndpoint     | https://localhost:8443/apis/batch/v1
2018-09-18 12:15:27|DEBUG|[main]| com.openshift.internal.restclient.ApiTypeMapper.readEndpoint     | https://localhost:8443/apis/extensions/v1beta1
2018-09-18 12:15:27|WARN |[main]| com.openshift.internal.restclient.DefaultClient.initMasterVersion     | Exception while trying to determine master version of openshift and kubernetes
java.net.MalformedURLException: no protocol: version/openshift
	at java.net.URL.<init>(URL.java:593)
	at java.net.URL.<init>(URL.java:490)
	at com.openshift.internal.restclient.DefaultClient.initMasterVersion(DefaultClient.java:445)
	at com.openshift.internal.restclient.DefaultClient.<init>(DefaultClient.java:95)
	at com.openshift.internal.restclient.api.capabilities.PodExecTest.setUp(PodExecTest.java:51)
	at sun.reflect.NativeMethodAccessorImpl.invoke0(Native Method)
	at sun.reflect.NativeMethodAccessorImpl.invoke(NativeMethodAccessorImpl.java:62)
	at sun.reflect.DelegatingMethodAccessorImpl.invoke(DelegatingMethodAccessorImpl.java:43)
	at java.lang.reflect.Method.invoke(Method.java:498)
	at org.junit.runners.model.FrameworkMethod$1.runReflectiveCall(FrameworkMethod.java:44)
	at org.junit.internal.runners.model.ReflectiveCallable.run(ReflectiveCallable.java:15)
	at org.junit.runners.model.FrameworkMethod.invokeExplosively(FrameworkMethod.java:41)
	at org.junit.internal.runners.statements.RunBefores.evaluate(RunBefores.java:27)
	at org.junit.runners.BlockJUnit4ClassRunner.runNotIgnored(BlockJUnit4ClassRunner.java:79)
	at org.junit.runners.BlockJUnit4ClassRunner.runChild(BlockJUnit4ClassRunner.java:71)
	at org.junit.runners.BlockJUnit4ClassRunner.runChild(BlockJUnit4ClassRunner.java:49)
	at org.junit.runners.ParentRunner$3.run(ParentRunner.java:193)
	at org.junit.runners.ParentRunner$1.schedule(ParentRunner.java:52)
	at org.junit.runners.ParentRunner.runChildren(ParentRunner.java:191)
	at org.junit.runners.ParentRunner.access$000(ParentRunner.java:42)
	at org.junit.runners.ParentRunner$2.evaluate(ParentRunner.java:184)
	at org.junit.runners.ParentRunner.run(ParentRunner.java:236)
	at org.mockito.internal.runners.JUnit45AndHigherRunnerImpl.run(JUnit45AndHigherRunnerImpl.java:38)
	at org.mockito.runners.MockitoJUnitRunner.run(MockitoJUnitRunner.java:63)
	at org.apache.maven.surefire.junit4.JUnit4Provider.execute(JUnit4Provider.java:236)
	at org.apache.maven.surefire.junit4.JUnit4Provider.executeTestSet(JUnit4Provider.java:134)
	at org.apache.maven.surefire.junit4.JUnit4Provider.invoke(JUnit4Provider.java:113)
	at sun.reflect.NativeMethodAccessorImpl.invoke0(Native Method)
	at sun.reflect.NativeMethodAccessorImpl.invoke(NativeMethodAccessorImpl.java:62)
	at sun.reflect.DelegatingMethodAccessorImpl.invoke(DelegatingMethodAccessorImpl.java:43)
	at java.lang.reflect.Method.invoke(Method.java:498)
	at org.apache.maven.surefire.util.ReflectionUtils.invokeMethodWithArray(ReflectionUtils.java:189)
	at org.apache.maven.surefire.booter.ProviderFactory$ProviderProxy.invoke(ProviderFactory.java:165)
	at org.apache.maven.surefire.booter.ProviderFactory.invokeProvider(ProviderFactory.java:85)
	at org.apache.maven.surefire.booter.ForkedBooter.runSuitesInProcess(ForkedBooter.java:103)
	at org.apache.maven.surefire.booter.ForkedBooter.main(ForkedBooter.java:74)
2018-09-18 12:15:27|WARN |[main]| com.openshift.internal.restclient.DefaultClient.initMasterVersion     | Exception while trying to determine master version of openshift and kubernetes
java.net.MalformedURLException: no protocol: version
	at java.net.URL.<init>(URL.java:593)
	at java.net.URL.<init>(URL.java:490)
	at com.openshift.internal.restclient.DefaultClient.initMasterVersion(DefaultClient.java:445)
	at com.openshift.internal.restclient.DefaultClient.<init>(DefaultClient.java:96)
	at com.openshift.internal.restclient.api.capabilities.PodExecTest.setUp(PodExecTest.java:51)
	at sun.reflect.NativeMethodAccessorImpl.invoke0(Native Method)
	at sun.reflect.NativeMethodAccessorImpl.invoke(NativeMethodAccessorImpl.java:62)
	at sun.reflect.DelegatingMethodAccessorImpl.invoke(DelegatingMethodAccessorImpl.java:43)
	at java.lang.reflect.Method.invoke(Method.java:498)
	at org.junit.runners.model.FrameworkMethod$1.runReflectiveCall(FrameworkMethod.java:44)
	at org.junit.internal.runners.model.ReflectiveCallable.run(ReflectiveCallable.java:15)
	at org.junit.runners.model.FrameworkMethod.invokeExplosively(FrameworkMethod.java:41)
	at org.junit.internal.runners.statements.RunBefores.evaluate(RunBefores.java:27)
	at org.junit.runners.BlockJUnit4ClassRunner.runNotIgnored(BlockJUnit4ClassRunner.java:79)
	at org.junit.runners.BlockJUnit4ClassRunner.runChild(BlockJUnit4ClassRunner.java:71)
	at org.junit.runners.BlockJUnit4ClassRunner.runChild(BlockJUnit4ClassRunner.java:49)
	at org.junit.runners.ParentRunner$3.run(ParentRunner.java:193)
	at org.junit.runners.ParentRunner$1.schedule(ParentRunner.java:52)
	at org.junit.runners.ParentRunner.runChildren(ParentRunner.java:191)
	at org.junit.runners.ParentRunner.access$000(ParentRunner.java:42)
	at org.junit.runners.ParentRunner$2.evaluate(ParentRunner.java:184)
	at org.junit.runners.ParentRunner.run(ParentRunner.java:236)
	at org.mockito.internal.runners.JUnit45AndHigherRunnerImpl.run(JUnit45AndHigherRunnerImpl.java:38)
	at org.mockito.runners.MockitoJUnitRunner.run(MockitoJUnitRunner.java:63)
	at org.apache.maven.surefire.junit4.JUnit4Provider.execute(JUnit4Provider.java:236)
	at org.apache.maven.surefire.junit4.JUnit4Provider.executeTestSet(JUnit4Provider.java:134)
	at org.apache.maven.surefire.junit4.JUnit4Provider.invoke(JUnit4Provider.java:113)
	at sun.reflect.NativeMethodAccessorImpl.invoke0(Native Method)
	at sun.reflect.NativeMethodAccessorImpl.invoke(NativeMethodAccessorImpl.java:62)
	at sun.reflect.DelegatingMethodAccessorImpl.invoke(DelegatingMethodAccessorImpl.java:43)
	at java.lang.reflect.Method.invoke(Method.java:498)
	at org.apache.maven.surefire.util.ReflectionUtils.invokeMethodWithArray(ReflectionUtils.java:189)
	at org.apache.maven.surefire.booter.ProviderFactory$ProviderProxy.invoke(ProviderFactory.java:165)
	at org.apache.maven.surefire.booter.ProviderFactory.invokeProvider(ProviderFactory.java:85)
	at org.apache.maven.surefire.booter.ForkedBooter.runSuitesInProcess(ForkedBooter.java:103)
	at org.apache.maven.surefire.booter.ForkedBooter.main(ForkedBooter.java:74)
2018-09-18 12:15:27|DEBUG|[main]| com.openshift.internal.restclient.ApiTypeMapper.readEndpoint     | https://localhost:8443/api
2018-09-18 12:15:27|DEBUG|[main]| com.openshift.internal.restclient.ApiTypeMapper.readEndpoint     | https://localhost:8443/oapi
2018-09-18 12:15:27|DEBUG|[main]| com.openshift.internal.restclient.ApiTypeMapper.readEndpoint     | https://localhost:8443/apis
2018-09-18 12:15:27|DEBUG|[main]| com.openshift.internal.restclient.ApiTypeMapper.readEndpoint     | https://localhost:8443/api/v1
2018-09-18 12:15:27|DEBUG|[main]| com.openshift.internal.restclient.ApiTypeMapper.readEndpoint     | https://localhost:8443/oapi/v1
2018-09-18 12:15:27|DEBUG|[main]| com.openshift.internal.restclient.ApiTypeMapper.readEndpoint     | https://localhost:8443/apis/autoscaling/v1
2018-09-18 12:15:27|DEBUG|[main]| com.openshift.internal.restclient.ApiTypeMapper.readEndpoint     | https://localhost:8443/apis/batch/v1
2018-09-18 12:15:27|DEBUG|[main]| com.openshift.internal.restclient.ApiTypeMapper.readEndpoint     | https://localhost:8443/apis/extensions/v1beta1
2018-09-18 12:15:27|WARN |[main]| com.openshift.internal.restclient.DefaultClient.initMasterVersion     | Exception while trying to determine master version of openshift and kubernetes
java.net.MalformedURLException: no protocol: version/openshift
	at java.net.URL.<init>(URL.java:593)
	at java.net.URL.<init>(URL.java:490)
	at com.openshift.internal.restclient.DefaultClient.initMasterVersion(DefaultClient.java:445)
	at com.openshift.internal.restclient.DefaultClient.<init>(DefaultClient.java:95)
	at com.openshift.internal.restclient.api.capabilities.PodExecTest.setUp(PodExecTest.java:51)
	at sun.reflect.NativeMethodAccessorImpl.invoke0(Native Method)
	at sun.reflect.NativeMethodAccessorImpl.invoke(NativeMethodAccessorImpl.java:62)
	at sun.reflect.DelegatingMethodAccessorImpl.invoke(DelegatingMethodAccessorImpl.java:43)
	at java.lang.reflect.Method.invoke(Method.java:498)
	at org.junit.runners.model.FrameworkMethod$1.runReflectiveCall(FrameworkMethod.java:44)
	at org.junit.internal.runners.model.ReflectiveCallable.run(ReflectiveCallable.java:15)
	at org.junit.runners.model.FrameworkMethod.invokeExplosively(FrameworkMethod.java:41)
	at org.junit.internal.runners.statements.RunBefores.evaluate(RunBefores.java:27)
	at org.junit.runners.BlockJUnit4ClassRunner.runNotIgnored(BlockJUnit4ClassRunner.java:79)
	at org.junit.runners.BlockJUnit4ClassRunner.runChild(BlockJUnit4ClassRunner.java:71)
	at org.junit.runners.BlockJUnit4ClassRunner.runChild(BlockJUnit4ClassRunner.java:49)
	at org.junit.runners.ParentRunner$3.run(ParentRunner.java:193)
	at org.junit.runners.ParentRunner$1.schedule(ParentRunner.java:52)
	at org.junit.runners.ParentRunner.runChildren(ParentRunner.java:191)
	at org.junit.runners.ParentRunner.access$000(ParentRunner.java:42)
	at org.junit.runners.ParentRunner$2.evaluate(ParentRunner.java:184)
	at org.junit.runners.ParentRunner.run(ParentRunner.java:236)
	at org.mockito.internal.runners.JUnit45AndHigherRunnerImpl.run(JUnit45AndHigherRunnerImpl.java:38)
	at org.mockito.runners.MockitoJUnitRunner.run(MockitoJUnitRunner.java:63)
	at org.apache.maven.surefire.junit4.JUnit4Provider.execute(JUnit4Provider.java:236)
	at org.apache.maven.surefire.junit4.JUnit4Provider.executeTestSet(JUnit4Provider.java:134)
	at org.apache.maven.surefire.junit4.JUnit4Provider.invoke(JUnit4Provider.java:113)
	at sun.reflect.NativeMethodAccessorImpl.invoke0(Native Method)
	at sun.reflect.NativeMethodAccessorImpl.invoke(NativeMethodAccessorImpl.java:62)
	at sun.reflect.DelegatingMethodAccessorImpl.invoke(DelegatingMethodAccessorImpl.java:43)
	at java.lang.reflect.Method.invoke(Method.java:498)
	at org.apache.maven.surefire.util.ReflectionUtils.invokeMethodWithArray(ReflectionUtils.java:189)
	at org.apache.maven.surefire.booter.ProviderFactory$ProviderProxy.invoke(ProviderFactory.java:165)
	at org.apache.maven.surefire.booter.ProviderFactory.invokeProvider(ProviderFactory.java:85)
	at org.apache.maven.surefire.booter.ForkedBooter.runSuitesInProcess(ForkedBooter.java:103)
	at org.apache.maven.surefire.booter.ForkedBooter.main(ForkedBooter.java:74)
2018-09-18 12:15:27|WARN |[main]| com.openshift.internal.restclient.DefaultClient.initMasterVersion     | Exception while trying to determine master version of openshift and kubernetes
java.net.MalformedURLException: no protocol: version
	at java.net.URL.<init>(URL.java:593)
	at java.net.URL.<init>(URL.java:490)
	at com.openshift.internal.restclient.DefaultClient.initMasterVersion(DefaultClient.java:445)
	at com.openshift.internal.restclient.DefaultClient.<init>(DefaultClient.java:96)
	at com.openshift.internal.restclient.api.capabilities.PodExecTest.setUp(PodExecTest.java:51)
	at sun.reflect.NativeMethodAccessorImpl.invoke0(Native Method)
	at sun.reflect.NativeMethodAccessorImpl.invoke(NativeMethodAccessorImpl.java:62)
	at sun.reflect.DelegatingMethodAccessorImpl.invoke(DelegatingMethodAccessorImpl.java:43)
	at java.lang.reflect.Method.invoke(Method.java:498)
	at org.junit.runners.model.FrameworkMethod$1.runReflectiveCall(FrameworkMethod.java:44)
	at org.junit.internal.runners.model.ReflectiveCallable.run(ReflectiveCallable.java:15)
	at org.junit.runners.model.FrameworkMethod.invokeExplosively(FrameworkMethod.java:41)
	at org.junit.internal.runners.statements.RunBefores.evaluate(RunBefores.java:27)
	at org.junit.runners.BlockJUnit4ClassRunner.runNotIgnored(BlockJUnit4ClassRunner.java:79)
	at org.junit.runners.BlockJUnit4ClassRunner.runChild(BlockJUnit4ClassRunner.java:71)
	at org.junit.runners.BlockJUnit4ClassRunner.runChild(BlockJUnit4ClassRunner.java:49)
	at org.junit.runners.ParentRunner$3.run(ParentRunner.java:193)
	at org.junit.runners.ParentRunner$1.schedule(ParentRunner.java:52)
	at org.junit.runners.ParentRunner.runChildren(ParentRunner.java:191)
	at org.junit.runners.ParentRunner.access$000(ParentRunner.java:42)
	at org.junit.runners.ParentRunner$2.evaluate(ParentRunner.java:184)
	at org.junit.runners.ParentRunner.run(ParentRunner.java:236)
	at org.mockito.internal.runners.JUnit45AndHigherRunnerImpl.run(JUnit45AndHigherRunnerImpl.java:38)
	at org.mockito.runners.MockitoJUnitRunner.run(MockitoJUnitRunner.java:63)
	at org.apache.maven.surefire.junit4.JUnit4Provider.execute(JUnit4Provider.java:236)
	at org.apache.maven.surefire.junit4.JUnit4Provider.executeTestSet(JUnit4Provider.java:134)
	at org.apache.maven.surefire.junit4.JUnit4Provider.invoke(JUnit4Provider.java:113)
	at sun.reflect.NativeMethodAccessorImpl.invoke0(Native Method)
	at sun.reflect.NativeMethodAccessorImpl.invoke(NativeMethodAccessorImpl.java:62)
	at sun.reflect.DelegatingMethodAccessorImpl.invoke(DelegatingMethodAccessorImpl.java:43)
	at java.lang.reflect.Method.invoke(Method.java:498)
	at org.apache.maven.surefire.util.ReflectionUtils.invokeMethodWithArray(ReflectionUtils.java:189)
	at org.apache.maven.surefire.booter.ProviderFactory$ProviderProxy.invoke(ProviderFactory.java:165)
	at org.apache.maven.surefire.booter.ProviderFactory.invokeProvider(ProviderFactory.java:85)
	at org.apache.maven.surefire.booter.ForkedBooter.runSuitesInProcess(ForkedBooter.java:103)
	at org.apache.maven.surefire.booter.ForkedBooter.main(ForkedBooter.java:74)
Tests run: 4, Failures: 1, Errors: 0, Skipped: 0, Time elapsed: 0.087 sec <<< FAILURE!
Running com.openshift.internal.restclient.authorization.AuthorizationDetailsTest
Tests run: 2, Failures: 0, Errors: 0, Skipped: 0, Time elapsed: 0.01 sec
Running com.openshift.internal.restclient.APIModelVersionTest
Tests run: 1, Failures: 0, Errors: 0, Skipped: 0, Time elapsed: 0 sec
Running com.openshift.internal.restclient.ResourceFactoryTest
Tests run: 3, Failures: 0, Errors: 0, Skipped: 0, Time elapsed: 0 sec
Running com.openshift.internal.util.JBossDmrExtentionsTest
Tests run: 10, Failures: 0, Errors: 0, Skipped: 0, Time elapsed: 0.001 sec
Running com.openshift.internal.util.URIUtilsTest
Tests run: 3, Failures: 0, Errors: 0, Skipped: 0, Time elapsed: 0 sec
Running com.openshift.internal.util.StringSplitterTest
Tests run: 8, Failures: 0, Errors: 0, Skipped: 0, Time elapsed: 0 sec
Running com.openshift.restclient.OpenShiftContextTest
Tests run: 4, Failures: 0, Errors: 0, Skipped: 0, Time elapsed: 0.007 sec
Running com.openshift.restclient.ResourceKindTest
Tests run: 8, Failures: 0, Errors: 0, Skipped: 0, Time elapsed: 0 sec
Running com.openshift.restclient.images.DockerImageURITest
Tests run: 11, Failures: 0, Errors: 0, Skipped: 0, Time elapsed: 0 sec

Results :

Failed tests:   testAdapterCallsListenerCycle(com.openshift.internal.restclient.capability.resources.PodLogRetrievalAsyncTest): (..)
  testAdapterCallsListenerCycle(com.openshift.internal.restclient.api.capabilities.PodExecTest): (..)

Tests run: 401, Failures: 2, Errors: 0, Skipped: 0

[INFO] ------------------------------------------------------------------------
[INFO] BUILD FAILURE
[INFO] ------------------------------------------------------------------------
[INFO] Total time: 9.442s
[INFO] Finished at: Tue Sep 18 12:15:27 EDT 2018
[INFO] Final Memory: 27M/1042M
[INFO] ------------------------------------------------------------------------
[ERROR] Failed to execute goal org.apache.maven.plugins:maven-surefire-plugin:2.12:test (default-test) on project openshift-restclient-java: There are test failures.
[ERROR] 
[ERROR] Please refer to /var/lib/jenkins/jobs/test-openshift-restclient-java/workspace/openshift-restclient-java/target/surefire-reports for the individual test results.
[ERROR] -> [Help 1]
[ERROR] 
[ERROR] To see the full stack trace of the errors, re-run Maven with the -e switch.
[ERROR] Re-run Maven using the -X switch to enable full debug logging.
[ERROR] 
[ERROR] For more information about the errors and possible solutions, please read the following articles:
[ERROR] [Help 1] http://cwiki.apache.org/confluence/display/MAVEN/MojoFailureException
+ RESULT=1
+ set -e
+ popd
~/jobs/test-openshift-restclient-java/workspace
+ '[' 1 -ne 0 ']'
+ exit 1
Build step 'Execute shell' marked build as failure
Recording test results
[description-setter] Description set: <a href="https://github.com/openshift/openshift-restclient-java/pull/350">https://github.com/openshift/openshift-restclient-java/pull/350</a>
[BFA] Scanning build for known causes...
[BFA] No failure causes found
[BFA] Done. 0s
Finished: FAILURE