Console Output

Started by remote host 50.17.198.52
[EnvInject] - Loading node environment variables.
Building in workspace /var/lib/jenkins/jobs/test-origin-metrics/workspace
Run condition [And] enabling prebuild for step [BuilderChain]
[EnvInject] - Injecting environment variables from a build step.
[EnvInject] - Injecting as environment variables the properties content 
OS_ROOT=/data/src/github.com/openshift/origin
INSTANCE_TYPE=c4.xlarge
GIT_BRANCH=master
GITHUB_REPO=openshift
OS=centos7
TESTNAME=metrics

[EnvInject] - Variables injected successfully.
[workspace] $ /bin/sh -xe /tmp/jenkins5256734158268429510.sh
+ false
+ vagrant origin-local-checkout --replace --repo origin-metrics
You don't seem to have the GOPATH environment variable set on your system.
See: 'go help gopath' for more details about GOPATH.
Waiting for the cloning process to finish
Checking repo integrity for /var/lib/jenkins/jobs/test-origin-metrics/workspace/origin-metrics
~/jobs/test-origin-metrics/workspace/origin-metrics ~/jobs/test-origin-metrics/workspace
# On branch master
# Your branch is ahead of 'origin/master' by 1 commit.
#   (use "git push" to publish your local commits)
#
nothing to commit, working directory clean
~/jobs/test-origin-metrics/workspace
Replacing: /var/lib/jenkins/jobs/test-origin-metrics/workspace/origin-metrics
~/jobs/test-origin-metrics/workspace/origin-metrics ~/jobs/test-origin-metrics/workspace
Already on 'master'
Your branch is ahead of 'origin/master' by 1 commit.
  (use "git push" to publish your local commits)
HEAD is now at 05dcdd0 Merge pull request #393 from openshift/BZ1498549
Deleted branch tpr_bz-1508496_jsanda (was 076e76f).
~/jobs/test-origin-metrics/workspace
Origin repositories cloned into /var/lib/jenkins/jobs/test-origin-metrics/workspace
+ '[' -n 402 ']'
+ set +x


*****Locally Merging Pull Request: https://github.com/openshift/origin-metrics/pull/402
+ test_pull_requests --local_merge_pull_request 402 --repo origin-metrics --config /var/lib/jenkins/.test_pull_requests_metrics.json
WARNING: Cache won't persist between runs.
  *** Starting with empty cache
Rate limit remaining: 4532
  Checking if current base repo commit ID matches what we expect
Local merging pull request #402 for repo 'origin-metrics' against base repo commit id 05dcdd01e7802349d615a79b049553810ec0aed6 from pr branch commit id ffcdfa708db46ae128011890e6abf0940d216c10
+ pushd origin-metrics
+ git checkout master
Already on 'master'
+ git checkout -b tpr_remove-alerts_jsanda
Switched to a new branch 'tpr_remove-alerts_jsanda'
+ git pull git@github.com:jsanda/origin-metrics.git remove-alerts
From github.com:jsanda/origin-metrics
 * branch            remove-alerts -> FETCH_HEAD
+ git pull git@github.com:jsanda/origin-metrics.git remove-alerts --tags
From github.com:jsanda/origin-metrics
 * branch            remove-alerts -> FETCH_HEAD
+ git checkout master
Switched to branch 'master'
+ git merge tpr_remove-alerts_jsanda
+ git submodule update --recursive
+ popd

Rate limit resets in: 1494s, at 2018-02-21T11:32:11-05:00 (1519230731)
Rate limit remaining: 4528; delta: 4
Rate limit is not too low.
Would run.
Cache stats: Hits: 0, Misses: 4, Bypass: 0
      (raw): [:fresh, 0, :invalid, 0, :miss, 4, :unacceptable, 0, :valid, 0]

Done
~/jobs/test-origin-metrics/workspace/origin-metrics ~/jobs/test-origin-metrics/workspace
Updating 05dcdd0..ffcdfa7
Fast-forward
 hawkular-metrics/Dockerfile     |  9 +++++++--
 hawkular-metrics/standalone.xml | 24 ------------------------
 2 files changed, 7 insertions(+), 26 deletions(-)
Already up-to-date.
Updating 05dcdd0..ffcdfa7
Fast-forward
 hawkular-metrics/Dockerfile     |  9 +++++++--
 hawkular-metrics/standalone.xml | 24 ------------------------
 2 files changed, 7 insertions(+), 26 deletions(-)
~/jobs/test-origin-metrics/workspace
+ vagrant origin-local-checkout --replace
You don't seem to have the GOPATH environment variable set on your system.
See: 'go help gopath' for more details about GOPATH.
Waiting for the cloning process to finish
Checking repo integrity for /var/lib/jenkins/jobs/test-origin-metrics/workspace/origin
~/jobs/test-origin-metrics/workspace/origin ~/jobs/test-origin-metrics/workspace
# On branch master
# Untracked files:
#   (use "git add <file>..." to include in what will be committed)
#
#	artifacts/
nothing added to commit but untracked files present (use "git add" to track)
~/jobs/test-origin-metrics/workspace
Replacing: /var/lib/jenkins/jobs/test-origin-metrics/workspace/origin
~/jobs/test-origin-metrics/workspace/origin ~/jobs/test-origin-metrics/workspace
From https://github.com/openshift/origin
   4e52d0a..7642cc8  master     -> origin/master
Already on 'master'
Your branch is behind 'origin/master' by 9 commits, and can be fast-forwarded.
  (use "git pull" to update your local branch)
HEAD is now at 7642cc8 Merge pull request #18405 from enj/enj/i/ca_serial_number/1512825
Removing .vagrant-openshift.json
Removing .vagrant/
Removing artifacts/
fatal: branch name required
~/jobs/test-origin-metrics/workspace
Origin repositories cloned into /var/lib/jenkins/jobs/test-origin-metrics/workspace
+ pushd origin
~/jobs/test-origin-metrics/workspace/origin ~/jobs/test-origin-metrics/workspace
+ INSTANCE_NAME=origin_metrics-centos7-307
+ GIT_URL=https://github.com/openshift/origin-metrics
++ echo https://github.com/openshift/origin-metrics
++ sed s,https://,,
+ OMETRICS_LOCAL_PATH=github.com/openshift/origin-metrics
+ ORIGIN_METRICS_DIR=/data/src/github.com/openshift/origin-metrics
+ env
+ sort
_=/bin/env
BUILD_CAUSE=REMOTECAUSE
BUILD_CAUSE_REMOTECAUSE=true
BUILD_DISPLAY_NAME=#307
BUILD_ID=307
BUILD_NUMBER=307
BUILD_TAG=jenkins-test-origin-metrics-307
BUILD_URL=https://ci.openshift.redhat.com/jenkins/job/test-origin-metrics/307/
EXECUTOR_NUMBER=26
GIT_BRANCH=master
GITHUB_REPO=openshift
HOME=/var/lib/jenkins
HUDSON_COOKIE=5f5b2c09-86cd-4ae0-bf23-021ef504692a
HUDSON_HOME=/var/lib/jenkins
HUDSON_SERVER_COOKIE=ec11f8b2841c966f
HUDSON_URL=https://ci.openshift.redhat.com/jenkins/
INSTANCE_TYPE=c4.xlarge
JENKINS_HOME=/var/lib/jenkins
JENKINS_SERVER_COOKIE=ec11f8b2841c966f
JENKINS_URL=https://ci.openshift.redhat.com/jenkins/
JOB_BASE_NAME=test-origin-metrics
JOB_DISPLAY_URL=https://ci.openshift.redhat.com/jenkins/job/test-origin-metrics/display/redirect
JOB_NAME=test-origin-metrics
JOB_URL=https://ci.openshift.redhat.com/jenkins/job/test-origin-metrics/
LANG=en_US.UTF-8
LOGNAME=jenkins
MERGE=false
MERGE_SEVERITY=none
METRICS_PULL_ID=402
NLSPATH=/usr/dt/lib/nls/msg/%L/%N.cat
NODE_LABELS=master
NODE_NAME=master
OLDPWD=/var/lib/jenkins/jobs/test-origin-metrics/workspace
OS=centos7
OS_ROOT=/data/src/github.com/openshift/origin
PATH=/sbin:/usr/sbin:/bin:/usr/bin
PWD=/var/lib/jenkins/jobs/test-origin-metrics/workspace/origin
ROOT_BUILD_CAUSE=REMOTECAUSE
ROOT_BUILD_CAUSE_REMOTECAUSE=true
RUN_CHANGES_DISPLAY_URL=https://ci.openshift.redhat.com/jenkins/job/test-origin-metrics/307/display/redirect?page=changes
RUN_DISPLAY_URL=https://ci.openshift.redhat.com/jenkins/job/test-origin-metrics/307/display/redirect
SHELL=/bin/bash
SHLVL=3
TESTNAME=metrics
USER=jenkins
WORKSPACE=/var/lib/jenkins/jobs/test-origin-metrics/workspace
XFILESEARCHPATH=/usr/dt/app-defaults/%L/Dt
+ vagrant origin-init --stage inst --os centos7 --instance-type c4.xlarge origin_metrics-centos7-307
Reading AWS credentials from /var/lib/jenkins/.awscred
Searching devenv-centos7_* for latest base AMI (required_name_tag=)
Found: ami-2fb42b39 (devenv-centos7_6170)
++ seq 0 2
+ for i in '$(seq 0 2)'
+ vagrant up --provider aws
Bringing machine 'openshiftdev' up with 'aws' provider...
==> openshiftdev: Warning! The AWS provider doesn't support any of the Vagrant
==> openshiftdev: high-level network configurations (`config.vm.network`). They
==> openshiftdev: will be silently ignored.
==> openshiftdev: Warning! You're launching this instance into a VPC without an
==> openshiftdev: elastic IP. Please verify you're properly connected to a VPN so
==> openshiftdev: you can access this machine, otherwise Vagrant will not be able
==> openshiftdev: to SSH into it.
==> openshiftdev: Launching an instance with the following settings...
==> openshiftdev:  -- Type: c4.xlarge
==> openshiftdev:  -- AMI: ami-2fb42b39
==> openshiftdev:  -- Region: us-east-1
==> openshiftdev:  -- Keypair: libra
==> openshiftdev:  -- Subnet ID: subnet-cf57c596
==> openshiftdev:  -- User Data: yes
==> openshiftdev:  -- User Data: 
==> openshiftdev: # cloud-config
==> openshiftdev: 
==> openshiftdev: growpart:
==> openshiftdev:   mode: auto
==> openshiftdev:   devices: ['/']
==> openshiftdev: runcmd:
==> openshiftdev: - [ sh, -xc, "sed -i s/^Defaults.*requiretty/#Defaults requiretty/g /etc/sudoers"]
==> openshiftdev:         
==> openshiftdev:  -- Block Device Mapping: [{"DeviceName"=>"/dev/sda1", "Ebs.VolumeSize"=>25, "Ebs.VolumeType"=>"gp2"}, {"DeviceName"=>"/dev/sdb", "Ebs.VolumeSize"=>35, "Ebs.VolumeType"=>"gp2"}]
==> openshiftdev:  -- Terminate On Shutdown: false
==> openshiftdev:  -- Monitoring: false
==> openshiftdev:  -- EBS optimized: false
==> openshiftdev:  -- Assigning a public IP address in a VPC: false
==> openshiftdev: Waiting for instance to become "ready"...
==> openshiftdev: Waiting for SSH to become available...
==> openshiftdev: Machine is booted and ready for use!
==> openshiftdev: Running provisioner: setup (shell)...
    openshiftdev: Running: /tmp/vagrant-shell20180221-21928-13u08v0.sh
==> openshiftdev: Host: ec2-34-230-9-168.compute-1.amazonaws.com
+ break
+ vagrant sync-origin-metrics -c -s
Running ssh/sudo command 'rm -rf /data/src/github.com/openshift/origin-metrics-bare; 
' with timeout 14400. Attempt #0
Running ssh/sudo command 'mkdir -p /centos/.ssh;
mv /tmp/file20180221-24045-1yike8g /centos/.ssh/config &&
chown centos:centos /centos/.ssh/config &&
chmod 0600 /centos/.ssh/config' with timeout 14400. Attempt #0
Running ssh/sudo command 'mkdir -p /data/src/github.com/openshift/' with timeout 14400. Attempt #0
Running ssh/sudo command 'mkdir -p /data/src/github.com/openshift/builder && chown -R centos:centos /data/src/github.com/openshift/' with timeout 14400. Attempt #0
Running ssh/sudo command 'set -e
rm -fr /data/src/github.com/openshift/origin-metrics-bare;

if [ ! -d /data/src/github.com/openshift/origin-metrics-bare ]; then
git clone --quiet --bare https://github.com/openshift/origin-metrics.git /data/src/github.com/openshift/origin-metrics-bare >/dev/null
fi
' with timeout 14400. Attempt #0
Synchronizing local sources
Synchronizing [origin-metrics@master] from origin-metrics...
Warning: Permanently added '34.230.9.168' (ECDSA) to the list of known hosts.
Running ssh/sudo command 'set -e

if [ -d /data/src/github.com/openshift/origin-metrics-bare ]; then
rm -rf /data/src/github.com/openshift/origin-metrics
echo 'Cloning origin-metrics ...'
git clone --quiet --recurse-submodules /data/src/github.com/openshift/origin-metrics-bare /data/src/github.com/openshift/origin-metrics

else
MISSING_REPO+='origin-metrics-bare'
fi

if [ -n "$MISSING_REPO" ]; then
echo 'Missing required upstream repositories:'
echo $MISSING_REPO
echo 'To fix, execute command: vagrant clone-upstream-repos'
fi
' with timeout 14400. Attempt #0
Cloning origin-metrics ...
+ vagrant ssh -c 'if [ ! -d /tmp/openshift ] ; then mkdir /tmp/openshift ; fi ; sudo chmod 777 /tmp/openshift'
+ vagrant test-origin-metrics -d --env GIT_URL=https://github.com/openshift/origin-metrics --env GIT_BRANCH=master --env ORIGIN_METRICS_DIR=/data/src/github.com/openshift/origin-metrics --env OS_ROOT=/data/src/github.com/openshift/origin --env USE_LOCAL_SOURCE=true --env VERBOSE=1
***************************************************
Running GIT_URL=https://github.com/openshift/origin-metrics GIT_BRANCH=master ORIGIN_METRICS_DIR=/data/src/github.com/openshift/origin-metrics OS_ROOT=/data/src/github.com/openshift/origin USE_LOCAL_SOURCE=true VERBOSE=1 ./ci_test_every_pr.sh...
/data/src/github.com/openshift/origin /data/src/github.com/openshift/origin-metrics/hack/tests
/data/src/github.com/openshift/origin-metrics/hack/tests
/data/src/github.com/openshift/origin-metrics /data/src/github.com/openshift/origin-metrics/hack/tests
/data/src/github.com/openshift/origin-metrics/hack/tests
[INFO] Starting metrics tests at Wed Feb 21 16:10:00 UTC 2018
Generated new key pair as /tmp/openshift/ci_test_every_pr/openshift.local.config/master/serviceaccounts.public.key and /tmp/openshift/ci_test_every_pr/openshift.local.config/master/serviceaccounts.private.key
Generating node credentials ...
Created node config for 172.18.10.151 in /tmp/openshift/ci_test_every_pr/openshift.local.config/node-172.18.10.151
Wrote master config to: /tmp/openshift/ci_test_every_pr/openshift.local.config/master/master-config.yaml
Running hack/lib/start.sh:349: executing 'oc get --raw /healthz --config='/tmp/openshift/ci_test_every_pr/openshift.local.config/master/admin.kubeconfig'' expecting any result and text 'ok'; re-trying every 0.25s until completion or 80.000s...
SUCCESS after 2.929s: hack/lib/start.sh:349: executing 'oc get --raw /healthz --config='/tmp/openshift/ci_test_every_pr/openshift.local.config/master/admin.kubeconfig'' expecting any result and text 'ok'; re-trying every 0.25s until completion or 80.000s
Standard output from the command:
Standard error from the command:
The connection to the server 172.18.10.151:8443 was refused - did you specify the right host or port?
... repeated 4 times
Error from server (Forbidden): User "system:admin" cannot "get" on "/healthz"
... repeated 2 times
Error from server (InternalError): an error on the server ("[+]ping ok\n[-]poststarthook/bootstrap-controller failed: not finished\n[+]poststarthook/extensions/third-party-resources ok\n[-]poststarthook/ca-registration failed: not finished\nhealthz check failed") has prevented the request from succeeding
Running hack/lib/start.sh:350: executing 'oc get --raw https://172.18.10.151:10250/healthz --config='/tmp/openshift/ci_test_every_pr/openshift.local.config/master/admin.kubeconfig'' expecting any result and text 'ok'; re-trying every 0.5s until completion or 120.000s...
SUCCESS after 0.171s: hack/lib/start.sh:350: executing 'oc get --raw https://172.18.10.151:10250/healthz --config='/tmp/openshift/ci_test_every_pr/openshift.local.config/master/admin.kubeconfig'' expecting any result and text 'ok'; re-trying every 0.5s until completion or 120.000s
There was no output from the command.
Standard error from the command:
Error from server (InternalError): an error on the server ("[+]ping ok\n[+]poststarthook/bootstrap-controller ok\n[+]poststarthook/extensions/third-party-resources ok\n[-]poststarthook/ca-registration failed: not finished\nhealthz check failed") has prevented the request from succeeding

Running hack/lib/start.sh:351: executing 'oc get --raw /healthz/ready --config='/tmp/openshift/ci_test_every_pr/openshift.local.config/master/admin.kubeconfig'' expecting any result and text 'ok'; re-trying every 0.25s until completion or 80.000s...
SUCCESS after 0.672s: hack/lib/start.sh:351: executing 'oc get --raw /healthz/ready --config='/tmp/openshift/ci_test_every_pr/openshift.local.config/master/admin.kubeconfig'' expecting any result and text 'ok'; re-trying every 0.25s until completion or 80.000s
Standard output from the command:
ok
Standard error from the command:
Error from server (InternalError): an error on the server ("") has prevented the request from succeeding
Running hack/lib/start.sh:352: executing 'oc get service kubernetes --namespace default --config='/tmp/openshift/ci_test_every_pr/openshift.local.config/master/admin.kubeconfig'' expecting success; re-trying every 0.25s until completion or 160.000s...
SUCCESS after 3.366s: hack/lib/start.sh:352: executing 'oc get service kubernetes --namespace default --config='/tmp/openshift/ci_test_every_pr/openshift.local.config/master/admin.kubeconfig'' expecting success; re-trying every 0.25s until completion or 160.000s
Standard output from the command:
NAME         CLUSTER-IP   EXTERNAL-IP   PORT(S)                 AGE
kubernetes   172.30.0.1   <none>        443/TCP,53/UDP,53/TCP   4s

There was no error output from the command.
Running hack/lib/start.sh:353: executing 'oc get --raw /api/v1/nodes/172.18.10.151 --config='/tmp/openshift/ci_test_every_pr/openshift.local.config/master/admin.kubeconfig'' expecting success; re-trying every 0.25s until completion or 80.000s...
SUCCESS after 0.181s: hack/lib/start.sh:353: executing 'oc get --raw /api/v1/nodes/172.18.10.151 --config='/tmp/openshift/ci_test_every_pr/openshift.local.config/master/admin.kubeconfig'' expecting success; re-trying every 0.25s until completion or 80.000s
Standard output from the command:
{"kind":"Node","apiVersion":"v1","metadata":{"name":"172.18.10.151","selfLink":"/api/v1/nodes172.18.10.151","uid":"b92af765-1721-11e8-9258-0e81d0a9bc9e","resourceVersion":"447","creationTimestamp":"2018-02-21T16:10:24Z","labels":{"beta.kubernetes.io/arch":"amd64","beta.kubernetes.io/os":"linux","kubernetes.io/hostname":"172.18.10.151"},"annotations":{"volumes.kubernetes.io/controller-managed-attach-detach":"true"}},"spec":{"externalID":"172.18.10.151","providerID":"aws:////i-00e725376b65aeda7"},"status":{"capacity":{"alpha.kubernetes.io/nvidia-gpu":"0","cpu":"4","memory":"7231292Ki","pods":"40"},"allocatable":{"alpha.kubernetes.io/nvidia-gpu":"0","cpu":"4","memory":"7231292Ki","pods":"40"},"conditions":[{"type":"OutOfDisk","status":"False","lastHeartbeatTime":"2018-02-21T16:10:24Z","lastTransitionTime":"2018-02-21T16:10:24Z","reason":"KubeletHasSufficientDisk","message":"kubelet has sufficient disk space available"},{"type":"MemoryPressure","status":"False","lastHeartbeatTime":"2018-02-21T16:10:24Z","lastTransitionTime":"2018-02-21T16:10:24Z","reason":"KubeletHasSufficientMemory","message":"kubelet has sufficient memory available"},{"type":"DiskPressure","status":"False","lastHeartbeatTime":"2018-02-21T16:10:24Z","lastTransitionTime":"2018-02-21T16:10:24Z","reason":"KubeletHasNoDiskPressure","message":"kubelet has no disk pressure"},{"type":"Ready","status":"False","lastHeartbeatTime":"2018-02-21T16:10:24Z","lastTransitionTime":"2018-02-21T16:10:24Z","reason":"KubeletNotReady","message":"container runtime is down"}],"addresses":[{"type":"LegacyHostIP","address":"172.18.10.151"},{"type":"InternalIP","address":"172.18.10.151"},{"type":"Hostname","address":"172.18.10.151"}],"daemonEndpoints":{"kubeletEndpoint":{"Port":10250}},"nodeInfo":{"machineID":"f9afeb75a5a382dce8269887a67fbf58","systemUUID":"0F1A2AEC-147A-7D38-733E-0D59B46D0BF2","bootID":"07e012a2-796e-4947-abf4-e29c6d02708e","kernelVersion":"3.10.0-327.22.2.el7.x86_64","osImage":"CentOS Linux 7 (Core)","containerRuntimeVersion":"docker://1.10.3","kubeletVersion":"v1.5.2+43a9be4","kubeProxyVersion":"v1.5.2+43a9be4","operatingSystem":"linux","architecture":"amd64"},"images":[{"names":["openshift/openvswitch:c106caf","openshift/openvswitch:latest"],"sizeBytes":1026697644},{"names":["openshift/node:c106caf","openshift/node:latest"],"sizeBytes":1025016185},{"names":["openshift/origin-gitserver:c106caf","openshift/origin-gitserver:latest"],"sizeBytes":1002075992},{"names":["openshift/origin-keepalived-ipfailover:c106caf","openshift/origin-keepalived-ipfailover:latest"],"sizeBytes":971721463},{"names":["openshift/origin-haproxy-router:c106caf","openshift/origin-haproxy-router:latest"],"sizeBytes":965766197},{"names":["openshift/origin-recycler:c106caf","openshift/origin-recycler:latest"],"sizeBytes":947041099},{"names":["openshift/origin-docker-builder:c106caf","openshift/origin-docker-builder:latest"],"sizeBytes":947041099},{"names":["openshift/origin-deployer:c106caf","openshift/origin-deployer:latest"],"sizeBytes":947041099},{"names":["openshift/origin-sti-builder:c106caf","openshift/origin-sti-builder:latest"],"sizeBytes":947041099},{"names":["openshift/origin-f5-router:c106caf","openshift/origin-f5-router:latest"],"sizeBytes":947041099},{"names":["openshift/origin:c106caf","openshift/origin:latest"],"sizeBytes":947041099},{"names":["docker.io/openshift/origin-release:golang-1.7"],"sizeBytes":857644817},{"names":["openshift/origin-release:latest"],"sizeBytes":719000618},{"names":["openshift/dind-master:latest"],"sizeBytes":474218996},{"names":["openshift/dind-node:latest"],"sizeBytes":474215272},{"names":["openshift/origin-docker-registry:c106caf","openshift/origin-docker-registry:latest"],"sizeBytes":468441298},{"names":["openshift/origin-egress-router:c106caf","openshift/origin-egress-router:latest"],"sizeBytes":420088533},{"names":["openshift/origin-base:latest"],"sizeBytes":402162201},{"names":["openshift/dind:latest"],"sizeBytes":384423296},{"names":["openshift/origin-haproxy-router-base:latest"],"sizeBytes":294278935},{"names":["docker.io/fedora:25"],"sizeBytes":230864375},{"names":["docker.io/centos:centos7"],"sizeBytes":196509652},{"names":["openshift/hello-openshift:c106caf","openshift/hello-openshift:latest"],"sizeBytes":5635062},{"names":["openshift/origin-pod:c106caf","openshift/origin-pod:latest"],"sizeBytes":1138998}]}}

There was no error output from the command.
info: password for stats user admin has been set to 2bDaAwkqa6
--> Creating router router ...
    serviceaccount "router" created
    clusterrolebinding "router-router-role" created
    deploymentconfig "router" created
    service "router" created
--> Success
serviceaccount "registry" created
clusterrolebinding "registry-registry-role" created
deploymentconfig "docker-registry" created
service "docker-registry" created
Running /data/src/github.com/openshift/origin/ci_test_every_pr.sh:90: executing 'oadm registry' expecting success...
SUCCESS after 0.441s: /data/src/github.com/openshift/origin/ci_test_every_pr.sh:90: executing 'oadm registry' expecting success
Standard output from the command:
Docker registry "docker-registry" service exists

There was no error output from the command.
Running /data/src/github.com/openshift/origin/ci_test_every_pr.sh:91: executing 'oadm router' expecting success...
SUCCESS after 0.240s: /data/src/github.com/openshift/origin/ci_test_every_pr.sh:91: executing 'oadm router' expecting success
Standard output from the command:
Router "router" service exists

There was no error output from the command.
Running /data/src/github.com/openshift/origin/ci_test_every_pr.sh:95: executing 'oadm policy add-cluster-role-to-user cluster-admin metrics-admin' expecting success...
SUCCESS after 0.205s: /data/src/github.com/openshift/origin/ci_test_every_pr.sh:95: executing 'oadm policy add-cluster-role-to-user cluster-admin metrics-admin' expecting success
Standard output from the command:
cluster role "cluster-admin" added: "metrics-admin"

There was no error output from the command.
Running /data/src/github.com/openshift/origin/ci_test_every_pr.sh:96: executing 'oadm policy add-cluster-role-to-user cluster-admin metrics-admin' expecting success...
SUCCESS after 0.202s: /data/src/github.com/openshift/origin/ci_test_every_pr.sh:96: executing 'oadm policy add-cluster-role-to-user cluster-admin metrics-admin' expecting success
Standard output from the command:
cluster role "cluster-admin" added: "metrics-admin"

There was no error output from the command.
Running /data/src/github.com/openshift/origin/ci_test_every_pr.sh:97: executing 'oc login -u metrics-admin -p g1b315H' expecting success...
SUCCESS after 0.318s: /data/src/github.com/openshift/origin/ci_test_every_pr.sh:97: executing 'oc login -u metrics-admin -p g1b315H' expecting success
Standard output from the command:
Login successful.

You have access to the following projects and can switch between them with 'oc project <projectname>':

  * default
    kube-system
    openshift
    openshift-infra

Using project "default".

There was no error output from the command.
+ Info ================================================================================
+ echo '[INFO]' ================================================================================
[INFO] ================================================================================
+ Info 'Starting Origin-Metric end-to-end test'
[INFO] Starting Origin-Metric end-to-end test
+ echo '[INFO]' Starting Origin-Metric end-to-end test
+ Info
[INFO]
+ echo '[INFO]'
+ Info Settings:
[INFO] Settings:
+ echo '[INFO]' Settings:
++ realpath /data/src/github.com/openshift/origin-metrics/hack/../hack/tests/../..
+ Info 'Base Directory: /data/src/github.com/openshift/origin-metrics'
[INFO] Base Directory: /data/src/github.com/openshift/origin-metrics
+ echo '[INFO]' Base Directory: /data/src/github.com/openshift/origin-metrics
+ Info ================================================================================
[INFO] ================================================================================
+ echo '[INFO]' ================================================================================
+ Info
[INFO]
+ echo '[INFO]'
++ date +%s
+ TEST_STARTTIME=1519229427
++ date +%s
+ export TEST_PROJECT=test-1519229427
+ TEST_PROJECT=test-1519229427
+ trap cleanup SIGINT SIGTERM EXIT
+ '[' true = true ']'
+ test.build
+ Info
[INFO]
+ echo '[INFO]'
+ Info 'Building new images'
[INFO] Building new images
+ echo '[INFO]' Building new images
+ sh /data/src/github.com/openshift/origin-metrics/hack/../hack/tests/../../hack/build-images.sh --no-cache


--- Building component '/data/src/github.com/openshift/origin-metrics/hack/../hack/tests/../../hack/../deployer/' with docker tag 'openshift/origin-metrics-deployer:latest' ---
Sending build context to Docker daemon 90.11 kB

Step 1 : FROM openshift/origin:latest
 ---> c95e934b9b09
Step 2 : MAINTAINER Hawkular Metrics <hawkular-dev@lists.jboss.org>
 ---> Running in f864b58451f7
 ---> db1d8ca1a970
Removing intermediate container f864b58451f7
Step 3 : ENV BIN_DIR /opt/deploy PROCESSING_DIR /etc/deploy/_output KUBECONFIG /etc/deploy/.kubeconfig WRITE_KUBECONFIG 1 SECRET_DIR /secret
 ---> Running in 71424bb03976
 ---> 83f0d30bb2ec
Removing intermediate container 71424bb03976
Step 4 : RUN yum install -y java-1.8.0-openjdk openssl httpd-tools bind-utils && yum clean all
 ---> Running in 7f6ea2b03af7
Loaded plugins: fastestmirror, ovl
Determining fastest mirrors
 * base: centos.mirror.constant.com
 * epel: s3-mirror-us-east-1.fedoraproject.org
 * extras: repos-va.psychz.net
 * updates: mirror.wdc1.us.leaseweb.net
Resolving Dependencies
--> Running transaction check
---> Package bind-utils.x86_64 32:9.9.4-51.el7_4.2 will be installed
--> Processing Dependency: bind-libs = 32:9.9.4-51.el7_4.2 for package: 32:bind-utils-9.9.4-51.el7_4.2.x86_64
--> Processing Dependency: liblwres.so.90()(64bit) for package: 32:bind-utils-9.9.4-51.el7_4.2.x86_64
--> Processing Dependency: libisccfg.so.90()(64bit) for package: 32:bind-utils-9.9.4-51.el7_4.2.x86_64
--> Processing Dependency: libisccc.so.90()(64bit) for package: 32:bind-utils-9.9.4-51.el7_4.2.x86_64
--> Processing Dependency: libisc.so.95()(64bit) for package: 32:bind-utils-9.9.4-51.el7_4.2.x86_64
--> Processing Dependency: libdns.so.100()(64bit) for package: 32:bind-utils-9.9.4-51.el7_4.2.x86_64
--> Processing Dependency: libbind9.so.90()(64bit) for package: 32:bind-utils-9.9.4-51.el7_4.2.x86_64
--> Processing Dependency: libGeoIP.so.1()(64bit) for package: 32:bind-utils-9.9.4-51.el7_4.2.x86_64
---> Package httpd-tools.x86_64 0:2.4.6-67.el7.centos.6 will be installed
--> Processing Dependency: libaprutil-1.so.0()(64bit) for package: httpd-tools-2.4.6-67.el7.centos.6.x86_64
--> Processing Dependency: libapr-1.so.0()(64bit) for package: httpd-tools-2.4.6-67.el7.centos.6.x86_64
---> Package java-1.8.0-openjdk.x86_64 1:1.8.0.161-0.b14.el7_4 will be installed
--> Processing Dependency: java-1.8.0-openjdk-headless(x86-64) = 1:1.8.0.161-0.b14.el7_4 for package: 1:java-1.8.0-openjdk-1.8.0.161-0.b14.el7_4.x86_64
--> Processing Dependency: xorg-x11-fonts-Type1 for package: 1:java-1.8.0-openjdk-1.8.0.161-0.b14.el7_4.x86_64
--> Processing Dependency: libpng15.so.15(PNG15_0)(64bit) for package: 1:java-1.8.0-openjdk-1.8.0.161-0.b14.el7_4.x86_64
--> Processing Dependency: libjvm.so(SUNWprivate_1.1)(64bit) for package: 1:java-1.8.0-openjdk-1.8.0.161-0.b14.el7_4.x86_64
--> Processing Dependency: libjpeg.so.62(LIBJPEG_6.2)(64bit) for package: 1:java-1.8.0-openjdk-1.8.0.161-0.b14.el7_4.x86_64
--> Processing Dependency: libjli.so(SUNWprivate_1.1)(64bit) for package: 1:java-1.8.0-openjdk-1.8.0.161-0.b14.el7_4.x86_64
--> Processing Dependency: libjava.so(SUNWprivate_1.1)(64bit) for package: 1:java-1.8.0-openjdk-1.8.0.161-0.b14.el7_4.x86_64
--> Processing Dependency: libasound.so.2(ALSA_0.9.0rc4)(64bit) for package: 1:java-1.8.0-openjdk-1.8.0.161-0.b14.el7_4.x86_64
--> Processing Dependency: libasound.so.2(ALSA_0.9)(64bit) for package: 1:java-1.8.0-openjdk-1.8.0.161-0.b14.el7_4.x86_64
--> Processing Dependency: fontconfig(x86-64) for package: 1:java-1.8.0-openjdk-1.8.0.161-0.b14.el7_4.x86_64
--> Processing Dependency: libpng15.so.15()(64bit) for package: 1:java-1.8.0-openjdk-1.8.0.161-0.b14.el7_4.x86_64
--> Processing Dependency: libjvm.so()(64bit) for package: 1:java-1.8.0-openjdk-1.8.0.161-0.b14.el7_4.x86_64
--> Processing Dependency: libjpeg.so.62()(64bit) for package: 1:java-1.8.0-openjdk-1.8.0.161-0.b14.el7_4.x86_64
--> Processing Dependency: libjli.so()(64bit) for package: 1:java-1.8.0-openjdk-1.8.0.161-0.b14.el7_4.x86_64
--> Processing Dependency: libjava.so()(64bit) for package: 1:java-1.8.0-openjdk-1.8.0.161-0.b14.el7_4.x86_64
--> Processing Dependency: libgif.so.4()(64bit) for package: 1:java-1.8.0-openjdk-1.8.0.161-0.b14.el7_4.x86_64
--> Processing Dependency: libawt.so()(64bit) for package: 1:java-1.8.0-openjdk-1.8.0.161-0.b14.el7_4.x86_64
--> Processing Dependency: libasound.so.2()(64bit) for package: 1:java-1.8.0-openjdk-1.8.0.161-0.b14.el7_4.x86_64
--> Processing Dependency: libXtst.so.6()(64bit) for package: 1:java-1.8.0-openjdk-1.8.0.161-0.b14.el7_4.x86_64
--> Processing Dependency: libXrender.so.1()(64bit) for package: 1:java-1.8.0-openjdk-1.8.0.161-0.b14.el7_4.x86_64
--> Processing Dependency: libXi.so.6()(64bit) for package: 1:java-1.8.0-openjdk-1.8.0.161-0.b14.el7_4.x86_64
--> Processing Dependency: libXext.so.6()(64bit) for package: 1:java-1.8.0-openjdk-1.8.0.161-0.b14.el7_4.x86_64
--> Processing Dependency: libXcomposite.so.1()(64bit) for package: 1:java-1.8.0-openjdk-1.8.0.161-0.b14.el7_4.x86_64
--> Processing Dependency: libX11.so.6()(64bit) for package: 1:java-1.8.0-openjdk-1.8.0.161-0.b14.el7_4.x86_64
---> Package openssl.x86_64 1:1.0.2k-8.el7 will be installed
--> Processing Dependency: openssl-libs(x86-64) = 1:1.0.2k-8.el7 for package: 1:openssl-1.0.2k-8.el7.x86_64
--> Processing Dependency: libcrypto.so.10(OPENSSL_1.0.2)(64bit) for package: 1:openssl-1.0.2k-8.el7.x86_64
--> Running transaction check
---> Package GeoIP.x86_64 0:1.5.0-11.el7 will be installed
---> Package alsa-lib.x86_64 0:1.1.3-3.el7 will be installed
---> Package apr.x86_64 0:1.4.8-3.el7_4.1 will be installed
---> Package apr-util.x86_64 0:1.5.2-6.el7 will be installed
---> Package bind-libs.x86_64 32:9.9.4-51.el7_4.2 will be installed
--> Processing Dependency: bind-license = 32:9.9.4-51.el7_4.2 for package: 32:bind-libs-9.9.4-51.el7_4.2.x86_64
---> Package fontconfig.x86_64 0:2.10.95-11.el7 will be installed
--> Processing Dependency: freetype for package: fontconfig-2.10.95-11.el7.x86_64
--> Processing Dependency: fontpackages-filesystem for package: fontconfig-2.10.95-11.el7.x86_64
--> Processing Dependency: font(:lang=en) for package: fontconfig-2.10.95-11.el7.x86_64
--> Processing Dependency: libfreetype.so.6()(64bit) for package: fontconfig-2.10.95-11.el7.x86_64
---> Package giflib.x86_64 0:4.1.6-9.el7 will be installed
--> Processing Dependency: libSM.so.6()(64bit) for package: giflib-4.1.6-9.el7.x86_64
--> Processing Dependency: libICE.so.6()(64bit) for package: giflib-4.1.6-9.el7.x86_64
---> Package java-1.8.0-openjdk-headless.x86_64 1:1.8.0.161-0.b14.el7_4 will be installed
--> Processing Dependency: tzdata-java >= 2015d for package: 1:java-1.8.0-openjdk-headless-1.8.0.161-0.b14.el7_4.x86_64
--> Processing Dependency: nss-softokn(x86-64) >= 3.28.3 for package: 1:java-1.8.0-openjdk-headless-1.8.0.161-0.b14.el7_4.x86_64
--> Processing Dependency: nss(x86-64) >= 3.28.4 for package: 1:java-1.8.0-openjdk-headless-1.8.0.161-0.b14.el7_4.x86_64
--> Processing Dependency: copy-jdk-configs >= 2.2 for package: 1:java-1.8.0-openjdk-headless-1.8.0.161-0.b14.el7_4.x86_64
--> Processing Dependency: chkconfig >= 1.7 for package: 1:java-1.8.0-openjdk-headless-1.8.0.161-0.b14.el7_4.x86_64
--> Processing Dependency: chkconfig >= 1.7 for package: 1:java-1.8.0-openjdk-headless-1.8.0.161-0.b14.el7_4.x86_64
--> Processing Dependency: lksctp-tools(x86-64) for package: 1:java-1.8.0-openjdk-headless-1.8.0.161-0.b14.el7_4.x86_64
--> Processing Dependency: jpackage-utils for package: 1:java-1.8.0-openjdk-headless-1.8.0.161-0.b14.el7_4.x86_64
---> Package libX11.x86_64 0:1.6.5-1.el7 will be installed
--> Processing Dependency: libX11-common >= 1.6.5-1.el7 for package: libX11-1.6.5-1.el7.x86_64
--> Processing Dependency: libxcb.so.1()(64bit) for package: libX11-1.6.5-1.el7.x86_64
---> Package libXcomposite.x86_64 0:0.4.4-4.1.el7 will be installed
---> Package libXext.x86_64 0:1.3.3-3.el7 will be installed
---> Package libXi.x86_64 0:1.7.9-1.el7 will be installed
---> Package libXrender.x86_64 0:0.9.10-1.el7 will be installed
---> Package libXtst.x86_64 0:1.2.3-1.el7 will be installed
---> Package libjpeg-turbo.x86_64 0:1.2.90-5.el7 will be installed
---> Package libpng.x86_64 2:1.5.13-7.el7_2 will be installed
---> Package openssl-libs.x86_64 1:1.0.1e-51.el7_2.7 will be updated
---> Package openssl-libs.x86_64 1:1.0.2k-8.el7 will be an update
---> Package xorg-x11-fonts-Type1.noarch 0:7.5-9.el7 will be installed
--> Processing Dependency: ttmkfdir for package: xorg-x11-fonts-Type1-7.5-9.el7.noarch
--> Processing Dependency: ttmkfdir for package: xorg-x11-fonts-Type1-7.5-9.el7.noarch
--> Processing Dependency: mkfontdir for package: xorg-x11-fonts-Type1-7.5-9.el7.noarch
--> Processing Dependency: mkfontdir for package: xorg-x11-fonts-Type1-7.5-9.el7.noarch
--> Running transaction check
---> Package bind-license.noarch 32:9.9.4-29.el7_2.4 will be updated
---> Package bind-license.noarch 32:9.9.4-51.el7_4.2 will be an update
---> Package chkconfig.x86_64 0:1.3.61-5.el7_2.1 will be updated
---> Package chkconfig.x86_64 0:1.7.4-1.el7 will be an update
---> Package copy-jdk-configs.noarch 0:2.2-5.el7_4 will be installed
---> Package fontpackages-filesystem.noarch 0:1.44-8.el7 will be installed
---> Package freetype.x86_64 0:2.4.11-15.el7 will be installed
---> Package javapackages-tools.noarch 0:3.4.1-11.el7 will be installed
--> Processing Dependency: python-javapackages = 3.4.1-11.el7 for package: javapackages-tools-3.4.1-11.el7.noarch
--> Processing Dependency: libxslt for package: javapackages-tools-3.4.1-11.el7.noarch
---> Package libICE.x86_64 0:1.0.9-9.el7 will be installed
---> Package libSM.x86_64 0:1.2.2-2.el7 will be installed
---> Package libX11-common.noarch 0:1.6.5-1.el7 will be installed
---> Package libxcb.x86_64 0:1.12-1.el7 will be installed
--> Processing Dependency: libXau.so.6()(64bit) for package: libxcb-1.12-1.el7.x86_64
---> Package lksctp-tools.x86_64 0:1.0.17-2.el7 will be installed
---> Package lyx-fonts.noarch 0:2.2.3-1.el7 will be installed
---> Package nss.x86_64 0:3.21.0-9.el7_2 will be updated
--> Processing Dependency: nss = 3.21.0-9.el7_2 for package: nss-sysinit-3.21.0-9.el7_2.x86_64
--> Processing Dependency: nss(x86-64) = 3.21.0-9.el7_2 for package: nss-tools-3.21.0-9.el7_2.x86_64
---> Package nss.x86_64 0:3.28.4-15.el7_4 will be an update
--> Processing Dependency: nss-util >= 3.28.4-2 for package: nss-3.28.4-15.el7_4.x86_64
--> Processing Dependency: nspr >= 4.13.1 for package: nss-3.28.4-15.el7_4.x86_64
--> Processing Dependency: nss-pem(x86-64) for package: nss-3.28.4-15.el7_4.x86_64
--> Processing Dependency: libnssutil3.so(NSSUTIL_3.24)(64bit) for package: nss-3.28.4-15.el7_4.x86_64
---> Package nss-softokn.x86_64 0:3.16.2.3-14.2.el7_2 will be updated
---> Package nss-softokn.x86_64 0:3.28.3-8.el7_4 will be an update
--> Processing Dependency: nss-softokn-freebl(x86-64) >= 3.28.3-8.el7_4 for package: nss-softokn-3.28.3-8.el7_4.x86_64
---> Package ttmkfdir.x86_64 0:3.0.9-42.el7 will be installed
---> Package tzdata-java.noarch 0:2018c-1.el7 will be installed
---> Package xorg-x11-font-utils.x86_64 1:7.5-20.el7 will be installed
--> Processing Dependency: libfontenc.so.1()(64bit) for package: 1:xorg-x11-font-utils-7.5-20.el7.x86_64
--> Processing Dependency: libXfont.so.1()(64bit) for package: 1:xorg-x11-font-utils-7.5-20.el7.x86_64
--> Running transaction check
---> Package libXau.x86_64 0:1.0.8-2.1.el7 will be installed
---> Package libXfont.x86_64 0:1.5.2-1.el7 will be installed
---> Package libfontenc.x86_64 0:1.1.3-3.el7 will be installed
---> Package libxslt.x86_64 0:1.1.28-5.el7 will be installed
---> Package nspr.x86_64 0:4.11.0-1.el7_2 will be updated
---> Package nspr.x86_64 0:4.13.1-1.0.el7_3 will be an update
---> Package nss-pem.x86_64 0:1.0.3-4.el7 will be installed
---> Package nss-softokn-freebl.x86_64 0:3.16.2.3-14.2.el7_2 will be updated
---> Package nss-softokn-freebl.x86_64 0:3.28.3-8.el7_4 will be an update
---> Package nss-sysinit.x86_64 0:3.21.0-9.el7_2 will be updated
---> Package nss-sysinit.x86_64 0:3.28.4-15.el7_4 will be an update
---> Package nss-tools.x86_64 0:3.21.0-9.el7_2 will be updated
---> Package nss-tools.x86_64 0:3.28.4-15.el7_4 will be an update
---> Package nss-util.x86_64 0:3.21.0-2.2.el7_2 will be updated
---> Package nss-util.x86_64 0:3.28.4-3.el7 will be an update
---> Package python-javapackages.noarch 0:3.4.1-11.el7 will be installed
--> Processing Dependency: python-lxml for package: python-javapackages-3.4.1-11.el7.noarch
--> Running transaction check
---> Package python-lxml.x86_64 0:3.2.1-4.el7 will be installed
--> Finished Dependency Resolution

Dependencies Resolved

================================================================================
 Package                      Arch    Version                    Repository
                                                                           Size
================================================================================
Installing:
 bind-utils                   x86_64  32:9.9.4-51.el7_4.2        updates  203 k
 httpd-tools                  x86_64  2.4.6-67.el7.centos.6      updates   88 k
 java-1.8.0-openjdk           x86_64  1:1.8.0.161-0.b14.el7_4    updates  243 k
 openssl                      x86_64  1:1.0.2k-8.el7             base     492 k
Installing for dependencies:
 GeoIP                        x86_64  1.5.0-11.el7               base     1.1 M
 alsa-lib                     x86_64  1.1.3-3.el7                base     421 k
 apr                          x86_64  1.4.8-3.el7_4.1            updates  103 k
 apr-util                     x86_64  1.5.2-6.el7                base      92 k
 bind-libs                    x86_64  32:9.9.4-51.el7_4.2        updates  1.0 M
 copy-jdk-configs             noarch  2.2-5.el7_4                updates   19 k
 fontconfig                   x86_64  2.10.95-11.el7             base     229 k
 fontpackages-filesystem      noarch  1.44-8.el7                 base     9.9 k
 freetype                     x86_64  2.4.11-15.el7              base     392 k
 giflib                       x86_64  4.1.6-9.el7                base      40 k
 java-1.8.0-openjdk-headless  x86_64  1:1.8.0.161-0.b14.el7_4    updates   32 M
 javapackages-tools           noarch  3.4.1-11.el7               base      73 k
 libICE                       x86_64  1.0.9-9.el7                base      66 k
 libSM                        x86_64  1.2.2-2.el7                base      39 k
 libX11                       x86_64  1.6.5-1.el7                base     606 k
 libX11-common                noarch  1.6.5-1.el7                base     164 k
 libXau                       x86_64  1.0.8-2.1.el7              base      29 k
 libXcomposite                x86_64  0.4.4-4.1.el7              base      22 k
 libXext                      x86_64  1.3.3-3.el7                base      39 k
 libXfont                     x86_64  1.5.2-1.el7                base     152 k
 libXi                        x86_64  1.7.9-1.el7                base      40 k
 libXrender                   x86_64  0.9.10-1.el7               base      26 k
 libXtst                      x86_64  1.2.3-1.el7                base      20 k
 libfontenc                   x86_64  1.1.3-3.el7                base      31 k
 libjpeg-turbo                x86_64  1.2.90-5.el7               base     134 k
 libpng                       x86_64  2:1.5.13-7.el7_2           base     213 k
 libxcb                       x86_64  1.12-1.el7                 base     211 k
 libxslt                      x86_64  1.1.28-5.el7               base     242 k
 lksctp-tools                 x86_64  1.0.17-2.el7               base      88 k
 lyx-fonts                    noarch  2.2.3-1.el7                epel     159 k
 nss-pem                      x86_64  1.0.3-4.el7                base      73 k
 python-javapackages          noarch  3.4.1-11.el7               base      31 k
 python-lxml                  x86_64  3.2.1-4.el7                base     758 k
 ttmkfdir                     x86_64  3.0.9-42.el7               base      48 k
 tzdata-java                  noarch  2018c-1.el7                updates  184 k
 xorg-x11-font-utils          x86_64  1:7.5-20.el7               base      87 k
 xorg-x11-fonts-Type1         noarch  7.5-9.el7                  base     521 k
Updating for dependencies:
 bind-license                 noarch  32:9.9.4-51.el7_4.2        updates   84 k
 chkconfig                    x86_64  1.7.4-1.el7                base     181 k
 nspr                         x86_64  4.13.1-1.0.el7_3           base     126 k
 nss                          x86_64  3.28.4-15.el7_4            updates  849 k
 nss-softokn                  x86_64  3.28.3-8.el7_4             updates  310 k
 nss-softokn-freebl           x86_64  3.28.3-8.el7_4             updates  214 k
 nss-sysinit                  x86_64  3.28.4-15.el7_4            updates   60 k
 nss-tools                    x86_64  3.28.4-15.el7_4            updates  501 k
 nss-util                     x86_64  3.28.4-3.el7               base      73 k
 openssl-libs                 x86_64  1:1.0.2k-8.el7             base     1.2 M

Transaction Summary
================================================================================
Install  4 Packages (+37 Dependent packages)
Upgrade             ( 10 Dependent packages)

Total download size: 43 M
Downloading packages:
Delta RPMs disabled because /usr/bin/applydeltarpm not installed.
warning: /var/cache/yum/x86_64/7/epel/packages/lyx-fonts-2.2.3-1.el7.noarch.rpm: Header V3 RSA/SHA256 Signature, key ID 352c64e5: NOKEY
Public key for lyx-fonts-2.2.3-1.el7.noarch.rpm is not installed
--------------------------------------------------------------------------------
Total                                               12 MB/s |  43 MB  00:03     
Retrieving key from file:///etc/pki/rpm-gpg/RPM-GPG-KEY-EPEL-7
Importing GPG key 0x352C64E5:
 Userid     : "Fedora EPEL (7) <epel@fedoraproject.org>"
 Fingerprint: 91e9 7d7c 4a5e 96f1 7f3e 888f 6a2f aea2 352c 64e5
 Package    : epel-release-7-9.noarch (@extras)
 From       : /etc/pki/rpm-gpg/RPM-GPG-KEY-EPEL-7
Running transaction check
Running transaction test
Transaction test succeeded
Running transaction
  Updating   : nspr-4.13.1-1.0.el7_3.x86_64                                1/61 
  Updating   : nss-util-3.28.4-3.el7.x86_64                                2/61 
  Installing : freetype-2.4.11-15.el7.x86_64                               3/61 
  Updating   : 1:openssl-libs-1.0.2k-8.el7.x86_64                          4/61 
  Installing : libfontenc-1.1.3-3.el7.x86_64                               5/61 
  Updating   : chkconfig-1.7.4-1.el7.x86_64                                6/61 
  Installing : GeoIP-1.5.0-11.el7.x86_64                                   7/61 
  Installing : apr-1.4.8-3.el7_4.1.x86_64                                  8/61 
  Installing : libxslt-1.1.28-5.el7.x86_64                                 9/61 
  Installing : fontpackages-filesystem-1.44-8.el7.noarch                  10/61 
  Installing : libjpeg-turbo-1.2.90-5.el7.x86_64                          11/61 
  Installing : libICE-1.0.9-9.el7.x86_64                                  12/61 
  Installing : libSM-1.2.2-2.el7.x86_64                                   13/61 
  Installing : lyx-fonts-2.2.3-1.el7.noarch                               14/61 
  Installing : fontconfig-2.10.95-11.el7.x86_64                           15/61 
  Installing : python-lxml-3.2.1-4.el7.x86_64                             16/61 
  Installing : python-javapackages-3.4.1-11.el7.noarch                    17/61 
  Installing : javapackages-tools-3.4.1-11.el7.noarch                     18/61 
  Installing : apr-util-1.5.2-6.el7.x86_64                                19/61 
  Installing : libXfont-1.5.2-1.el7.x86_64                                20/61 
  Installing : 1:xorg-x11-font-utils-7.5-20.el7.x86_64                    21/61 
  Installing : ttmkfdir-3.0.9-42.el7.x86_64                               22/61 
  Installing : xorg-x11-fonts-Type1-7.5-9.el7.noarch                      23/61 
  Updating   : nss-softokn-freebl-3.28.3-8.el7_4.x86_64                   24/61 
  Updating   : nss-softokn-3.28.3-8.el7_4.x86_64                          25/61 
  Updating   : nss-sysinit-3.28.4-15.el7_4.x86_64                         26/61 
  Updating   : nss-3.28.4-15.el7_4.x86_64                                 27/61 
  Installing : nss-pem-1.0.3-4.el7.x86_64                                 28/61 
  Installing : alsa-lib-1.1.3-3.el7.x86_64                                29/61 
  Installing : copy-jdk-configs-2.2-5.el7_4.noarch                        30/61 
  Installing : libXau-1.0.8-2.1.el7.x86_64                                31/61 
  Installing : libxcb-1.12-1.el7.x86_64                                   32/61 
  Updating   : 32:bind-license-9.9.4-51.el7_4.2.noarch                    33/61 
  Installing : 32:bind-libs-9.9.4-51.el7_4.2.x86_64                       34/61 
  Installing : libX11-common-1.6.5-1.el7.noarch                           35/61 
  Installing : libX11-1.6.5-1.el7.x86_64                                  36/61 
  Installing : libXext-1.3.3-3.el7.x86_64                                 37/61 
  Installing : libXi-1.7.9-1.el7.x86_64                                   38/61 
  Installing : libXtst-1.2.3-1.el7.x86_64                                 39/61 
  Installing : giflib-4.1.6-9.el7.x86_64                                  40/61 
  Installing : libXrender-0.9.10-1.el7.x86_64                             41/61 
  Installing : libXcomposite-0.4.4-4.1.el7.x86_64                         42/61 
  Installing : lksctp-tools-1.0.17-2.el7.x86_64                           43/61 
  Installing : tzdata-java-2018c-1.el7.noarch                             44/61 
  Installing : 1:java-1.8.0-openjdk-headless-1.8.0.161-0.b14.el7_4.x86_   45/61 
  Installing : 2:libpng-1.5.13-7.el7_2.x86_64                             46/61 
  Installing : 1:java-1.8.0-openjdk-1.8.0.161-0.b14.el7_4.x86_64          47/61 
  Installing : 32:bind-utils-9.9.4-51.el7_4.2.x86_64                      48/61 
  Updating   : nss-tools-3.28.4-15.el7_4.x86_64                           49/61 
  Installing : httpd-tools-2.4.6-67.el7.centos.6.x86_64                   50/61 
  Installing : 1:openssl-1.0.2k-8.el7.x86_64                              51/61 
  Cleanup    : nss-tools-3.21.0-9.el7_2.x86_64                            52/61 
  Cleanup    : 32:bind-license-9.9.4-29.el7_2.4.noarch                    53/61 
  Cleanup    : nss-3.21.0-9.el7_2.x86_64                                  54/61 
  Cleanup    : nss-sysinit-3.21.0-9.el7_2.x86_64                          55/61 
  Cleanup    : nss-softokn-3.16.2.3-14.2.el7_2.x86_64                     56/61 
  Cleanup    : nss-util-3.21.0-2.2.el7_2.x86_64                           57/61 
  Cleanup    : nspr-4.11.0-1.el7_2.x86_64                                 58/61 
  Cleanup    : nss-softokn-freebl-3.16.2.3-14.2.el7_2.x86_64              59/61 
  Cleanup    : chkconfig-1.3.61-5.el7_2.1.x86_64                          60/61 
  Cleanup    : 1:openssl-libs-1.0.1e-51.el7_2.7.x86_64                    61/61 
  Verifying  : libXext-1.3.3-3.el7.x86_64                                  1/61 
  Verifying  : libX11-1.6.5-1.el7.x86_64                                   2/61 
  Verifying  : libXi-1.7.9-1.el7.x86_64                                    3/61 
  Verifying  : 1:java-1.8.0-openjdk-1.8.0.161-0.b14.el7_4.x86_64           4/61 
  Verifying  : libICE-1.0.9-9.el7.x86_64                                   5/61 
  Verifying  : giflib-4.1.6-9.el7.x86_64                                   6/61 
  Verifying  : libjpeg-turbo-1.2.90-5.el7.x86_64                           7/61 
  Verifying  : nss-pem-1.0.3-4.el7.x86_64                                  8/61 
  Verifying  : libXrender-0.9.10-1.el7.x86_64                              9/61 
  Verifying  : lyx-fonts-2.2.3-1.el7.noarch                               10/61 
  Verifying  : python-lxml-3.2.1-4.el7.x86_64                             11/61 
  Verifying  : 2:libpng-1.5.13-7.el7_2.x86_64                             12/61 
  Verifying  : freetype-2.4.11-15.el7.x86_64                              13/61 
  Verifying  : 32:bind-libs-9.9.4-51.el7_4.2.x86_64                       14/61 
  Verifying  : fontpackages-filesystem-1.44-8.el7.noarch                  15/61 
  Verifying  : ttmkfdir-3.0.9-42.el7.x86_64                               16/61 
  Verifying  : nspr-4.13.1-1.0.el7_3.x86_64                               17/61 
  Verifying  : nss-util-3.28.4-3.el7.x86_64                               18/61 
  Verifying  : 1:openssl-1.0.2k-8.el7.x86_64                              19/61 
  Verifying  : tzdata-java-2018c-1.el7.noarch                             20/61 
  Verifying  : python-javapackages-3.4.1-11.el7.noarch                    21/61 
  Verifying  : nss-softokn-3.28.3-8.el7_4.x86_64                          22/61 
  Verifying  : httpd-tools-2.4.6-67.el7.centos.6.x86_64                   23/61 
  Verifying  : libXcomposite-0.4.4-4.1.el7.x86_64                         24/61 
  Verifying  : 1:openssl-libs-1.0.2k-8.el7.x86_64                         25/61 
  Verifying  : libXtst-1.2.3-1.el7.x86_64                                 26/61 
  Verifying  : 32:bind-utils-9.9.4-51.el7_4.2.x86_64                      27/61 
  Verifying  : lksctp-tools-1.0.17-2.el7.x86_64                           28/61 
  Verifying  : libX11-common-1.6.5-1.el7.noarch                           29/61 
  Verifying  : nss-sysinit-3.28.4-15.el7_4.x86_64                         30/61 
  Verifying  : libxcb-1.12-1.el7.x86_64                                   31/61 
  Verifying  : xorg-x11-fonts-Type1-7.5-9.el7.noarch                      32/61 
  Verifying  : nss-tools-3.28.4-15.el7_4.x86_64                           33/61 
  Verifying  : libxslt-1.1.28-5.el7.x86_64                                34/61 
  Verifying  : apr-util-1.5.2-6.el7.x86_64                                35/61 
  Verifying  : libXfont-1.5.2-1.el7.x86_64                                36/61 
  Verifying  : javapackages-tools-3.4.1-11.el7.noarch                     37/61 
  Verifying  : apr-1.4.8-3.el7_4.1.x86_64                                 38/61 
  Verifying  : 32:bind-license-9.9.4-51.el7_4.2.noarch                    39/61 
  Verifying  : libXau-1.0.8-2.1.el7.x86_64                                40/61 
  Verifying  : GeoIP-1.5.0-11.el7.x86_64                                  41/61 
  Verifying  : libSM-1.2.2-2.el7.x86_64                                   42/61 
  Verifying  : fontconfig-2.10.95-11.el7.x86_64                           43/61 
  Verifying  : copy-jdk-configs-2.2-5.el7_4.noarch                        44/61 
  Verifying  : 1:java-1.8.0-openjdk-headless-1.8.0.161-0.b14.el7_4.x86_   45/61 
  Verifying  : nss-3.28.4-15.el7_4.x86_64                                 46/61 
  Verifying  : chkconfig-1.7.4-1.el7.x86_64                               47/61 
  Verifying  : libfontenc-1.1.3-3.el7.x86_64                              48/61 
  Verifying  : nss-softokn-freebl-3.28.3-8.el7_4.x86_64                   49/61 
  Verifying  : alsa-lib-1.1.3-3.el7.x86_64                                50/61 
  Verifying  : 1:xorg-x11-font-utils-7.5-20.el7.x86_64                    51/61 
  Verifying  : 32:bind-license-9.9.4-29.el7_2.4.noarch                    52/61 
  Verifying  : nss-softokn-3.16.2.3-14.2.el7_2.x86_64                     53/61 
  Verifying  : nss-softokn-freebl-3.16.2.3-14.2.el7_2.x86_64              54/61 
  Verifying  : chkconfig-1.3.61-5.el7_2.1.x86_64                          55/61 
  Verifying  : nspr-4.11.0-1.el7_2.x86_64                                 56/61 
  Verifying  : nss-3.21.0-9.el7_2.x86_64                                  57/61 
  Verifying  : nss-tools-3.21.0-9.el7_2.x86_64                            58/61 
  Verifying  : nss-util-3.21.0-2.2.el7_2.x86_64                           59/61 
  Verifying  : 1:openssl-libs-1.0.1e-51.el7_2.7.x86_64                    60/61 
  Verifying  : nss-sysinit-3.21.0-9.el7_2.x86_64                          61/61 

Installed:
  bind-utils.x86_64 32:9.9.4-51.el7_4.2                                         
  httpd-tools.x86_64 0:2.4.6-67.el7.centos.6                                    
  java-1.8.0-openjdk.x86_64 1:1.8.0.161-0.b14.el7_4                             
  openssl.x86_64 1:1.0.2k-8.el7                                                 

Dependency Installed:
  GeoIP.x86_64 0:1.5.0-11.el7                                                   
  alsa-lib.x86_64 0:1.1.3-3.el7                                                 
  apr.x86_64 0:1.4.8-3.el7_4.1                                                  
  apr-util.x86_64 0:1.5.2-6.el7                                                 
  bind-libs.x86_64 32:9.9.4-51.el7_4.2                                          
  copy-jdk-configs.noarch 0:2.2-5.el7_4                                         
  fontconfig.x86_64 0:2.10.95-11.el7                                            
  fontpackages-filesystem.noarch 0:1.44-8.el7                                   
  freetype.x86_64 0:2.4.11-15.el7                                               
  giflib.x86_64 0:4.1.6-9.el7                                                   
  java-1.8.0-openjdk-headless.x86_64 1:1.8.0.161-0.b14.el7_4                    
  javapackages-tools.noarch 0:3.4.1-11.el7                                      
  libICE.x86_64 0:1.0.9-9.el7                                                   
  libSM.x86_64 0:1.2.2-2.el7                                                    
  libX11.x86_64 0:1.6.5-1.el7                                                   
  libX11-common.noarch 0:1.6.5-1.el7                                            
  libXau.x86_64 0:1.0.8-2.1.el7                                                 
  libXcomposite.x86_64 0:0.4.4-4.1.el7                                          
  libXext.x86_64 0:1.3.3-3.el7                                                  
  libXfont.x86_64 0:1.5.2-1.el7                                                 
  libXi.x86_64 0:1.7.9-1.el7                                                    
  libXrender.x86_64 0:0.9.10-1.el7                                              
  libXtst.x86_64 0:1.2.3-1.el7                                                  
  libfontenc.x86_64 0:1.1.3-3.el7                                               
  libjpeg-turbo.x86_64 0:1.2.90-5.el7                                           
  libpng.x86_64 2:1.5.13-7.el7_2                                                
  libxcb.x86_64 0:1.12-1.el7                                                    
  libxslt.x86_64 0:1.1.28-5.el7                                                 
  lksctp-tools.x86_64 0:1.0.17-2.el7                                            
  lyx-fonts.noarch 0:2.2.3-1.el7                                                
  nss-pem.x86_64 0:1.0.3-4.el7                                                  
  python-javapackages.noarch 0:3.4.1-11.el7                                     
  python-lxml.x86_64 0:3.2.1-4.el7                                              
  ttmkfdir.x86_64 0:3.0.9-42.el7                                                
  tzdata-java.noarch 0:2018c-1.el7                                              
  xorg-x11-font-utils.x86_64 1:7.5-20.el7                                       
  xorg-x11-fonts-Type1.noarch 0:7.5-9.el7                                       

Dependency Updated:
  bind-license.noarch 32:9.9.4-51.el7_4.2                                       
  chkconfig.x86_64 0:1.7.4-1.el7                                                
  nspr.x86_64 0:4.13.1-1.0.el7_3                                                
  nss.x86_64 0:3.28.4-15.el7_4                                                  
  nss-softokn.x86_64 0:3.28.3-8.el7_4                                           
  nss-softokn-freebl.x86_64 0:3.28.3-8.el7_4                                    
  nss-sysinit.x86_64 0:3.28.4-15.el7_4                                          
  nss-tools.x86_64 0:3.28.4-15.el7_4                                            
  nss-util.x86_64 0:3.28.4-3.el7                                                
  openssl-libs.x86_64 1:1.0.2k-8.el7                                            

Complete!
Loaded plugins: fastestmirror, ovl
Cleaning repos: base epel extras updates
Cleaning up everything
Cleaning up list of fastest mirrors
 ---> 16d66080c7e3
Removing intermediate container 7f6ea2b03af7
Step 5 : RUN mkdir -p ${HOME} ${PROCESSING_DIR} ${BIN_DIR} && chmod 777 ${HOME} && chmod 555 ${BIN_DIR}
 ---> Running in 60b3114be13d
 ---> d2b4e6d99694
Removing intermediate container 60b3114be13d
Step 6 : COPY . ${BIN_DIR}
 ---> a7644ee220fe
Removing intermediate container ee56d452ca8e
Step 7 : WORKDIR ${BIN_DIR}
 ---> Running in 93558c9eb7fb
 ---> 543aaab0628f
Removing intermediate container 93558c9eb7fb
Step 8 : ENTRYPOINT ./run.sh
 ---> Running in d256e0318bcc
 ---> 4015865eb16a
Removing intermediate container d256e0318bcc
Step 9 : USER 1000
 ---> Running in 739465aed0e0
 ---> 9807a2f3585a
Removing intermediate container 739465aed0e0
Successfully built 9807a2f3585a
--- openshift/origin-metrics-deployer:latest took 178 seconds ---




--- Building component '/data/src/github.com/openshift/origin-metrics/hack/../hack/tests/../../hack/../heapster/' with docker tag 'openshift/origin-metrics-heapster:latest' ---
Sending build context to Docker daemon 7.168 kB

Step 1 : FROM openshift/origin-metrics-heapster-base:v1.3.0-2
Trying to pull repository docker.io/openshift/origin-metrics-heapster-base ... 
v1.3.0-2: Pulling from docker.io/openshift/origin-metrics-heapster-base
93857f76ae30: Already exists
4e61ce2c52dd: Pulling fs layer
dd390b33ea7b: Pulling fs layer
3fc0170be004: Pulling fs layer
f4e99900d503: Pulling fs layer
dd390b33ea7b: Download complete
f4e99900d503: Verifying Checksum
f4e99900d503: Download complete
3fc0170be004: Verifying Checksum
3fc0170be004: Download complete
4e61ce2c52dd: Verifying Checksum
4e61ce2c52dd: Download complete
4e61ce2c52dd: Pull complete
4e61ce2c52dd: Pull complete
dd390b33ea7b: Pull complete
dd390b33ea7b: Pull complete
3fc0170be004: Pull complete
3fc0170be004: Pull complete
f4e99900d503: Pull complete
f4e99900d503: Pull complete
Digest: sha256:749fd880577885a94daccc5646410bc7964061ed35574db634e23f3a7e477643
Status: Downloaded newer image for docker.io/openshift/origin-metrics-heapster-base:v1.3.0-2
 ---> 0ebd3407458b
Step 2 : MAINTAINER Hawkular Metrics <hawkular-dev@lists.jboss.org>
 ---> Running in d9d0ddf654b5
 ---> 0057040943aa
Removing intermediate container d9d0ddf654b5
Step 3 : ADD heapster-wrapper.sh heapster-readiness.sh /opt/
 ---> b860d23ce0d7
Removing intermediate container 19565beae63b
Step 4 : ENTRYPOINT opt/heapster-wrapper.sh
 ---> Running in 6c67aad2a65c
 ---> aaa8faac91d9
Removing intermediate container 6c67aad2a65c
Successfully built aaa8faac91d9
--- openshift/origin-metrics-heapster:latest took 76 seconds ---




--- Building component '/data/src/github.com/openshift/origin-metrics/hack/../hack/tests/../../hack/../hawkular-metrics/' with docker tag 'openshift/origin-metrics-hawkular-metrics:latest' ---
Sending build context to Docker daemon 70.66 kB

Step 1 : FROM jboss/wildfly:10.1.0.Final
Trying to pull repository docker.io/jboss/wildfly ... 
10.1.0.Final: Pulling from docker.io/jboss/wildfly
af4b0a2388c6: Pulling fs layer
44f1f89300a7: Pulling fs layer
0fc9bad03e44: Pulling fs layer
471abe04f75a: Pulling fs layer
ec7d62043120: Pulling fs layer
ec7d62043120: Waiting
471abe04f75a: Waiting
0fc9bad03e44: Verifying Checksum
0fc9bad03e44: Download complete
44f1f89300a7: Verifying Checksum
44f1f89300a7: Download complete
af4b0a2388c6: Verifying Checksum
af4b0a2388c6: Download complete
471abe04f75a: Verifying Checksum
471abe04f75a: Download complete
ec7d62043120: Verifying Checksum
ec7d62043120: Download complete
af4b0a2388c6: Pull complete
af4b0a2388c6: Pull complete
44f1f89300a7: Pull complete
44f1f89300a7: Pull complete
0fc9bad03e44: Pull complete
0fc9bad03e44: Pull complete
471abe04f75a: Pull complete
471abe04f75a: Pull complete
ec7d62043120: Pull complete
ec7d62043120: Pull complete
Digest: sha256:4c7395589e815ff3464b0885dba4cbdcde4a0e4ae0ce13a0baf1564d2c90d5e4
Status: Downloaded newer image for docker.io/jboss/wildfly:10.1.0.Final
 ---> 95e490c1f9e7
Step 2 : MAINTAINER Hawkular Metrics <hawkular-dev@lists.jboss.org>
 ---> Running in 001e5ff60d2c
 ---> b256cc26460a
Removing intermediate container 001e5ff60d2c
Step 3 : ENV HAWKULAR_METRICS_ENDPOINT_PORT "8080" HAWKULAR_METRICS_VERSION "0.29.0.Final" HAWKULAR_METRICS_DIRECTORY "/opt/hawkular" HAWKULAR_METRICS_SCRIPT_DIRECTORY "/opt/hawkular/scripts/" PATH $PATH:$HAWKULAR_METRICS_SCRIPT_DIRECTORY JAVA_OPTS_APPEND "-XX:+HeapDumpOnOutOfMemoryError -XX:HeapDumpPath=/tmp/heapdump"
 ---> Running in 5ff50b53ab73
 ---> 44523a365954
Removing intermediate container 5ff50b53ab73
Step 4 : ARG DEV_BUILD="false"
 ---> Running in cee4decbdfa3
 ---> 48d03580d92e
Removing intermediate container cee4decbdfa3
Step 5 : EXPOSE 8080 8444
 ---> Running in 798499c01377
 ---> 824f99f0c9b0
Removing intermediate container 798499c01377
Step 6 : RUN cd $JBOSS_HOME/bin &&     curl -Lo $JBOSS_HOME/bin/jmx_prometheus_javaagent.jar https://repo1.maven.org/maven2/io/prometheus/jmx/jmx_prometheus_javaagent/0.9/jmx_prometheus_javaagent-0.9.jar
 ---> Running in b2fc0ffa75e3
  % Total    % Received % Xferd  Average Speed   Time    Time     Time  Current
                                 Dload  Upload   Total   Spent    Left  Speed

  0     0    0     0    0     0      0      0 --:--:-- --:--:-- --:--:--     0
100 1223k  100 1223k    0     0  4962k      0 --:--:-- --:--:-- --:--:-- 4973k
 ---> 7a3ddb31d5e0
Removing intermediate container b2fc0ffa75e3
Step 7 : COPY prometheus.yaml $JBOSS_HOME/standalone/configuration/prometheus.yaml
 ---> 7d1acf42a7ae
Removing intermediate container c846fc9bcee3
Step 8 : RUN mkdir /tmp/hawkular
 ---> Running in 802490a40305
 ---> 4219f337fec2
Removing intermediate container 802490a40305
Step 9 : COPY dev/* /tmp/hawkular/
No source files were specified
+ cleanup
+ out=1
+ trap test.cleanup SIGINT SIGTERM EXIT
+ '[' 1 -ne 0 ']'
+ Error 'Test failed'
[ERROR] Test failed
+ echo '[ERROR]' Test failed

+ echo
++ date +%s
+ ENDTIME=1519229736
+ '[' '' = true ']'
+ test.cleanup
+ Info
[INFO]
+ echo '[INFO]'
+ Info 'Deleting test project test-1519229427'
[INFO] Deleting test project test-1519229427
+ echo '[INFO]' Deleting test project test-1519229427
+ oc delete project test-1519229427
Error from server (NotFound): namespaces "test-1519229427" not found
+ exit
[ERROR] PID 1975: /data/src/github.com/openshift/origin/ci_test_every_pr.sh:99: `"${ORIGIN_METRICS_DIR}/hack/e2e-tests.sh" -x --test=DefaultInstall` exited with status 1.
[INFO] 		Stack Trace: 
[INFO] 		  1: /data/src/github.com/openshift/origin/ci_test_every_pr.sh:99: `"${ORIGIN_METRICS_DIR}/hack/e2e-tests.sh" -x --test=DefaultInstall`
[INFO]   Exiting with code 1.
>>>>>>>>>>>> ENV VARIABLES <<<<<<<<<<<<<<<<<<
ADMIN_KUBECONFIG=/tmp/openshift/ci_test_every_pr/openshift.local.config/master/admin.kubeconfig
API_BIND_HOST=172.18.10.151
API_HOST=172.18.10.151
API_PORT=8443
API_SCHEME=https
ARTIFACT_DIR=/tmp/openshift/ci_test_every_pr/artifacts
BASETMPDIR=/tmp/openshift/ci_test_every_pr
_=/bin/env
CLUSTER_ADMIN_CONTEXT=default/172-18-10-151:8443/system:admin
ETCD_DATA_DIR=/tmp/openshift/ci_test_every_pr/etcd
ETCD_HOST=127.0.0.1
ETCD_PEER_PORT=7001
ETCD_PORT=4001
FAKE_HOME_DIR=/tmp/openshift/ci_test_every_pr/openshift.local.home
GIT_BRANCH=master
GIT_URL=https://github.com/openshift/origin-metrics
GOPATH=/data
HISTCONTROL=ignoredups
HISTSIZE=1000
HOME=/home/centos
HOSTNAME=ip-172-18-10-151
KUBE_CACHE_MUTATION_DETECTOR=true
KUBECONFIG=/tmp/openshift/ci_test_every_pr/openshift.local.config/master/admin.kubeconfig
KUBELET_BIND_HOST=172.18.10.151
KUBELET_HOST=172.18.10.151
KUBELET_PORT=10250
KUBELET_SCHEME=https
LANG=en_US.UTF-8
LESSOPEN=||/usr/bin/lesspipe.sh %s
LOG_DIR=/tmp/openshift/ci_test_every_pr/logs
LOGGER_PID=2046
LOGNAME=centos
MAIL=/var/spool/mail/centos
MASTER_ADDR=https://172.18.10.151:8443
MASTER_CONFIG_DIR=/tmp/openshift/ci_test_every_pr/openshift.local.config/master
MAX_IMAGES_BULK_IMPORTED_PER_REPOSITORY=3
NODE_CONFIG_DIR=/tmp/openshift/ci_test_every_pr/openshift.local.config/node-172.18.10.151
NUM_OS_JUNIT_SUITES_IN_FLIGHT=1
NUM_OS_JUNIT_TESTS_IN_FLIGHT=0
OLDPWD=/data/src/github.com/openshift/origin-metrics/hack/tests
OPENSHIFT_ROUTER_IMAGE=openshift/origin-haproxy-router:c106caf
ORIGIN_METRICS_DIR=/data/src/github.com/openshift/origin-metrics
OS_ORIGINAL_WD=/data/src/github.com/openshift/origin
OS_PID=2252
OS_ROOT=/data/src/github.com/openshift/origin
OS_TMP_ENV_SET=ci_test_every_pr
OS_USE_STACKTRACE=true
PATH=/data/src/github.com/openshift/origin/_output/local/bin/linux/amd64:/data/bin:/data/bin:/data/src/github.com/openshift/origin/_output/etcd/bin:/data/src/github.com/openshift/origin/_output/local/bin/linux/amd64:/bin:/usr/local/sbin:/sbin:/bin:/usr/sbin:/usr/bin:/root/bin:/home/centos/.local/bin:/home/centos/bin
PUBLIC_MASTER_HOST=172.18.10.151
PWD=/data/src/github.com/openshift/origin
QTDIR=/usr/lib64/qt-3.3
QT_GRAPHICSSYSTEM_CHECKED=1
QT_GRAPHICSSYSTEM=native
QTINC=/usr/lib64/qt-3.3/include
QTLIB=/usr/lib64/qt-3.3/lib
SAR_LOGFILE=/tmp/openshift/ci_test_every_pr/logs/sar.log
SELINUX_LEVEL_REQUESTED=
SELINUX_ROLE_REQUESTED=
SELINUX_USE_CURRENT_RANGE=
SERVER_CONFIG_DIR=/tmp/openshift/ci_test_every_pr/openshift.local.config
SHELL=/bin/bash
SHLVL=3
SSH_CLIENT=50.17.198.52 34928 22
SSH_CONNECTION=50.17.198.52 34928 172.18.10.151 22
TAG=c106caf
TERM=vt100
TIME_MIN=60000
TIME_MS=1
TIME_SEC=1000
USE_IMAGES=openshift/origin-${component}:c106caf
USE_LOCAL_SOURCE=true
USER=centos
USE_SUDO=true
VERBOSE=1
VOLUME_DIR=/tmp/openshift/ci_test_every_pr/volumes
XDG_RUNTIME_DIR=/run/user/1000
XDG_SESSION_ID=5
>>>>>>>>>>>> END ENV VARIABLES <<<<<<<<<<<<<<

[FAIL] !!!!! Test Failed !!!!

[INFO] Dumping container logs to /tmp/openshift/ci_test_every_pr/logs/containers
[INFO] Dumping etcd contents to /tmp/openshift/ci_test_every_pr/artifacts/etcd_dump.json
[INFO] Tearing down test
[INFO] Stopping k8s docker containers
[INFO] Removing k8s docker containers
[INFO] Pruning etcd data directory...
[INFO] Cleanup complete
[INFO] Exiting at Wed Feb 21 16:15:42 UTC 2018
./ci_test_every_pr.sh took 344 seconds
Error while running ssh/sudo command: 
set -e
pushd /data/src/github.com/openshift//origin-metrics/hack/tests >/dev/null
export PATH=$GOPATH/bin:$PATH

echo '***************************************************'
echo 'Running GIT_URL=https://github.com/openshift/origin-metrics GIT_BRANCH=master ORIGIN_METRICS_DIR=/data/src/github.com/openshift/origin-metrics OS_ROOT=/data/src/github.com/openshift/origin USE_LOCAL_SOURCE=true VERBOSE=1 ./ci_test_every_pr.sh...'
time GIT_URL=https://github.com/openshift/origin-metrics GIT_BRANCH=master ORIGIN_METRICS_DIR=/data/src/github.com/openshift/origin-metrics OS_ROOT=/data/src/github.com/openshift/origin USE_LOCAL_SOURCE=true VERBOSE=1 ./ci_test_every_pr.sh
echo 'Finished GIT_URL=https://github.com/openshift/origin-metrics GIT_BRANCH=master ORIGIN_METRICS_DIR=/data/src/github.com/openshift/origin-metrics OS_ROOT=/data/src/github.com/openshift/origin USE_LOCAL_SOURCE=true VERBOSE=1 ./ci_test_every_pr.sh'
echo '***************************************************'

popd >/dev/null
        
The SSH command responded with a non-zero exit status. Vagrant
assumes that this means the command failed. The output for this command
should be in the log above. Please read the output to determine what
went wrong.
==> openshiftdev: Downloading logs
==> openshiftdev: Downloading artifacts from '/var/log/yum.log' to '/var/lib/jenkins/jobs/test-origin-metrics/workspace/origin/artifacts/yum.log'
==> openshiftdev: Downloading artifacts from '/var/log/secure' to '/var/lib/jenkins/jobs/test-origin-metrics/workspace/origin/artifacts/secure'
==> openshiftdev: Downloading artifacts from '/var/log/audit/audit.log' to '/var/lib/jenkins/jobs/test-origin-metrics/workspace/origin/artifacts/audit.log'
==> openshiftdev: /tmp/origin-metrics/ did not exist on the remote system.  This is often the case for tests that were not run.
Build step 'Execute shell' marked build as failure
[description-setter] Description set: <a href="https://github.com/openshift/origin-metrics/pull/402">https://github.com/openshift/origin-metrics/pull/402</a>
[PostBuildScript] - Execution post build scripts.
[workspace] $ /bin/sh -xe /tmp/jenkins4686829203025632764.sh
+ INSTANCE_NAME=origin_metrics-centos7-307
+ pushd origin
~/jobs/test-origin-metrics/workspace/origin ~/jobs/test-origin-metrics/workspace
+ '[' -f .vagrant-openshift.json ']'
+ /usr/bin/vagrant destroy -f
==> openshiftdev: Terminating the instance...
==> openshiftdev: Running cleanup tasks for 'shell' provisioner...
+ popd
~/jobs/test-origin-metrics/workspace
[BFA] Scanning build for known causes...
[BFA] Found failure cause(s):
[BFA] Command Failure from category failure
[BFA] Done. 0s
Finished: FAILURE