Console Output

Started by remote host 50.17.198.52
[EnvInject] - Loading node environment variables.
Building in workspace /var/lib/jenkins/jobs/test-origin-metrics/workspace
Run condition [And] enabling prebuild for step [BuilderChain]
[EnvInject] - Injecting environment variables from a build step.
[EnvInject] - Injecting as environment variables the properties content 
OS_ROOT=/data/src/github.com/openshift/origin
INSTANCE_TYPE=c4.xlarge
GIT_BRANCH=master
GITHUB_REPO=openshift
OS=centos7
TESTNAME=metrics

[EnvInject] - Variables injected successfully.
[workspace] $ /bin/sh -xe /tmp/jenkins615915543306983909.sh
+ true
+ approve.sh origin-metrics master none
+ vagrant origin-local-checkout --replace --repo origin-metrics
You don't seem to have the GOPATH environment variable set on your system.
See: 'go help gopath' for more details about GOPATH.
Waiting for the cloning process to finish
Checking repo integrity for /var/lib/jenkins/jobs/test-origin-metrics/workspace/origin-metrics
~/jobs/test-origin-metrics/workspace/origin-metrics ~/jobs/test-origin-metrics/workspace
# On branch master
# Your branch is ahead of 'origin/master' by 3 commits.
#   (use "git push" to publish your local commits)
#
nothing to commit, working directory clean
~/jobs/test-origin-metrics/workspace
Replacing: /var/lib/jenkins/jobs/test-origin-metrics/workspace/origin-metrics
~/jobs/test-origin-metrics/workspace/origin-metrics ~/jobs/test-origin-metrics/workspace
From https://github.com/openshift/origin-metrics
   266314d..9f18fe0  master     -> origin/master
Already on 'master'
Your branch and 'origin/master' have diverged,
and have 1 and 1 different commit each, respectively.
  (use "git pull" to merge the remote branch into yours)
HEAD is now at 9f18fe0 Merge pull request #401 from jsanda/dev-build-support
Deleted branch tpr_dev-build-support_jsanda (was 1bfaf5c).
~/jobs/test-origin-metrics/workspace
Origin repositories cloned into /var/lib/jenkins/jobs/test-origin-metrics/workspace
+ '[' -n 403 ']'
+ set +x


*****Locally Merging Pull Request: https://github.com/openshift/origin-metrics/pull/403
+ test_pull_requests --local_merge_pull_request 403 --repo origin-metrics --config /var/lib/jenkins/.test_pull_requests_metrics.json
WARNING: Cache won't persist between runs.
  *** Starting with empty cache
Rate limit remaining: 4302
  Checking if current base repo commit ID matches what we expect
Local merging pull request #403 for repo 'origin-metrics' against base repo commit id 9f18fe06284aaa406b9521c4280363b54e754361 from pr branch commit id 77eb38ff0c8bd5dd8512e787f6434fb754325c22
+ pushd origin-metrics
+ git checkout master
Already on 'master'
+ git checkout -b tpr_BZ-1539830_rubenvp8510
Switched to a new branch 'tpr_BZ-1539830_rubenvp8510'
+ git pull git@github.com:rubenvp8510/origin-metrics.git BZ-1539830
From github.com:rubenvp8510/origin-metrics
 * branch            BZ-1539830 -> FETCH_HEAD
+ git pull git@github.com:rubenvp8510/origin-metrics.git BZ-1539830 --tags
From github.com:rubenvp8510/origin-metrics
 * branch            BZ-1539830 -> FETCH_HEAD
+ git checkout master
Switched to branch 'master'
+ git merge tpr_BZ-1539830_rubenvp8510
+ git submodule update --recursive
+ popd

Rate limit resets in: 543s, at 2018-02-23T17:32:14-05:00 (1519425134)
Rate limit remaining: 4298; delta: 4
Rate limit is not too low.
Would run.
Cache stats: Hits: 0, Misses: 4, Bypass: 0
      (raw): [:fresh, 0, :invalid, 0, :miss, 4, :unacceptable, 0, :valid, 0]

Done
~/jobs/test-origin-metrics/workspace/origin-metrics ~/jobs/test-origin-metrics/workspace
Merge made by the 'recursive' strategy.
 cassandra/cassandra.yaml.template | 2 +-
 1 file changed, 1 insertion(+), 1 deletion(-)
Already up-to-date.
Updating 9f18fe0..3181d81
Fast-forward
 cassandra/cassandra.yaml.template | 2 +-
 1 file changed, 1 insertion(+), 1 deletion(-)
~/jobs/test-origin-metrics/workspace
+ vagrant origin-local-checkout --replace
You don't seem to have the GOPATH environment variable set on your system.
See: 'go help gopath' for more details about GOPATH.
Waiting for the cloning process to finish
Checking repo integrity for /var/lib/jenkins/jobs/test-origin-metrics/workspace/origin
~/jobs/test-origin-metrics/workspace/origin ~/jobs/test-origin-metrics/workspace
# On branch master
# Untracked files:
#   (use "git add <file>..." to include in what will be committed)
#
#	artifacts/
nothing added to commit but untracked files present (use "git add" to track)
~/jobs/test-origin-metrics/workspace
Replacing: /var/lib/jenkins/jobs/test-origin-metrics/workspace/origin
~/jobs/test-origin-metrics/workspace/origin ~/jobs/test-origin-metrics/workspace
From https://github.com/openshift/origin
   e28a3b2..6639410  master     -> origin/master
Already on 'master'
Your branch is behind 'origin/master' by 3 commits, and can be fast-forwarded.
  (use "git pull" to update your local branch)
HEAD is now at 6639410 Merge pull request #18720 from danwinship/fix-egress-ip-reassignment
Removing .vagrant-openshift.json
Removing .vagrant/
Removing artifacts/
fatal: branch name required
~/jobs/test-origin-metrics/workspace
Origin repositories cloned into /var/lib/jenkins/jobs/test-origin-metrics/workspace
+ pushd origin
~/jobs/test-origin-metrics/workspace/origin ~/jobs/test-origin-metrics/workspace
+ INSTANCE_NAME=origin_metrics-centos7-312
+ GIT_URL=https://github.com/openshift/origin-metrics
++ echo https://github.com/openshift/origin-metrics
++ sed s,https://,,
+ OMETRICS_LOCAL_PATH=github.com/openshift/origin-metrics
+ ORIGIN_METRICS_DIR=/data/src/github.com/openshift/origin-metrics
+ env
+ sort
_=/bin/env
BUILD_CAUSE=REMOTECAUSE
BUILD_CAUSE_REMOTECAUSE=true
BUILD_DISPLAY_NAME=#312
BUILD_ID=312
BUILD_NUMBER=312
BUILD_TAG=jenkins-test-origin-metrics-312
BUILD_URL=https://ci.openshift.redhat.com/jenkins/job/test-origin-metrics/312/
EXECUTOR_NUMBER=20
GIT_BRANCH=master
GITHUB_REPO=openshift
HOME=/var/lib/jenkins
HUDSON_COOKIE=aee97fcd-12ca-43b0-85ea-dfe3374090df
HUDSON_HOME=/var/lib/jenkins
HUDSON_SERVER_COOKIE=ec11f8b2841c966f
HUDSON_URL=https://ci.openshift.redhat.com/jenkins/
INSTANCE_TYPE=c4.xlarge
JENKINS_HOME=/var/lib/jenkins
JENKINS_SERVER_COOKIE=ec11f8b2841c966f
JENKINS_URL=https://ci.openshift.redhat.com/jenkins/
JOB_BASE_NAME=test-origin-metrics
JOB_DISPLAY_URL=https://ci.openshift.redhat.com/jenkins/job/test-origin-metrics/display/redirect
JOB_NAME=test-origin-metrics
JOB_URL=https://ci.openshift.redhat.com/jenkins/job/test-origin-metrics/
LANG=en_US.UTF-8
LOGNAME=jenkins
MERGE_SEVERITY=none
MERGE=true
METRICS_PULL_ID=403
NLSPATH=/usr/dt/lib/nls/msg/%L/%N.cat
NODE_LABELS=master
NODE_NAME=master
OLDPWD=/var/lib/jenkins/jobs/test-origin-metrics/workspace
OS=centos7
OS_ROOT=/data/src/github.com/openshift/origin
PATH=/sbin:/usr/sbin:/bin:/usr/bin
PWD=/var/lib/jenkins/jobs/test-origin-metrics/workspace/origin
ROOT_BUILD_CAUSE=REMOTECAUSE
ROOT_BUILD_CAUSE_REMOTECAUSE=true
RUN_CHANGES_DISPLAY_URL=https://ci.openshift.redhat.com/jenkins/job/test-origin-metrics/312/display/redirect?page=changes
RUN_DISPLAY_URL=https://ci.openshift.redhat.com/jenkins/job/test-origin-metrics/312/display/redirect
SHELL=/bin/bash
SHLVL=3
TESTNAME=metrics
USER=jenkins
WORKSPACE=/var/lib/jenkins/jobs/test-origin-metrics/workspace
XFILESEARCHPATH=/usr/dt/app-defaults/%L/Dt
+ vagrant origin-init --stage inst --os centos7 --instance-type c4.xlarge origin_metrics-centos7-312
Reading AWS credentials from /var/lib/jenkins/.awscred
Searching devenv-centos7_* for latest base AMI (required_name_tag=)
Found: ami-2fb42b39 (devenv-centos7_6170)
++ seq 0 2
+ for i in '$(seq 0 2)'
+ vagrant up --provider aws
Bringing machine 'openshiftdev' up with 'aws' provider...
==> openshiftdev: Warning! The AWS provider doesn't support any of the Vagrant
==> openshiftdev: high-level network configurations (`config.vm.network`). They
==> openshiftdev: will be silently ignored.
==> openshiftdev: Warning! You're launching this instance into a VPC without an
==> openshiftdev: elastic IP. Please verify you're properly connected to a VPN so
==> openshiftdev: you can access this machine, otherwise Vagrant will not be able
==> openshiftdev: to SSH into it.
==> openshiftdev: Launching an instance with the following settings...
==> openshiftdev:  -- Type: c4.xlarge
==> openshiftdev:  -- AMI: ami-2fb42b39
==> openshiftdev:  -- Region: us-east-1
==> openshiftdev:  -- Keypair: libra
==> openshiftdev:  -- Subnet ID: subnet-cf57c596
==> openshiftdev:  -- User Data: yes
==> openshiftdev:  -- User Data: 
==> openshiftdev: # cloud-config
==> openshiftdev: 
==> openshiftdev: growpart:
==> openshiftdev:   mode: auto
==> openshiftdev:   devices: ['/']
==> openshiftdev: runcmd:
==> openshiftdev: - [ sh, -xc, "sed -i s/^Defaults.*requiretty/#Defaults requiretty/g /etc/sudoers"]
==> openshiftdev:         
==> openshiftdev:  -- Block Device Mapping: [{"DeviceName"=>"/dev/sda1", "Ebs.VolumeSize"=>25, "Ebs.VolumeType"=>"gp2"}, {"DeviceName"=>"/dev/sdb", "Ebs.VolumeSize"=>35, "Ebs.VolumeType"=>"gp2"}]
==> openshiftdev:  -- Terminate On Shutdown: false
==> openshiftdev:  -- Monitoring: false
==> openshiftdev:  -- EBS optimized: false
==> openshiftdev:  -- Assigning a public IP address in a VPC: false
==> openshiftdev: Waiting for instance to become "ready"...
==> openshiftdev: Waiting for SSH to become available...
==> openshiftdev: Machine is booted and ready for use!
==> openshiftdev: Running provisioner: setup (shell)...
    openshiftdev: Running: /tmp/vagrant-shell20180223-19748-hhvsof.sh
==> openshiftdev: Host: ec2-54-152-113-158.compute-1.amazonaws.com
+ break
+ vagrant sync-origin-metrics -c -s
Running ssh/sudo command 'rm -rf /data/src/github.com/openshift/origin-metrics-bare; 
' with timeout 14400. Attempt #0
Running ssh/sudo command 'mkdir -p /centos/.ssh;
mv /tmp/file20180223-20636-1tnr7ce /centos/.ssh/config &&
chown centos:centos /centos/.ssh/config &&
chmod 0600 /centos/.ssh/config' with timeout 14400. Attempt #0
Running ssh/sudo command 'mkdir -p /data/src/github.com/openshift/' with timeout 14400. Attempt #0
Running ssh/sudo command 'mkdir -p /data/src/github.com/openshift/builder && chown -R centos:centos /data/src/github.com/openshift/' with timeout 14400. Attempt #0
Running ssh/sudo command 'set -e
rm -fr /data/src/github.com/openshift/origin-metrics-bare;

if [ ! -d /data/src/github.com/openshift/origin-metrics-bare ]; then
git clone --quiet --bare https://github.com/openshift/origin-metrics.git /data/src/github.com/openshift/origin-metrics-bare >/dev/null
fi
' with timeout 14400. Attempt #0
Synchronizing local sources
Synchronizing [origin-metrics@master] from origin-metrics...
Warning: Permanently added '54.152.113.158' (ECDSA) to the list of known hosts.
Running ssh/sudo command 'set -e

if [ -d /data/src/github.com/openshift/origin-metrics-bare ]; then
rm -rf /data/src/github.com/openshift/origin-metrics
echo 'Cloning origin-metrics ...'
git clone --quiet --recurse-submodules /data/src/github.com/openshift/origin-metrics-bare /data/src/github.com/openshift/origin-metrics

else
MISSING_REPO+='origin-metrics-bare'
fi

if [ -n "$MISSING_REPO" ]; then
echo 'Missing required upstream repositories:'
echo $MISSING_REPO
echo 'To fix, execute command: vagrant clone-upstream-repos'
fi
' with timeout 14400. Attempt #0
Cloning origin-metrics ...
+ vagrant ssh -c 'if [ ! -d /tmp/openshift ] ; then mkdir /tmp/openshift ; fi ; sudo chmod 777 /tmp/openshift'
+ vagrant test-origin-metrics -d --env GIT_URL=https://github.com/openshift/origin-metrics --env GIT_BRANCH=master --env ORIGIN_METRICS_DIR=/data/src/github.com/openshift/origin-metrics --env OS_ROOT=/data/src/github.com/openshift/origin --env USE_LOCAL_SOURCE=true --env VERBOSE=1
***************************************************
Running GIT_URL=https://github.com/openshift/origin-metrics GIT_BRANCH=master ORIGIN_METRICS_DIR=/data/src/github.com/openshift/origin-metrics OS_ROOT=/data/src/github.com/openshift/origin USE_LOCAL_SOURCE=true VERBOSE=1 ./ci_test_every_pr.sh...
/data/src/github.com/openshift/origin /data/src/github.com/openshift/origin-metrics/hack/tests
/data/src/github.com/openshift/origin-metrics/hack/tests
/data/src/github.com/openshift/origin-metrics /data/src/github.com/openshift/origin-metrics/hack/tests
/data/src/github.com/openshift/origin-metrics/hack/tests
[INFO] Starting metrics tests at Fri Feb 23 22:26:33 UTC 2018
Generated new key pair as /tmp/openshift/ci_test_every_pr/openshift.local.config/master/serviceaccounts.public.key and /tmp/openshift/ci_test_every_pr/openshift.local.config/master/serviceaccounts.private.key
Generating node credentials ...
Created node config for 172.18.13.94 in /tmp/openshift/ci_test_every_pr/openshift.local.config/node-172.18.13.94
Wrote master config to: /tmp/openshift/ci_test_every_pr/openshift.local.config/master/master-config.yaml
Running hack/lib/start.sh:349: executing 'oc get --raw /healthz --config='/tmp/openshift/ci_test_every_pr/openshift.local.config/master/admin.kubeconfig'' expecting any result and text 'ok'; re-trying every 0.25s until completion or 80.000s...
SUCCESS after 2.131s: hack/lib/start.sh:349: executing 'oc get --raw /healthz --config='/tmp/openshift/ci_test_every_pr/openshift.local.config/master/admin.kubeconfig'' expecting any result and text 'ok'; re-trying every 0.25s until completion or 80.000s
Standard output from the command:
Standard error from the command:
The connection to the server 172.18.13.94:8443 was refused - did you specify the right host or port?
... repeated 2 times
Error from server (Forbidden): User "system:admin" cannot "get" on "/healthz"
... repeated 2 times
Error from server (InternalError): an error on the server ("[+]ping ok\n[-]poststarthook/bootstrap-controller failed: not finished\n[+]poststarthook/extensions/third-party-resources ok\n[-]poststarthook/ca-registration failed: not finished\nhealthz check failed") has prevented the request from succeeding
Running hack/lib/start.sh:350: executing 'oc get --raw https://172.18.13.94:10250/healthz --config='/tmp/openshift/ci_test_every_pr/openshift.local.config/master/admin.kubeconfig'' expecting any result and text 'ok'; re-trying every 0.5s until completion or 120.000s...
SUCCESS after 0.188s: hack/lib/start.sh:350: executing 'oc get --raw https://172.18.13.94:10250/healthz --config='/tmp/openshift/ci_test_every_pr/openshift.local.config/master/admin.kubeconfig'' expecting any result and text 'ok'; re-trying every 0.5s until completion or 120.000s
There was no output from the command.
Standard error from the command:
Error from server (InternalError): an error on the server ("[+]ping ok\n[-]poststarthook/bootstrap-controller failed: not finished\n[+]poststarthook/extensions/third-party-resources ok\n[-]poststarthook/ca-registration failed: not finished\nhealthz check failed") has prevented the request from succeeding

Running hack/lib/start.sh:351: executing 'oc get --raw /healthz/ready --config='/tmp/openshift/ci_test_every_pr/openshift.local.config/master/admin.kubeconfig'' expecting any result and text 'ok'; re-trying every 0.25s until completion or 80.000s...
SUCCESS after 0.681s: hack/lib/start.sh:351: executing 'oc get --raw /healthz/ready --config='/tmp/openshift/ci_test_every_pr/openshift.local.config/master/admin.kubeconfig'' expecting any result and text 'ok'; re-trying every 0.25s until completion or 80.000s
Standard output from the command:
ok
Standard error from the command:
Error from server (InternalError): an error on the server ("") has prevented the request from succeeding
Running hack/lib/start.sh:352: executing 'oc get service kubernetes --namespace default --config='/tmp/openshift/ci_test_every_pr/openshift.local.config/master/admin.kubeconfig'' expecting success; re-trying every 0.25s until completion or 160.000s...
SUCCESS after 3.398s: hack/lib/start.sh:352: executing 'oc get service kubernetes --namespace default --config='/tmp/openshift/ci_test_every_pr/openshift.local.config/master/admin.kubeconfig'' expecting success; re-trying every 0.25s until completion or 160.000s
Standard output from the command:
NAME         CLUSTER-IP   EXTERNAL-IP   PORT(S)                 AGE
kubernetes   172.30.0.1   <none>        443/TCP,53/UDP,53/TCP   4s

There was no error output from the command.
Running hack/lib/start.sh:353: executing 'oc get --raw /api/v1/nodes/172.18.13.94 --config='/tmp/openshift/ci_test_every_pr/openshift.local.config/master/admin.kubeconfig'' expecting success; re-trying every 0.25s until completion or 80.000s...
SUCCESS after 0.659s: hack/lib/start.sh:353: executing 'oc get --raw /api/v1/nodes/172.18.13.94 --config='/tmp/openshift/ci_test_every_pr/openshift.local.config/master/admin.kubeconfig'' expecting success; re-trying every 0.25s until completion or 80.000s
Standard output from the command:
{"kind":"Node","apiVersion":"v1","metadata":{"name":"172.18.13.94","selfLink":"/api/v1/nodes172.18.13.94","uid":"abad0ec7-18e8-11e8-8b27-0ec85fc73212","resourceVersion":"459","creationTimestamp":"2018-02-23T22:27:02Z","labels":{"beta.kubernetes.io/arch":"amd64","beta.kubernetes.io/os":"linux","kubernetes.io/hostname":"172.18.13.94"},"annotations":{"volumes.kubernetes.io/controller-managed-attach-detach":"true"}},"spec":{"externalID":"172.18.13.94","providerID":"aws:////i-0082c3187e37b0fb8"},"status":{"capacity":{"alpha.kubernetes.io/nvidia-gpu":"0","cpu":"4","memory":"7231292Ki","pods":"40"},"allocatable":{"alpha.kubernetes.io/nvidia-gpu":"0","cpu":"4","memory":"7231292Ki","pods":"40"},"conditions":[{"type":"OutOfDisk","status":"False","lastHeartbeatTime":"2018-02-23T22:27:02Z","lastTransitionTime":"2018-02-23T22:27:02Z","reason":"KubeletHasSufficientDisk","message":"kubelet has sufficient disk space available"},{"type":"MemoryPressure","status":"False","lastHeartbeatTime":"2018-02-23T22:27:02Z","lastTransitionTime":"2018-02-23T22:27:02Z","reason":"KubeletHasSufficientMemory","message":"kubelet has sufficient memory available"},{"type":"DiskPressure","status":"False","lastHeartbeatTime":"2018-02-23T22:27:02Z","lastTransitionTime":"2018-02-23T22:27:02Z","reason":"KubeletHasNoDiskPressure","message":"kubelet has no disk pressure"},{"type":"Ready","status":"False","lastHeartbeatTime":"2018-02-23T22:27:02Z","lastTransitionTime":"2018-02-23T22:27:02Z","reason":"KubeletNotReady","message":"container runtime is down"}],"addresses":[{"type":"LegacyHostIP","address":"172.18.13.94"},{"type":"InternalIP","address":"172.18.13.94"},{"type":"Hostname","address":"172.18.13.94"}],"daemonEndpoints":{"kubeletEndpoint":{"Port":10250}},"nodeInfo":{"machineID":"f9afeb75a5a382dce8269887a67fbf58","systemUUID":"20B32AEC-074B-3D02-AE74-00EA4BA1DD09","bootID":"4441c98f-5ffb-47a3-9af5-1ffe733e8f5d","kernelVersion":"3.10.0-327.22.2.el7.x86_64","osImage":"CentOS Linux 7 (Core)","containerRuntimeVersion":"docker://1.10.3","kubeletVersion":"v1.5.2+43a9be4","kubeProxyVersion":"v1.5.2+43a9be4","operatingSystem":"linux","architecture":"amd64"},"images":[{"names":["openshift/openvswitch:c106caf","openshift/openvswitch:latest"],"sizeBytes":1026697644},{"names":["openshift/node:c106caf","openshift/node:latest"],"sizeBytes":1025016185},{"names":["openshift/origin-gitserver:c106caf","openshift/origin-gitserver:latest"],"sizeBytes":1002075992},{"names":["openshift/origin-keepalived-ipfailover:c106caf","openshift/origin-keepalived-ipfailover:latest"],"sizeBytes":971721463},{"names":["openshift/origin-haproxy-router:c106caf","openshift/origin-haproxy-router:latest"],"sizeBytes":965766197},{"names":["openshift/origin-recycler:c106caf","openshift/origin-recycler:latest"],"sizeBytes":947041099},{"names":["openshift/origin-docker-builder:c106caf","openshift/origin-docker-builder:latest"],"sizeBytes":947041099},{"names":["openshift/origin-deployer:c106caf","openshift/origin-deployer:latest"],"sizeBytes":947041099},{"names":["openshift/origin-sti-builder:c106caf","openshift/origin-sti-builder:latest"],"sizeBytes":947041099},{"names":["openshift/origin-f5-router:c106caf","openshift/origin-f5-router:latest"],"sizeBytes":947041099},{"names":["openshift/origin:c106caf","openshift/origin:latest"],"sizeBytes":947041099},{"names":["docker.io/openshift/origin-release:golang-1.7"],"sizeBytes":857644817},{"names":["openshift/origin-release:latest"],"sizeBytes":719000618},{"names":["openshift/dind-master:latest"],"sizeBytes":474218996},{"names":["openshift/dind-node:latest"],"sizeBytes":474215272},{"names":["openshift/origin-docker-registry:c106caf","openshift/origin-docker-registry:latest"],"sizeBytes":468441298},{"names":["openshift/origin-egress-router:c106caf","openshift/origin-egress-router:latest"],"sizeBytes":420088533},{"names":["openshift/origin-base:latest"],"sizeBytes":402162201},{"names":["openshift/dind:latest"],"sizeBytes":384423296},{"names":["openshift/origin-haproxy-router-base:latest"],"sizeBytes":294278935},{"names":["docker.io/fedora:25"],"sizeBytes":230864375},{"names":["docker.io/centos:centos7"],"sizeBytes":196509652},{"names":["openshift/hello-openshift:c106caf","openshift/hello-openshift:latest"],"sizeBytes":5635062},{"names":["openshift/origin-pod:c106caf","openshift/origin-pod:latest"],"sizeBytes":1138998}]}}
Standard error from the command:
Error from server (NotFound): nodes "172.18.13.94" not found
info: password for stats user admin has been set to EQymRVB8sG
--> Creating router router ...
    serviceaccount "router" created
    clusterrolebinding "router-router-role" created
    deploymentconfig "router" created
    service "router" created
--> Success
serviceaccount "registry" created
clusterrolebinding "registry-registry-role" created
deploymentconfig "docker-registry" created
service "docker-registry" created
Running /data/src/github.com/openshift/origin/ci_test_every_pr.sh:90: executing 'oadm registry' expecting success...
SUCCESS after 0.352s: /data/src/github.com/openshift/origin/ci_test_every_pr.sh:90: executing 'oadm registry' expecting success
Standard output from the command:
Docker registry "docker-registry" service exists

There was no error output from the command.
Running /data/src/github.com/openshift/origin/ci_test_every_pr.sh:91: executing 'oadm router' expecting success...
SUCCESS after 0.252s: /data/src/github.com/openshift/origin/ci_test_every_pr.sh:91: executing 'oadm router' expecting success
Standard output from the command:
Router "router" service exists

There was no error output from the command.
Running /data/src/github.com/openshift/origin/ci_test_every_pr.sh:95: executing 'oadm policy add-cluster-role-to-user cluster-admin metrics-admin' expecting success...
SUCCESS after 0.216s: /data/src/github.com/openshift/origin/ci_test_every_pr.sh:95: executing 'oadm policy add-cluster-role-to-user cluster-admin metrics-admin' expecting success
Standard output from the command:
cluster role "cluster-admin" added: "metrics-admin"

There was no error output from the command.
Running /data/src/github.com/openshift/origin/ci_test_every_pr.sh:96: executing 'oadm policy add-cluster-role-to-user cluster-admin metrics-admin' expecting success...
SUCCESS after 0.213s: /data/src/github.com/openshift/origin/ci_test_every_pr.sh:96: executing 'oadm policy add-cluster-role-to-user cluster-admin metrics-admin' expecting success
Standard output from the command:
cluster role "cluster-admin" added: "metrics-admin"

There was no error output from the command.
Running /data/src/github.com/openshift/origin/ci_test_every_pr.sh:97: executing 'oc login -u metrics-admin -p g1b315H' expecting success...
SUCCESS after 0.204s: /data/src/github.com/openshift/origin/ci_test_every_pr.sh:97: executing 'oc login -u metrics-admin -p g1b315H' expecting success
Standard output from the command:
Login successful.

You have one project on this server: "default"

Using project "default".

There was no error output from the command.
+ Info ================================================================================
+ echo '[INFO]' ================================================================================
[INFO] ================================================================================
+ Info 'Starting Origin-Metric end-to-end test'
[INFO] Starting Origin-Metric end-to-end test
+ echo '[INFO]' Starting Origin-Metric end-to-end test
+ Info
[INFO]
+ echo '[INFO]'
+ Info Settings:
[INFO] Settings:
+ echo '[INFO]' Settings:
++ realpath /data/src/github.com/openshift/origin-metrics/hack/../hack/tests/../..
+ Info 'Base Directory: /data/src/github.com/openshift/origin-metrics'
[INFO] Base Directory: /data/src/github.com/openshift/origin-metrics
+ echo '[INFO]' Base Directory: /data/src/github.com/openshift/origin-metrics
+ Info ================================================================================
[INFO] ================================================================================
+ echo '[INFO]' ================================================================================
+ Info
[INFO]
+ echo '[INFO]'
++ date +%s
+ TEST_STARTTIME=1519424825
++ date +%s
+ export TEST_PROJECT=test-1519424825
+ TEST_PROJECT=test-1519424825
+ trap cleanup SIGINT SIGTERM EXIT
+ '[' true = true ']'
+ test.build
+ Info
[INFO]
+ echo '[INFO]'
+ Info 'Building new images'
[INFO] Building new images
+ echo '[INFO]' Building new images
+ sh /data/src/github.com/openshift/origin-metrics/hack/../hack/tests/../../hack/build-images.sh --no-cache


--- Building component '/data/src/github.com/openshift/origin-metrics/hack/../hack/tests/../../hack/../deployer/' with docker tag 'openshift/origin-metrics-deployer:latest' ---
Sending build context to Docker daemon 90.11 kB

Step 1 : FROM openshift/origin:latest
 ---> c95e934b9b09
Step 2 : MAINTAINER Hawkular Metrics <hawkular-dev@lists.jboss.org>
 ---> Running in b9fcc7a51c24
 ---> fe5202929850
Removing intermediate container b9fcc7a51c24
Step 3 : ENV BIN_DIR /opt/deploy PROCESSING_DIR /etc/deploy/_output KUBECONFIG /etc/deploy/.kubeconfig WRITE_KUBECONFIG 1 SECRET_DIR /secret
 ---> Running in 1acbfdcaa4df
open /dev/mapper/docker-202:1-26771127-cd0dfb1453862dec2a0c414aa04d999009e092a991db0fac7748f26297b12637-init: no such file or directory
+ cleanup
+ out=1
+ trap test.cleanup SIGINT SIGTERM EXIT
+ '[' 1 -ne 0 ']'
+ Error 'Test failed'
+ echo '[ERROR]' Test failed
[ERROR] Test failed

+ echo
++ date +%s
+ ENDTIME=1519424842
+ '[' '' = true ']'
+ test.cleanup
+ Info
[INFO]
+ echo '[INFO]'
+ Info 'Deleting test project test-1519424825'
[INFO] Deleting test project test-1519424825
+ echo '[INFO]' Deleting test project test-1519424825
+ oc delete project test-1519424825
Error from server (NotFound): namespaces "test-1519424825" not found
+ exit
[ERROR] PID 1981: /data/src/github.com/openshift/origin/ci_test_every_pr.sh:99: `"${ORIGIN_METRICS_DIR}/hack/e2e-tests.sh" -x --test=DefaultInstall` exited with status 1.
[INFO] 		Stack Trace: 
[INFO] 		  1: /data/src/github.com/openshift/origin/ci_test_every_pr.sh:99: `"${ORIGIN_METRICS_DIR}/hack/e2e-tests.sh" -x --test=DefaultInstall`
[INFO]   Exiting with code 1.
>>>>>>>>>>>> ENV VARIABLES <<<<<<<<<<<<<<<<<<
ADMIN_KUBECONFIG=/tmp/openshift/ci_test_every_pr/openshift.local.config/master/admin.kubeconfig
API_BIND_HOST=172.18.13.94
API_HOST=172.18.13.94
API_PORT=8443
API_SCHEME=https
ARTIFACT_DIR=/tmp/openshift/ci_test_every_pr/artifacts
BASETMPDIR=/tmp/openshift/ci_test_every_pr
_=/bin/env
CLUSTER_ADMIN_CONTEXT=default/172-18-13-94:8443/system:admin
ETCD_DATA_DIR=/tmp/openshift/ci_test_every_pr/etcd
ETCD_HOST=127.0.0.1
ETCD_PEER_PORT=7001
ETCD_PORT=4001
FAKE_HOME_DIR=/tmp/openshift/ci_test_every_pr/openshift.local.home
GIT_BRANCH=master
GIT_URL=https://github.com/openshift/origin-metrics
GOPATH=/data
HISTCONTROL=ignoredups
HISTSIZE=1000
HOME=/home/centos
HOSTNAME=ip-172-18-13-94
KUBE_CACHE_MUTATION_DETECTOR=true
KUBECONFIG=/tmp/openshift/ci_test_every_pr/openshift.local.config/master/admin.kubeconfig
KUBELET_BIND_HOST=172.18.13.94
KUBELET_HOST=172.18.13.94
KUBELET_PORT=10250
KUBELET_SCHEME=https
LANG=en_US.UTF-8
LESSOPEN=||/usr/bin/lesspipe.sh %s
LOG_DIR=/tmp/openshift/ci_test_every_pr/logs
LOGGER_PID=2045
LOGNAME=centos
MAIL=/var/spool/mail/centos
MASTER_ADDR=https://172.18.13.94:8443
MASTER_CONFIG_DIR=/tmp/openshift/ci_test_every_pr/openshift.local.config/master
MAX_IMAGES_BULK_IMPORTED_PER_REPOSITORY=3
NODE_CONFIG_DIR=/tmp/openshift/ci_test_every_pr/openshift.local.config/node-172.18.13.94
NUM_OS_JUNIT_SUITES_IN_FLIGHT=1
NUM_OS_JUNIT_TESTS_IN_FLIGHT=0
OLDPWD=/data/src/github.com/openshift/origin-metrics/hack/tests
OPENSHIFT_ROUTER_IMAGE=openshift/origin-haproxy-router:c106caf
ORIGIN_METRICS_DIR=/data/src/github.com/openshift/origin-metrics
OS_ORIGINAL_WD=/data/src/github.com/openshift/origin
OS_PID=2251
OS_ROOT=/data/src/github.com/openshift/origin
OS_TMP_ENV_SET=ci_test_every_pr
OS_USE_STACKTRACE=true
PATH=/data/src/github.com/openshift/origin/_output/local/bin/linux/amd64:/data/bin:/data/bin:/data/src/github.com/openshift/origin/_output/etcd/bin:/data/src/github.com/openshift/origin/_output/local/bin/linux/amd64:/bin:/usr/local/sbin:/sbin:/bin:/usr/sbin:/usr/bin:/root/bin:/home/centos/.local/bin:/home/centos/bin
PUBLIC_MASTER_HOST=172.18.13.94
PWD=/data/src/github.com/openshift/origin
QTDIR=/usr/lib64/qt-3.3
QT_GRAPHICSSYSTEM_CHECKED=1
QT_GRAPHICSSYSTEM=native
QTINC=/usr/lib64/qt-3.3/include
QTLIB=/usr/lib64/qt-3.3/lib
SAR_LOGFILE=/tmp/openshift/ci_test_every_pr/logs/sar.log
SELINUX_LEVEL_REQUESTED=
SELINUX_ROLE_REQUESTED=
SELINUX_USE_CURRENT_RANGE=
SERVER_CONFIG_DIR=/tmp/openshift/ci_test_every_pr/openshift.local.config
SHELL=/bin/bash
SHLVL=3
SSH_CLIENT=50.17.198.52 58236 22
SSH_CONNECTION=50.17.198.52 58236 172.18.13.94 22
TAG=c106caf
TERM=vt100
TIME_MIN=60000
TIME_MS=1
TIME_SEC=1000
USE_IMAGES=openshift/origin-${component}:c106caf
USE_LOCAL_SOURCE=true
USER=centos
USE_SUDO=true
VERBOSE=1
VOLUME_DIR=/tmp/openshift/ci_test_every_pr/volumes
XDG_RUNTIME_DIR=/run/user/1000
XDG_SESSION_ID=5
>>>>>>>>>>>> END ENV VARIABLES <<<<<<<<<<<<<<

[FAIL] !!!!! Test Failed !!!!

[INFO] Dumping container logs to /tmp/openshift/ci_test_every_pr/logs/containers
[INFO] Dumping etcd contents to /tmp/openshift/ci_test_every_pr/artifacts/etcd_dump.json
[INFO] Tearing down test
[INFO] Stopping k8s docker containers
[INFO] Removing k8s docker containers
[INFO] Pruning etcd data directory...
[INFO] Cleanup complete
[INFO] Exiting at Fri Feb 23 22:27:42 UTC 2018
./ci_test_every_pr.sh took 71 seconds
Error while running ssh/sudo command: 
set -e
pushd /data/src/github.com/openshift//origin-metrics/hack/tests >/dev/null
export PATH=$GOPATH/bin:$PATH

echo '***************************************************'
echo 'Running GIT_URL=https://github.com/openshift/origin-metrics GIT_BRANCH=master ORIGIN_METRICS_DIR=/data/src/github.com/openshift/origin-metrics OS_ROOT=/data/src/github.com/openshift/origin USE_LOCAL_SOURCE=true VERBOSE=1 ./ci_test_every_pr.sh...'
time GIT_URL=https://github.com/openshift/origin-metrics GIT_BRANCH=master ORIGIN_METRICS_DIR=/data/src/github.com/openshift/origin-metrics OS_ROOT=/data/src/github.com/openshift/origin USE_LOCAL_SOURCE=true VERBOSE=1 ./ci_test_every_pr.sh
echo 'Finished GIT_URL=https://github.com/openshift/origin-metrics GIT_BRANCH=master ORIGIN_METRICS_DIR=/data/src/github.com/openshift/origin-metrics OS_ROOT=/data/src/github.com/openshift/origin USE_LOCAL_SOURCE=true VERBOSE=1 ./ci_test_every_pr.sh'
echo '***************************************************'

popd >/dev/null
        
The SSH command responded with a non-zero exit status. Vagrant
assumes that this means the command failed. The output for this command
should be in the log above. Please read the output to determine what
went wrong.
==> openshiftdev: Downloading logs
==> openshiftdev: Downloading artifacts from '/var/log/yum.log' to '/var/lib/jenkins/jobs/test-origin-metrics/workspace/origin/artifacts/yum.log'
==> openshiftdev: Downloading artifacts from '/var/log/secure' to '/var/lib/jenkins/jobs/test-origin-metrics/workspace/origin/artifacts/secure'
==> openshiftdev: Downloading artifacts from '/var/log/audit/audit.log' to '/var/lib/jenkins/jobs/test-origin-metrics/workspace/origin/artifacts/audit.log'
==> openshiftdev: /tmp/origin-metrics/ did not exist on the remote system.  This is often the case for tests that were not run.
Build step 'Execute shell' marked build as failure
[description-setter] Description set: <a href="https://github.com/openshift/origin-metrics/pull/403">https://github.com/openshift/origin-metrics/pull/403</a>
[PostBuildScript] - Execution post build scripts.
[workspace] $ /bin/sh -xe /tmp/jenkins6420842415306119385.sh
+ INSTANCE_NAME=origin_metrics-centos7-312
+ pushd origin
~/jobs/test-origin-metrics/workspace/origin ~/jobs/test-origin-metrics/workspace
+ '[' -f .vagrant-openshift.json ']'
+ /usr/bin/vagrant destroy -f
==> openshiftdev: Terminating the instance...
==> openshiftdev: Running cleanup tasks for 'shell' provisioner...
+ popd
~/jobs/test-origin-metrics/workspace
[BFA] Scanning build for known causes...
[BFA] Found failure cause(s):
[BFA] Command Failure from category failure
[BFA] Done. 0s
Finished: FAILURE