FailedConsole Output

Started by remote host 50.17.198.52
[EnvInject] - Loading node environment variables.
Building in workspace /var/lib/jenkins/jobs/test-origin-metrics/workspace
Run condition [And] enabling prebuild for step [BuilderChain]
[EnvInject] - Injecting environment variables from a build step.
[EnvInject] - Injecting as environment variables the properties content 
OS_ROOT=/data/src/github.com/openshift/origin
INSTANCE_TYPE=c4.xlarge
GIT_BRANCH=master
GITHUB_REPO=openshift
OS=centos7
TESTNAME=metrics

[EnvInject] - Variables injected successfully.
[workspace] $ /bin/sh -xe /tmp/jenkins9117061277501989050.sh
+ true
+ approve.sh origin-metrics master none
+ vagrant origin-local-checkout --replace --repo origin-metrics
You don't seem to have the GOPATH environment variable set on your system.
See: 'go help gopath' for more details about GOPATH.
Waiting for the cloning process to finish
Checking repo integrity for /var/lib/jenkins/jobs/test-origin-metrics/workspace/origin-metrics
~/jobs/test-origin-metrics/workspace/origin-metrics ~/jobs/test-origin-metrics/workspace
# On branch master
# Your branch is ahead of 'origin/master' by 1 commit.
#   (use "git push" to publish your local commits)
#
nothing to commit, working directory clean
~/jobs/test-origin-metrics/workspace
Replacing: /var/lib/jenkins/jobs/test-origin-metrics/workspace/origin-metrics
~/jobs/test-origin-metrics/workspace/origin-metrics ~/jobs/test-origin-metrics/workspace
From https://github.com/openshift/origin-metrics
   060ef61..2242ca1  master     -> origin/master
Already on 'master'
Your branch is behind 'origin/master' by 1 commit, and can be fast-forwarded.
  (use "git pull" to update your local branch)
HEAD is now at 2242ca1 Merge pull request #418 from jsanda/bump-hawkular-metrics
Deleted branch tpr_bump-hawkular-metrics_jsanda (was ca85e45).
~/jobs/test-origin-metrics/workspace
Origin repositories cloned into /var/lib/jenkins/jobs/test-origin-metrics/workspace
+ '[' -n 419 ']'
+ set +x


*****Locally Merging Pull Request: https://github.com/openshift/origin-metrics/pull/419
+ test_pull_requests --local_merge_pull_request 419 --repo origin-metrics --config /var/lib/jenkins/.test_pull_requests_metrics.json
WARNING: Cache won't persist between runs.
  *** Starting with empty cache
Rate limit remaining: 4826
  Checking if current base repo commit ID matches what we expect
Local merging pull request #419 for repo 'origin-metrics' against base repo commit id 2242ca12746ea981b6d3ff75ec1273999555ba2a from pr branch commit id cc596176c3722642092940fcadbec89dedd6e55f
+ pushd origin-metrics
+ git checkout master
Already on 'master'
+ git checkout -b tpr_keys_jsanda
Switched to a new branch 'tpr_keys_jsanda'
+ git pull git@github.com:jsanda/origin-metrics.git keys
From github.com:jsanda/origin-metrics
 * branch            keys       -> FETCH_HEAD
+ git pull git@github.com:jsanda/origin-metrics.git keys --tags
From github.com:jsanda/origin-metrics
 * branch            keys       -> FETCH_HEAD
+ git checkout master
Switched to branch 'master'
+ git merge tpr_keys_jsanda
+ git submodule update --recursive
+ popd

Rate limit resets in: 1130s, at 2018-05-07T17:06:00-04:00 (1525727160)
Rate limit remaining: 4822; delta: 4
Rate limit is not too low.
Would run.
Cache stats: Hits: 0, Misses: 4, Bypass: 0
      (raw): [:fresh, 0, :invalid, 0, :miss, 4, :unacceptable, 0, :valid, 0]

Done
~/jobs/test-origin-metrics/workspace/origin-metrics ~/jobs/test-origin-metrics/workspace
Updating 2242ca1..cc59617
Fast-forward
 hack/keys/create.sh                                | 50 ---------------
 hack/keys/hawkular/hawkular-noca.pem               | 46 -------------
 hack/keys/hawkular/hawkular.cert                   | 37 -----------
 hack/keys/hawkular/hawkular.key                    | 27 --------
 hack/keys/hawkular/hawkular.pem                    | 64 ------------------
 .../hawkularWildCard/hawkularWildCard-noca.pem     | 46 -------------
 hack/keys/hawkularWildCard/hawkularWildCard.cert   | 37 -----------
 hack/keys/hawkularWildCard/hawkularWildCard.key    | 27 --------
 hack/keys/hawkularWildCard/hawkularWildCard.pem    | 64 ------------------
 hack/keys/intermediary_ca/ca-chain.pem             | 41 ------------
 hack/keys/intermediary_ca/hawkular-metrics.cert    | 48 --------------
 hack/keys/intermediary_ca/hawkular-metrics.key     | 27 --------
 hack/keys/intermediary_ca/hawkular-metrics.pem     | 75 ----------------------
 hack/keys/signer.ca                                | 18 ------
 hack/tests/test_default_deploy.sh                  | 65 -------------------
 15 files changed, 672 deletions(-)
 delete mode 100755 hack/keys/create.sh
 delete mode 100644 hack/keys/hawkular/hawkular-noca.pem
 delete mode 100644 hack/keys/hawkular/hawkular.cert
 delete mode 100644 hack/keys/hawkular/hawkular.key
 delete mode 100644 hack/keys/hawkular/hawkular.pem
 delete mode 100644 hack/keys/hawkularWildCard/hawkularWildCard-noca.pem
 delete mode 100644 hack/keys/hawkularWildCard/hawkularWildCard.cert
 delete mode 100644 hack/keys/hawkularWildCard/hawkularWildCard.key
 delete mode 100644 hack/keys/hawkularWildCard/hawkularWildCard.pem
 delete mode 100644 hack/keys/intermediary_ca/ca-chain.pem
 delete mode 100644 hack/keys/intermediary_ca/hawkular-metrics.cert
 delete mode 100644 hack/keys/intermediary_ca/hawkular-metrics.key
 delete mode 100644 hack/keys/intermediary_ca/hawkular-metrics.pem
 delete mode 100644 hack/keys/signer.ca
Already up-to-date.
Updating 2242ca1..cc59617
Fast-forward
 hack/keys/create.sh                                | 50 ---------------
 hack/keys/hawkular/hawkular-noca.pem               | 46 -------------
 hack/keys/hawkular/hawkular.cert                   | 37 -----------
 hack/keys/hawkular/hawkular.key                    | 27 --------
 hack/keys/hawkular/hawkular.pem                    | 64 ------------------
 .../hawkularWildCard/hawkularWildCard-noca.pem     | 46 -------------
 hack/keys/hawkularWildCard/hawkularWildCard.cert   | 37 -----------
 hack/keys/hawkularWildCard/hawkularWildCard.key    | 27 --------
 hack/keys/hawkularWildCard/hawkularWildCard.pem    | 64 ------------------
 hack/keys/intermediary_ca/ca-chain.pem             | 41 ------------
 hack/keys/intermediary_ca/hawkular-metrics.cert    | 48 --------------
 hack/keys/intermediary_ca/hawkular-metrics.key     | 27 --------
 hack/keys/intermediary_ca/hawkular-metrics.pem     | 75 ----------------------
 hack/keys/signer.ca                                | 18 ------
 hack/tests/test_default_deploy.sh                  | 65 -------------------
 15 files changed, 672 deletions(-)
 delete mode 100755 hack/keys/create.sh
 delete mode 100644 hack/keys/hawkular/hawkular-noca.pem
 delete mode 100644 hack/keys/hawkular/hawkular.cert
 delete mode 100644 hack/keys/hawkular/hawkular.key
 delete mode 100644 hack/keys/hawkular/hawkular.pem
 delete mode 100644 hack/keys/hawkularWildCard/hawkularWildCard-noca.pem
 delete mode 100644 hack/keys/hawkularWildCard/hawkularWildCard.cert
 delete mode 100644 hack/keys/hawkularWildCard/hawkularWildCard.key
 delete mode 100644 hack/keys/hawkularWildCard/hawkularWildCard.pem
 delete mode 100644 hack/keys/intermediary_ca/ca-chain.pem
 delete mode 100644 hack/keys/intermediary_ca/hawkular-metrics.cert
 delete mode 100644 hack/keys/intermediary_ca/hawkular-metrics.key
 delete mode 100644 hack/keys/intermediary_ca/hawkular-metrics.pem
 delete mode 100644 hack/keys/signer.ca
~/jobs/test-origin-metrics/workspace
+ vagrant origin-local-checkout --replace
You don't seem to have the GOPATH environment variable set on your system.
See: 'go help gopath' for more details about GOPATH.
Waiting for the cloning process to finish
Checking repo integrity for /var/lib/jenkins/jobs/test-origin-metrics/workspace/origin
~/jobs/test-origin-metrics/workspace/origin ~/jobs/test-origin-metrics/workspace
# On branch master
# Untracked files:
#   (use "git add <file>..." to include in what will be committed)
#
#	artifacts/
nothing added to commit but untracked files present (use "git add" to track)
~/jobs/test-origin-metrics/workspace
Replacing: /var/lib/jenkins/jobs/test-origin-metrics/workspace/origin
~/jobs/test-origin-metrics/workspace/origin ~/jobs/test-origin-metrics/workspace
From https://github.com/openshift/origin
   40951ce..fc6ab10  master     -> origin/master
Already on 'master'
Your branch is behind 'origin/master' by 30 commits, and can be fast-forwarded.
  (use "git pull" to update your local branch)
HEAD is now at fc6ab10 Merge pull request #19616 from deads2k/cli-34-reap
Removing .vagrant-openshift.json
Removing .vagrant/
Removing artifacts/
fatal: branch name required
~/jobs/test-origin-metrics/workspace
Origin repositories cloned into /var/lib/jenkins/jobs/test-origin-metrics/workspace
+ pushd origin
~/jobs/test-origin-metrics/workspace/origin ~/jobs/test-origin-metrics/workspace
+ INSTANCE_NAME=origin_metrics-centos7-329
+ GIT_URL=https://github.com/openshift/origin-metrics
++ echo https://github.com/openshift/origin-metrics
++ sed s,https://,,
+ OMETRICS_LOCAL_PATH=github.com/openshift/origin-metrics
+ ORIGIN_METRICS_DIR=/data/src/github.com/openshift/origin-metrics
+ env
+ sort
_=/bin/env
BUILD_CAUSE=REMOTECAUSE
BUILD_CAUSE_REMOTECAUSE=true
BUILD_DISPLAY_NAME=#329
BUILD_ID=329
BUILD_NUMBER=329
BUILD_TAG=jenkins-test-origin-metrics-329
BUILD_URL=https://ci.openshift.redhat.com/jenkins/job/test-origin-metrics/329/
EXECUTOR_NUMBER=41
GIT_BRANCH=master
GITHUB_REPO=openshift
HOME=/var/lib/jenkins
HUDSON_COOKIE=485e056c-fa7c-4ec6-91f7-a2e263444f2d
HUDSON_HOME=/var/lib/jenkins
HUDSON_SERVER_COOKIE=ec11f8b2841c966f
HUDSON_URL=https://ci.openshift.redhat.com/jenkins/
INSTANCE_TYPE=c4.xlarge
JENKINS_HOME=/var/lib/jenkins
JENKINS_SERVER_COOKIE=ec11f8b2841c966f
JENKINS_URL=https://ci.openshift.redhat.com/jenkins/
JOB_BASE_NAME=test-origin-metrics
JOB_DISPLAY_URL=https://ci.openshift.redhat.com/jenkins/job/test-origin-metrics/display/redirect
JOB_NAME=test-origin-metrics
JOB_URL=https://ci.openshift.redhat.com/jenkins/job/test-origin-metrics/
LANG=en_US.UTF-8
LOGNAME=jenkins
MERGE_SEVERITY=none
MERGE=true
METRICS_PULL_ID=419
NLSPATH=/usr/dt/lib/nls/msg/%L/%N.cat
NODE_LABELS=master
NODE_NAME=master
OLDPWD=/var/lib/jenkins/jobs/test-origin-metrics/workspace
OS=centos7
OS_ROOT=/data/src/github.com/openshift/origin
PATH=/sbin:/usr/sbin:/bin:/usr/bin
PWD=/var/lib/jenkins/jobs/test-origin-metrics/workspace/origin
ROOT_BUILD_CAUSE=REMOTECAUSE
ROOT_BUILD_CAUSE_REMOTECAUSE=true
RUN_CHANGES_DISPLAY_URL=https://ci.openshift.redhat.com/jenkins/job/test-origin-metrics/329/display/redirect?page=changes
RUN_DISPLAY_URL=https://ci.openshift.redhat.com/jenkins/job/test-origin-metrics/329/display/redirect
SHELL=/bin/bash
SHLVL=3
TESTNAME=metrics
USER=jenkins
WORKSPACE=/var/lib/jenkins/jobs/test-origin-metrics/workspace
XFILESEARCHPATH=/usr/dt/app-defaults/%L/Dt
+ vagrant origin-init --stage inst --os centos7 --instance-type c4.xlarge origin_metrics-centos7-329
Reading AWS credentials from /var/lib/jenkins/.awscred
Searching devenv-centos7_* for latest base AMI (required_name_tag=)
Found: ami-2fb42b39 (devenv-centos7_6170)
++ seq 0 2
+ for i in '$(seq 0 2)'
+ vagrant up --provider aws
Bringing machine 'openshiftdev' up with 'aws' provider...
==> openshiftdev: Warning! The AWS provider doesn't support any of the Vagrant
==> openshiftdev: high-level network configurations (`config.vm.network`). They
==> openshiftdev: will be silently ignored.
==> openshiftdev: Warning! You're launching this instance into a VPC without an
==> openshiftdev: elastic IP. Please verify you're properly connected to a VPN so
==> openshiftdev: you can access this machine, otherwise Vagrant will not be able
==> openshiftdev: to SSH into it.
==> openshiftdev: Launching an instance with the following settings...
==> openshiftdev:  -- Type: c4.xlarge
==> openshiftdev:  -- AMI: ami-2fb42b39
==> openshiftdev:  -- Region: us-east-1
==> openshiftdev:  -- Keypair: libra
==> openshiftdev:  -- Subnet ID: subnet-cf57c596
==> openshiftdev:  -- User Data: yes
==> openshiftdev:  -- User Data: 
==> openshiftdev: # cloud-config
==> openshiftdev: 
==> openshiftdev: growpart:
==> openshiftdev:   mode: auto
==> openshiftdev:   devices: ['/']
==> openshiftdev: runcmd:
==> openshiftdev: - [ sh, -xc, "sed -i s/^Defaults.*requiretty/#Defaults requiretty/g /etc/sudoers"]
==> openshiftdev:         
==> openshiftdev:  -- Block Device Mapping: [{"DeviceName"=>"/dev/sda1", "Ebs.VolumeSize"=>25, "Ebs.VolumeType"=>"gp2"}, {"DeviceName"=>"/dev/sdb", "Ebs.VolumeSize"=>35, "Ebs.VolumeType"=>"gp2"}]
==> openshiftdev:  -- Terminate On Shutdown: false
==> openshiftdev:  -- Monitoring: false
==> openshiftdev:  -- EBS optimized: false
==> openshiftdev:  -- Assigning a public IP address in a VPC: false
==> openshiftdev: Waiting for instance to become "ready"...
==> openshiftdev: Waiting for SSH to become available...
==> openshiftdev: Machine is booted and ready for use!
==> openshiftdev: Running provisioner: setup (shell)...
    openshiftdev: Running: /tmp/vagrant-shell20180507-11293-duqzto.sh
==> openshiftdev: Host: ec2-54-91-146-99.compute-1.amazonaws.com
+ break
+ vagrant sync-origin-metrics -c -s
Running ssh/sudo command 'rm -rf /data/src/github.com/openshift/origin-metrics-bare; 
' with timeout 14400. Attempt #0
Running ssh/sudo command 'mkdir -p /centos/.ssh;
mv /tmp/file20180507-12065-vc6kd4 /centos/.ssh/config &&
chown centos:centos /centos/.ssh/config &&
chmod 0600 /centos/.ssh/config' with timeout 14400. Attempt #0
Running ssh/sudo command 'mkdir -p /data/src/github.com/openshift/' with timeout 14400. Attempt #0
Running ssh/sudo command 'mkdir -p /data/src/github.com/openshift/builder && chown -R centos:centos /data/src/github.com/openshift/' with timeout 14400. Attempt #0
Running ssh/sudo command 'set -e
rm -fr /data/src/github.com/openshift/origin-metrics-bare;

if [ ! -d /data/src/github.com/openshift/origin-metrics-bare ]; then
git clone --quiet --bare https://github.com/openshift/origin-metrics.git /data/src/github.com/openshift/origin-metrics-bare >/dev/null
fi
' with timeout 14400. Attempt #0
Synchronizing local sources
Synchronizing [origin-metrics@master] from origin-metrics...
Warning: Permanently added '54.91.146.99' (ECDSA) to the list of known hosts.
Running ssh/sudo command 'set -e

if [ -d /data/src/github.com/openshift/origin-metrics-bare ]; then
rm -rf /data/src/github.com/openshift/origin-metrics
echo 'Cloning origin-metrics ...'
git clone --quiet --recurse-submodules /data/src/github.com/openshift/origin-metrics-bare /data/src/github.com/openshift/origin-metrics

else
MISSING_REPO+='origin-metrics-bare'
fi

if [ -n "$MISSING_REPO" ]; then
echo 'Missing required upstream repositories:'
echo $MISSING_REPO
echo 'To fix, execute command: vagrant clone-upstream-repos'
fi
' with timeout 14400. Attempt #0
Cloning origin-metrics ...
+ vagrant ssh -c 'if [ ! -d /tmp/openshift ] ; then mkdir /tmp/openshift ; fi ; sudo chmod 777 /tmp/openshift'
+ vagrant test-origin-metrics -d --env GIT_URL=https://github.com/openshift/origin-metrics --env GIT_BRANCH=master --env ORIGIN_METRICS_DIR=/data/src/github.com/openshift/origin-metrics --env OS_ROOT=/data/src/github.com/openshift/origin --env USE_LOCAL_SOURCE=true --env VERBOSE=1
***************************************************
Running GIT_URL=https://github.com/openshift/origin-metrics GIT_BRANCH=master ORIGIN_METRICS_DIR=/data/src/github.com/openshift/origin-metrics OS_ROOT=/data/src/github.com/openshift/origin USE_LOCAL_SOURCE=true VERBOSE=1 ./ci_test_every_pr.sh...
/data/src/github.com/openshift/origin /data/src/github.com/openshift/origin-metrics/hack/tests
/data/src/github.com/openshift/origin-metrics/hack/tests
/data/src/github.com/openshift/origin-metrics /data/src/github.com/openshift/origin-metrics/hack/tests
/data/src/github.com/openshift/origin-metrics/hack/tests
[INFO] Starting metrics tests at Mon May  7 20:50:02 UTC 2018
Generated new key pair as /tmp/openshift/ci_test_every_pr/openshift.local.config/master/serviceaccounts.public.key and /tmp/openshift/ci_test_every_pr/openshift.local.config/master/serviceaccounts.private.key
Generating node credentials ...
Created node config for 172.18.8.28 in /tmp/openshift/ci_test_every_pr/openshift.local.config/node-172.18.8.28
Wrote master config to: /tmp/openshift/ci_test_every_pr/openshift.local.config/master/master-config.yaml
Running hack/lib/start.sh:349: executing 'oc get --raw /healthz --config='/tmp/openshift/ci_test_every_pr/openshift.local.config/master/admin.kubeconfig'' expecting any result and text 'ok'; re-trying every 0.25s until completion or 80.000s...
SUCCESS after 2.152s: hack/lib/start.sh:349: executing 'oc get --raw /healthz --config='/tmp/openshift/ci_test_every_pr/openshift.local.config/master/admin.kubeconfig'' expecting any result and text 'ok'; re-trying every 0.25s until completion or 80.000s
Standard output from the command:
Standard error from the command:
The connection to the server 172.18.8.28:8443 was refused - did you specify the right host or port?
... repeated 2 times
Error from server (Forbidden): User "system:admin" cannot "get" on "/healthz"
... repeated 2 times
Error from server (InternalError): an error on the server ("[+]ping ok\n[-]poststarthook/bootstrap-controller failed: not finished\n[+]poststarthook/extensions/third-party-resources ok\n[-]poststarthook/ca-registration failed: not finished\nhealthz check failed") has prevented the request from succeeding
Running hack/lib/start.sh:350: executing 'oc get --raw https://172.18.8.28:10250/healthz --config='/tmp/openshift/ci_test_every_pr/openshift.local.config/master/admin.kubeconfig'' expecting any result and text 'ok'; re-trying every 0.5s until completion or 120.000s...
SUCCESS after 0.178s: hack/lib/start.sh:350: executing 'oc get --raw https://172.18.8.28:10250/healthz --config='/tmp/openshift/ci_test_every_pr/openshift.local.config/master/admin.kubeconfig'' expecting any result and text 'ok'; re-trying every 0.5s until completion or 120.000s
There was no output from the command.
Standard error from the command:
Error from server (InternalError): an error on the server ("[+]ping ok\n[-]poststarthook/bootstrap-controller failed: not finished\n[+]poststarthook/extensions/third-party-resources ok\n[-]poststarthook/ca-registration failed: not finished\nhealthz check failed") has prevented the request from succeeding

Running hack/lib/start.sh:351: executing 'oc get --raw /healthz/ready --config='/tmp/openshift/ci_test_every_pr/openshift.local.config/master/admin.kubeconfig'' expecting any result and text 'ok'; re-trying every 0.25s until completion or 80.000s...
SUCCESS after 0.814s: hack/lib/start.sh:351: executing 'oc get --raw /healthz/ready --config='/tmp/openshift/ci_test_every_pr/openshift.local.config/master/admin.kubeconfig'' expecting any result and text 'ok'; re-trying every 0.25s until completion or 80.000s
Standard output from the command:
ok
Standard error from the command:
Error from server (InternalError): an error on the server ("") has prevented the request from succeeding
Running hack/lib/start.sh:352: executing 'oc get service kubernetes --namespace default --config='/tmp/openshift/ci_test_every_pr/openshift.local.config/master/admin.kubeconfig'' expecting success; re-trying every 0.25s until completion or 160.000s...
SUCCESS after 3.402s: hack/lib/start.sh:352: executing 'oc get service kubernetes --namespace default --config='/tmp/openshift/ci_test_every_pr/openshift.local.config/master/admin.kubeconfig'' expecting success; re-trying every 0.25s until completion or 160.000s
Standard output from the command:
NAME         CLUSTER-IP   EXTERNAL-IP   PORT(S)                 AGE
kubernetes   172.30.0.1   <none>        443/TCP,53/UDP,53/TCP   4s

There was no error output from the command.
Running hack/lib/start.sh:353: executing 'oc get --raw /api/v1/nodes/172.18.8.28 --config='/tmp/openshift/ci_test_every_pr/openshift.local.config/master/admin.kubeconfig'' expecting success; re-trying every 0.25s until completion or 80.000s...
SUCCESS after 0.172s: hack/lib/start.sh:353: executing 'oc get --raw /api/v1/nodes/172.18.8.28 --config='/tmp/openshift/ci_test_every_pr/openshift.local.config/master/admin.kubeconfig'' expecting success; re-trying every 0.25s until completion or 80.000s
Standard output from the command:
{"kind":"Node","apiVersion":"v1","metadata":{"name":"172.18.8.28","selfLink":"/api/v1/nodes172.18.8.28","uid":"43520f5b-5238-11e8-8408-0ea314c74116","resourceVersion":"449","creationTimestamp":"2018-05-07T20:50:23Z","labels":{"beta.kubernetes.io/arch":"amd64","beta.kubernetes.io/os":"linux","kubernetes.io/hostname":"172.18.8.28"},"annotations":{"volumes.kubernetes.io/controller-managed-attach-detach":"true"}},"spec":{"externalID":"172.18.8.28","providerID":"aws:////i-0db426a6ce1b22d75"},"status":{"capacity":{"alpha.kubernetes.io/nvidia-gpu":"0","cpu":"4","memory":"7231292Ki","pods":"40"},"allocatable":{"alpha.kubernetes.io/nvidia-gpu":"0","cpu":"4","memory":"7231292Ki","pods":"40"},"conditions":[{"type":"OutOfDisk","status":"False","lastHeartbeatTime":"2018-05-07T20:50:23Z","lastTransitionTime":"2018-05-07T20:50:23Z","reason":"KubeletHasSufficientDisk","message":"kubelet has sufficient disk space available"},{"type":"MemoryPressure","status":"False","lastHeartbeatTime":"2018-05-07T20:50:23Z","lastTransitionTime":"2018-05-07T20:50:23Z","reason":"KubeletHasSufficientMemory","message":"kubelet has sufficient memory available"},{"type":"DiskPressure","status":"False","lastHeartbeatTime":"2018-05-07T20:50:23Z","lastTransitionTime":"2018-05-07T20:50:23Z","reason":"KubeletHasNoDiskPressure","message":"kubelet has no disk pressure"},{"type":"Ready","status":"False","lastHeartbeatTime":"2018-05-07T20:50:23Z","lastTransitionTime":"2018-05-07T20:50:23Z","reason":"KubeletNotReady","message":"container runtime is down"}],"addresses":[{"type":"LegacyHostIP","address":"172.18.8.28"},{"type":"InternalIP","address":"172.18.8.28"},{"type":"Hostname","address":"172.18.8.28"}],"daemonEndpoints":{"kubeletEndpoint":{"Port":10250}},"nodeInfo":{"machineID":"f9afeb75a5a382dce8269887a67fbf58","systemUUID":"233920EC-7E83-AC39-2195-FEFB81836DED","bootID":"de6e4cd9-82e9-407c-8316-7062eacd9062","kernelVersion":"3.10.0-327.22.2.el7.x86_64","osImage":"CentOS Linux 7 (Core)","containerRuntimeVersion":"docker://1.10.3","kubeletVersion":"v1.5.2+43a9be4","kubeProxyVersion":"v1.5.2+43a9be4","operatingSystem":"linux","architecture":"amd64"},"images":[{"names":["openshift/openvswitch:c106caf","openshift/openvswitch:latest"],"sizeBytes":1026697644},{"names":["openshift/node:c106caf","openshift/node:latest"],"sizeBytes":1025016185},{"names":["openshift/origin-gitserver:c106caf","openshift/origin-gitserver:latest"],"sizeBytes":1002075992},{"names":["openshift/origin-keepalived-ipfailover:c106caf","openshift/origin-keepalived-ipfailover:latest"],"sizeBytes":971721463},{"names":["openshift/origin-haproxy-router:c106caf","openshift/origin-haproxy-router:latest"],"sizeBytes":965766197},{"names":["openshift/origin-recycler:c106caf","openshift/origin-recycler:latest"],"sizeBytes":947041099},{"names":["openshift/origin-docker-builder:c106caf","openshift/origin-docker-builder:latest"],"sizeBytes":947041099},{"names":["openshift/origin-deployer:c106caf","openshift/origin-deployer:latest"],"sizeBytes":947041099},{"names":["openshift/origin-sti-builder:c106caf","openshift/origin-sti-builder:latest"],"sizeBytes":947041099},{"names":["openshift/origin-f5-router:c106caf","openshift/origin-f5-router:latest"],"sizeBytes":947041099},{"names":["openshift/origin:c106caf","openshift/origin:latest"],"sizeBytes":947041099},{"names":["docker.io/openshift/origin-release:golang-1.7"],"sizeBytes":857644817},{"names":["openshift/origin-release:latest"],"sizeBytes":719000618},{"names":["openshift/dind-master:latest"],"sizeBytes":474218996},{"names":["openshift/dind-node:latest"],"sizeBytes":474215272},{"names":["openshift/origin-docker-registry:c106caf","openshift/origin-docker-registry:latest"],"sizeBytes":468441298},{"names":["openshift/origin-egress-router:c106caf","openshift/origin-egress-router:latest"],"sizeBytes":420088533},{"names":["openshift/origin-base:latest"],"sizeBytes":402162201},{"names":["openshift/dind:latest"],"sizeBytes":384423296},{"names":["openshift/origin-haproxy-router-base:latest"],"sizeBytes":294278935},{"names":["docker.io/fedora:25"],"sizeBytes":230864375},{"names":["docker.io/centos:centos7"],"sizeBytes":196509652},{"names":["openshift/hello-openshift:c106caf","openshift/hello-openshift:latest"],"sizeBytes":5635062},{"names":["openshift/origin-pod:c106caf","openshift/origin-pod:latest"],"sizeBytes":1138998}]}}

There was no error output from the command.
info: password for stats user admin has been set to KpMqE8OVJr
--> Creating router router ...
    serviceaccount "router" created
    clusterrolebinding "router-router-role" created
    deploymentconfig "router" created
    service "router" created
--> Success
serviceaccount "registry" created
clusterrolebinding "registry-registry-role" created
deploymentconfig "docker-registry" created
service "docker-registry" created
Running /data/src/github.com/openshift/origin/ci_test_every_pr.sh:90: executing 'oadm registry' expecting success...
SUCCESS after 0.399s: /data/src/github.com/openshift/origin/ci_test_every_pr.sh:90: executing 'oadm registry' expecting success
Standard output from the command:
Docker registry "docker-registry" service exists

There was no error output from the command.
Running /data/src/github.com/openshift/origin/ci_test_every_pr.sh:91: executing 'oadm router' expecting success...
SUCCESS after 0.227s: /data/src/github.com/openshift/origin/ci_test_every_pr.sh:91: executing 'oadm router' expecting success
Standard output from the command:
Router "router" service exists

There was no error output from the command.
Running /data/src/github.com/openshift/origin/ci_test_every_pr.sh:95: executing 'oadm policy add-cluster-role-to-user cluster-admin metrics-admin' expecting success...
SUCCESS after 0.299s: /data/src/github.com/openshift/origin/ci_test_every_pr.sh:95: executing 'oadm policy add-cluster-role-to-user cluster-admin metrics-admin' expecting success
Standard output from the command:
cluster role "cluster-admin" added: "metrics-admin"

There was no error output from the command.
Running /data/src/github.com/openshift/origin/ci_test_every_pr.sh:96: executing 'oadm policy add-cluster-role-to-user cluster-admin metrics-admin' expecting success...
SUCCESS after 0.213s: /data/src/github.com/openshift/origin/ci_test_every_pr.sh:96: executing 'oadm policy add-cluster-role-to-user cluster-admin metrics-admin' expecting success
Standard output from the command:
cluster role "cluster-admin" added: "metrics-admin"

There was no error output from the command.
Running /data/src/github.com/openshift/origin/ci_test_every_pr.sh:97: executing 'oc login -u metrics-admin -p g1b315H' expecting success...
SUCCESS after 0.205s: /data/src/github.com/openshift/origin/ci_test_every_pr.sh:97: executing 'oc login -u metrics-admin -p g1b315H' expecting success
Standard output from the command:
Login successful.

You have one project on this server: "default"

Using project "default".

There was no error output from the command.
+ Info ================================================================================
+ echo '[INFO]' ================================================================================
[INFO] ================================================================================
+ Info 'Starting Origin-Metric end-to-end test'
[INFO] Starting Origin-Metric end-to-end test
+ echo '[INFO]' Starting Origin-Metric end-to-end test
+ Info
[INFO]
+ echo '[INFO]'
+ Info Settings:
[INFO] Settings:
+ echo '[INFO]' Settings:
++ realpath /data/src/github.com/openshift/origin-metrics/hack/../hack/tests/../..
+ Info 'Base Directory: /data/src/github.com/openshift/origin-metrics'
[INFO] Base Directory: /data/src/github.com/openshift/origin-metrics
+ echo '[INFO]' Base Directory: /data/src/github.com/openshift/origin-metrics
+ Info ================================================================================
[INFO] ================================================================================
+ echo '[INFO]' ================================================================================
+ Info
[INFO]
+ echo '[INFO]'
++ date +%s
+ TEST_STARTTIME=1525726226
++ date +%s
+ export TEST_PROJECT=test-1525726226
+ TEST_PROJECT=test-1525726226
+ trap cleanup SIGINT SIGTERM EXIT
+ '[' true = true ']'
+ test.build
+ Info
[INFO]
+ echo '[INFO]'
+ Info 'Building new images'
[INFO] Building new images
+ echo '[INFO]' Building new images
+ sh /data/src/github.com/openshift/origin-metrics/hack/../hack/tests/../../hack/build-images.sh --no-cache


--- Building component '/data/src/github.com/openshift/origin-metrics/hack/../hack/tests/../../hack/../deployer/' with docker tag 'openshift/origin-metrics-deployer:latest' ---
Sending build context to Docker daemon 90.11 kB

Step 1 : FROM openshift/origin:latest
 ---> c95e934b9b09
Step 2 : MAINTAINER Hawkular Metrics <hawkular-dev@lists.jboss.org>
 ---> Running in 9bc1d6445387
 ---> ebdf554f7a64
Removing intermediate container 9bc1d6445387
Step 3 : ENV BIN_DIR /opt/deploy PROCESSING_DIR /etc/deploy/_output KUBECONFIG /etc/deploy/.kubeconfig WRITE_KUBECONFIG 1 SECRET_DIR /secret
 ---> Running in 65154280fa27
 ---> 6e44bfeee8c9
Removing intermediate container 65154280fa27
Step 4 : RUN yum install -y java-1.8.0-openjdk openssl httpd-tools bind-utils && yum clean all
 ---> Running in 79e5bca83247
Loaded plugins: fastestmirror, ovl
Determining fastest mirrors
 * base: repos-va.psychz.net
 * epel: s3-mirror-us-east-1.fedoraproject.org
 * extras: mirror.lug.udel.edu
 * updates: mirrors.lga7.us.voxel.net
Resolving Dependencies
--> Running transaction check
---> Package bind-utils.x86_64 32:9.9.4-51.el7_4.2 will be installed
--> Processing Dependency: bind-libs = 32:9.9.4-51.el7_4.2 for package: 32:bind-utils-9.9.4-51.el7_4.2.x86_64
--> Processing Dependency: liblwres.so.90()(64bit) for package: 32:bind-utils-9.9.4-51.el7_4.2.x86_64
--> Processing Dependency: libisccfg.so.90()(64bit) for package: 32:bind-utils-9.9.4-51.el7_4.2.x86_64
--> Processing Dependency: libisccc.so.90()(64bit) for package: 32:bind-utils-9.9.4-51.el7_4.2.x86_64
--> Processing Dependency: libisc.so.95()(64bit) for package: 32:bind-utils-9.9.4-51.el7_4.2.x86_64
--> Processing Dependency: libdns.so.100()(64bit) for package: 32:bind-utils-9.9.4-51.el7_4.2.x86_64
--> Processing Dependency: libbind9.so.90()(64bit) for package: 32:bind-utils-9.9.4-51.el7_4.2.x86_64
--> Processing Dependency: libGeoIP.so.1()(64bit) for package: 32:bind-utils-9.9.4-51.el7_4.2.x86_64
---> Package httpd-tools.x86_64 0:2.4.6-67.el7.centos.6 will be installed
--> Processing Dependency: libaprutil-1.so.0()(64bit) for package: httpd-tools-2.4.6-67.el7.centos.6.x86_64
--> Processing Dependency: libapr-1.so.0()(64bit) for package: httpd-tools-2.4.6-67.el7.centos.6.x86_64
---> Package java-1.8.0-openjdk.x86_64 1:1.8.0.161-0.b14.el7_4 will be installed
--> Processing Dependency: java-1.8.0-openjdk-headless(x86-64) = 1:1.8.0.161-0.b14.el7_4 for package: 1:java-1.8.0-openjdk-1.8.0.161-0.b14.el7_4.x86_64
--> Processing Dependency: xorg-x11-fonts-Type1 for package: 1:java-1.8.0-openjdk-1.8.0.161-0.b14.el7_4.x86_64
--> Processing Dependency: libpng15.so.15(PNG15_0)(64bit) for package: 1:java-1.8.0-openjdk-1.8.0.161-0.b14.el7_4.x86_64
--> Processing Dependency: libjvm.so(SUNWprivate_1.1)(64bit) for package: 1:java-1.8.0-openjdk-1.8.0.161-0.b14.el7_4.x86_64
--> Processing Dependency: libjpeg.so.62(LIBJPEG_6.2)(64bit) for package: 1:java-1.8.0-openjdk-1.8.0.161-0.b14.el7_4.x86_64
--> Processing Dependency: libjli.so(SUNWprivate_1.1)(64bit) for package: 1:java-1.8.0-openjdk-1.8.0.161-0.b14.el7_4.x86_64
--> Processing Dependency: libjava.so(SUNWprivate_1.1)(64bit) for package: 1:java-1.8.0-openjdk-1.8.0.161-0.b14.el7_4.x86_64
--> Processing Dependency: libasound.so.2(ALSA_0.9.0rc4)(64bit) for package: 1:java-1.8.0-openjdk-1.8.0.161-0.b14.el7_4.x86_64
--> Processing Dependency: libasound.so.2(ALSA_0.9)(64bit) for package: 1:java-1.8.0-openjdk-1.8.0.161-0.b14.el7_4.x86_64
--> Processing Dependency: fontconfig(x86-64) for package: 1:java-1.8.0-openjdk-1.8.0.161-0.b14.el7_4.x86_64
--> Processing Dependency: libpng15.so.15()(64bit) for package: 1:java-1.8.0-openjdk-1.8.0.161-0.b14.el7_4.x86_64
--> Processing Dependency: libjvm.so()(64bit) for package: 1:java-1.8.0-openjdk-1.8.0.161-0.b14.el7_4.x86_64
--> Processing Dependency: libjpeg.so.62()(64bit) for package: 1:java-1.8.0-openjdk-1.8.0.161-0.b14.el7_4.x86_64
--> Processing Dependency: libjli.so()(64bit) for package: 1:java-1.8.0-openjdk-1.8.0.161-0.b14.el7_4.x86_64
--> Processing Dependency: libjava.so()(64bit) for package: 1:java-1.8.0-openjdk-1.8.0.161-0.b14.el7_4.x86_64
--> Processing Dependency: libgif.so.4()(64bit) for package: 1:java-1.8.0-openjdk-1.8.0.161-0.b14.el7_4.x86_64
--> Processing Dependency: libawt.so()(64bit) for package: 1:java-1.8.0-openjdk-1.8.0.161-0.b14.el7_4.x86_64
--> Processing Dependency: libasound.so.2()(64bit) for package: 1:java-1.8.0-openjdk-1.8.0.161-0.b14.el7_4.x86_64
--> Processing Dependency: libXtst.so.6()(64bit) for package: 1:java-1.8.0-openjdk-1.8.0.161-0.b14.el7_4.x86_64
--> Processing Dependency: libXrender.so.1()(64bit) for package: 1:java-1.8.0-openjdk-1.8.0.161-0.b14.el7_4.x86_64
--> Processing Dependency: libXi.so.6()(64bit) for package: 1:java-1.8.0-openjdk-1.8.0.161-0.b14.el7_4.x86_64
--> Processing Dependency: libXext.so.6()(64bit) for package: 1:java-1.8.0-openjdk-1.8.0.161-0.b14.el7_4.x86_64
--> Processing Dependency: libXcomposite.so.1()(64bit) for package: 1:java-1.8.0-openjdk-1.8.0.161-0.b14.el7_4.x86_64
--> Processing Dependency: libX11.so.6()(64bit) for package: 1:java-1.8.0-openjdk-1.8.0.161-0.b14.el7_4.x86_64
---> Package openssl.x86_64 1:1.0.2k-8.el7 will be installed
--> Processing Dependency: openssl-libs(x86-64) = 1:1.0.2k-8.el7 for package: 1:openssl-1.0.2k-8.el7.x86_64
--> Processing Dependency: libcrypto.so.10(OPENSSL_1.0.2)(64bit) for package: 1:openssl-1.0.2k-8.el7.x86_64
--> Running transaction check
---> Package GeoIP.x86_64 0:1.5.0-11.el7 will be installed
---> Package alsa-lib.x86_64 0:1.1.3-3.el7 will be installed
---> Package apr.x86_64 0:1.4.8-3.el7_4.1 will be installed
---> Package apr-util.x86_64 0:1.5.2-6.el7 will be installed
---> Package bind-libs.x86_64 32:9.9.4-51.el7_4.2 will be installed
--> Processing Dependency: bind-license = 32:9.9.4-51.el7_4.2 for package: 32:bind-libs-9.9.4-51.el7_4.2.x86_64
---> Package fontconfig.x86_64 0:2.10.95-11.el7 will be installed
--> Processing Dependency: freetype for package: fontconfig-2.10.95-11.el7.x86_64
--> Processing Dependency: fontpackages-filesystem for package: fontconfig-2.10.95-11.el7.x86_64
--> Processing Dependency: font(:lang=en) for package: fontconfig-2.10.95-11.el7.x86_64
--> Processing Dependency: libfreetype.so.6()(64bit) for package: fontconfig-2.10.95-11.el7.x86_64
---> Package giflib.x86_64 0:4.1.6-9.el7 will be installed
--> Processing Dependency: libSM.so.6()(64bit) for package: giflib-4.1.6-9.el7.x86_64
--> Processing Dependency: libICE.so.6()(64bit) for package: giflib-4.1.6-9.el7.x86_64
---> Package java-1.8.0-openjdk-headless.x86_64 1:1.8.0.161-0.b14.el7_4 will be installed
--> Processing Dependency: tzdata-java >= 2015d for package: 1:java-1.8.0-openjdk-headless-1.8.0.161-0.b14.el7_4.x86_64
--> Processing Dependency: nss-softokn(x86-64) >= 3.28.3 for package: 1:java-1.8.0-openjdk-headless-1.8.0.161-0.b14.el7_4.x86_64
--> Processing Dependency: nss(x86-64) >= 3.28.4 for package: 1:java-1.8.0-openjdk-headless-1.8.0.161-0.b14.el7_4.x86_64
--> Processing Dependency: copy-jdk-configs >= 2.2 for package: 1:java-1.8.0-openjdk-headless-1.8.0.161-0.b14.el7_4.x86_64
--> Processing Dependency: chkconfig >= 1.7 for package: 1:java-1.8.0-openjdk-headless-1.8.0.161-0.b14.el7_4.x86_64
--> Processing Dependency: chkconfig >= 1.7 for package: 1:java-1.8.0-openjdk-headless-1.8.0.161-0.b14.el7_4.x86_64
--> Processing Dependency: lksctp-tools(x86-64) for package: 1:java-1.8.0-openjdk-headless-1.8.0.161-0.b14.el7_4.x86_64
--> Processing Dependency: jpackage-utils for package: 1:java-1.8.0-openjdk-headless-1.8.0.161-0.b14.el7_4.x86_64
---> Package libX11.x86_64 0:1.6.5-1.el7 will be installed
--> Processing Dependency: libX11-common >= 1.6.5-1.el7 for package: libX11-1.6.5-1.el7.x86_64
--> Processing Dependency: libxcb.so.1()(64bit) for package: libX11-1.6.5-1.el7.x86_64
---> Package libXcomposite.x86_64 0:0.4.4-4.1.el7 will be installed
---> Package libXext.x86_64 0:1.3.3-3.el7 will be installed
---> Package libXi.x86_64 0:1.7.9-1.el7 will be installed
---> Package libXrender.x86_64 0:0.9.10-1.el7 will be installed
---> Package libXtst.x86_64 0:1.2.3-1.el7 will be installed
---> Package libjpeg-turbo.x86_64 0:1.2.90-5.el7 will be installed
---> Package libpng.x86_64 2:1.5.13-7.el7_2 will be installed
---> Package openssl-libs.x86_64 1:1.0.1e-51.el7_2.7 will be updated
---> Package openssl-libs.x86_64 1:1.0.2k-8.el7 will be an update
---> Package xorg-x11-fonts-Type1.noarch 0:7.5-9.el7 will be installed
--> Processing Dependency: ttmkfdir for package: xorg-x11-fonts-Type1-7.5-9.el7.noarch
--> Processing Dependency: ttmkfdir for package: xorg-x11-fonts-Type1-7.5-9.el7.noarch
--> Processing Dependency: mkfontdir for package: xorg-x11-fonts-Type1-7.5-9.el7.noarch
--> Processing Dependency: mkfontdir for package: xorg-x11-fonts-Type1-7.5-9.el7.noarch
--> Running transaction check
---> Package bind-license.noarch 32:9.9.4-29.el7_2.4 will be updated
---> Package bind-license.noarch 32:9.9.4-51.el7_4.2 will be an update
---> Package chkconfig.x86_64 0:1.3.61-5.el7_2.1 will be updated
---> Package chkconfig.x86_64 0:1.7.4-1.el7 will be an update
---> Package copy-jdk-configs.noarch 0:2.2-5.el7_4 will be installed
---> Package fontpackages-filesystem.noarch 0:1.44-8.el7 will be installed
---> Package freetype.x86_64 0:2.4.11-15.el7 will be installed
---> Package javapackages-tools.noarch 0:3.4.1-11.el7 will be installed
--> Processing Dependency: python-javapackages = 3.4.1-11.el7 for package: javapackages-tools-3.4.1-11.el7.noarch
--> Processing Dependency: libxslt for package: javapackages-tools-3.4.1-11.el7.noarch
---> Package libICE.x86_64 0:1.0.9-9.el7 will be installed
---> Package libSM.x86_64 0:1.2.2-2.el7 will be installed
---> Package libX11-common.noarch 0:1.6.5-1.el7 will be installed
---> Package libxcb.x86_64 0:1.12-1.el7 will be installed
--> Processing Dependency: libXau.so.6()(64bit) for package: libxcb-1.12-1.el7.x86_64
---> Package lksctp-tools.x86_64 0:1.0.17-2.el7 will be installed
---> Package lyx-fonts.noarch 0:2.2.3-1.el7 will be installed
---> Package nss.x86_64 0:3.21.0-9.el7_2 will be updated
--> Processing Dependency: nss = 3.21.0-9.el7_2 for package: nss-sysinit-3.21.0-9.el7_2.x86_64
--> Processing Dependency: nss(x86-64) = 3.21.0-9.el7_2 for package: nss-tools-3.21.0-9.el7_2.x86_64
---> Package nss.x86_64 0:3.28.4-15.el7_4 will be an update
--> Processing Dependency: nss-util >= 3.28.4-2 for package: nss-3.28.4-15.el7_4.x86_64
--> Processing Dependency: nspr >= 4.13.1 for package: nss-3.28.4-15.el7_4.x86_64
--> Processing Dependency: nss-pem(x86-64) for package: nss-3.28.4-15.el7_4.x86_64
--> Processing Dependency: libnssutil3.so(NSSUTIL_3.24)(64bit) for package: nss-3.28.4-15.el7_4.x86_64
---> Package nss-softokn.x86_64 0:3.16.2.3-14.2.el7_2 will be updated
---> Package nss-softokn.x86_64 0:3.28.3-8.el7_4 will be an update
--> Processing Dependency: nss-softokn-freebl(x86-64) >= 3.28.3-8.el7_4 for package: nss-softokn-3.28.3-8.el7_4.x86_64
---> Package ttmkfdir.x86_64 0:3.0.9-42.el7 will be installed
---> Package tzdata-java.noarch 0:2018d-1.el7 will be installed
---> Package xorg-x11-font-utils.x86_64 1:7.5-20.el7 will be installed
--> Processing Dependency: libfontenc.so.1()(64bit) for package: 1:xorg-x11-font-utils-7.5-20.el7.x86_64
--> Processing Dependency: libXfont.so.1()(64bit) for package: 1:xorg-x11-font-utils-7.5-20.el7.x86_64
--> Running transaction check
---> Package libXau.x86_64 0:1.0.8-2.1.el7 will be installed
---> Package libXfont.x86_64 0:1.5.2-1.el7 will be installed
---> Package libfontenc.x86_64 0:1.1.3-3.el7 will be installed
---> Package libxslt.x86_64 0:1.1.28-5.el7 will be installed
---> Package nspr.x86_64 0:4.11.0-1.el7_2 will be updated
---> Package nspr.x86_64 0:4.13.1-1.0.el7_3 will be an update
---> Package nss-pem.x86_64 0:1.0.3-4.el7 will be installed
---> Package nss-softokn-freebl.x86_64 0:3.16.2.3-14.2.el7_2 will be updated
---> Package nss-softokn-freebl.x86_64 0:3.28.3-8.el7_4 will be an update
---> Package nss-sysinit.x86_64 0:3.21.0-9.el7_2 will be updated
---> Package nss-sysinit.x86_64 0:3.28.4-15.el7_4 will be an update
---> Package nss-tools.x86_64 0:3.21.0-9.el7_2 will be updated
---> Package nss-tools.x86_64 0:3.28.4-15.el7_4 will be an update
---> Package nss-util.x86_64 0:3.21.0-2.2.el7_2 will be updated
---> Package nss-util.x86_64 0:3.28.4-3.el7 will be an update
---> Package python-javapackages.noarch 0:3.4.1-11.el7 will be installed
--> Processing Dependency: python-lxml for package: python-javapackages-3.4.1-11.el7.noarch
--> Running transaction check
---> Package python-lxml.x86_64 0:3.2.1-4.el7 will be installed
--> Finished Dependency Resolution

Dependencies Resolved

================================================================================
 Package                      Arch    Version                    Repository
                                                                           Size
================================================================================
Installing:
 bind-utils                   x86_64  32:9.9.4-51.el7_4.2        updates  203 k
 httpd-tools                  x86_64  2.4.6-67.el7.centos.6      updates   88 k
 java-1.8.0-openjdk           x86_64  1:1.8.0.161-0.b14.el7_4    updates  243 k
 openssl                      x86_64  1:1.0.2k-8.el7             base     492 k
Installing for dependencies:
 GeoIP                        x86_64  1.5.0-11.el7               base     1.1 M
 alsa-lib                     x86_64  1.1.3-3.el7                base     421 k
 apr                          x86_64  1.4.8-3.el7_4.1            updates  103 k
 apr-util                     x86_64  1.5.2-6.el7                base      92 k
 bind-libs                    x86_64  32:9.9.4-51.el7_4.2        updates  1.0 M
 copy-jdk-configs             noarch  2.2-5.el7_4                updates   19 k
 fontconfig                   x86_64  2.10.95-11.el7             base     229 k
 fontpackages-filesystem      noarch  1.44-8.el7                 base     9.9 k
 freetype                     x86_64  2.4.11-15.el7              base     392 k
 giflib                       x86_64  4.1.6-9.el7                base      40 k
 java-1.8.0-openjdk-headless  x86_64  1:1.8.0.161-0.b14.el7_4    updates   32 M
 javapackages-tools           noarch  3.4.1-11.el7               base      73 k
 libICE                       x86_64  1.0.9-9.el7                base      66 k
 libSM                        x86_64  1.2.2-2.el7                base      39 k
 libX11                       x86_64  1.6.5-1.el7                base     606 k
 libX11-common                noarch  1.6.5-1.el7                base     164 k
 libXau                       x86_64  1.0.8-2.1.el7              base      29 k
 libXcomposite                x86_64  0.4.4-4.1.el7              base      22 k
 libXext                      x86_64  1.3.3-3.el7                base      39 k
 libXfont                     x86_64  1.5.2-1.el7                base     152 k
 libXi                        x86_64  1.7.9-1.el7                base      40 k
 libXrender                   x86_64  0.9.10-1.el7               base      26 k
 libXtst                      x86_64  1.2.3-1.el7                base      20 k
 libfontenc                   x86_64  1.1.3-3.el7                base      31 k
 libjpeg-turbo                x86_64  1.2.90-5.el7               base     134 k
 libpng                       x86_64  2:1.5.13-7.el7_2           base     213 k
 libxcb                       x86_64  1.12-1.el7                 base     211 k
 libxslt                      x86_64  1.1.28-5.el7               base     242 k
 lksctp-tools                 x86_64  1.0.17-2.el7               base      88 k
 lyx-fonts                    noarch  2.2.3-1.el7                epel     159 k
 nss-pem                      x86_64  1.0.3-4.el7                base      73 k
 python-javapackages          noarch  3.4.1-11.el7               base      31 k
 python-lxml                  x86_64  3.2.1-4.el7                base     758 k
 ttmkfdir                     x86_64  3.0.9-42.el7               base      48 k
 tzdata-java                  noarch  2018d-1.el7                updates  184 k
 xorg-x11-font-utils          x86_64  1:7.5-20.el7               base      87 k
 xorg-x11-fonts-Type1         noarch  7.5-9.el7                  base     521 k
Updating for dependencies:
 bind-license                 noarch  32:9.9.4-51.el7_4.2        updates   84 k
 chkconfig                    x86_64  1.7.4-1.el7                base     181 k
 nspr                         x86_64  4.13.1-1.0.el7_3           base     126 k
 nss                          x86_64  3.28.4-15.el7_4            updates  849 k
 nss-softokn                  x86_64  3.28.3-8.el7_4             updates  310 k
 nss-softokn-freebl           x86_64  3.28.3-8.el7_4             updates  214 k
 nss-sysinit                  x86_64  3.28.4-15.el7_4            updates   60 k
 nss-tools                    x86_64  3.28.4-15.el7_4            updates  501 k
 nss-util                     x86_64  3.28.4-3.el7               base      73 k
 openssl-libs                 x86_64  1:1.0.2k-8.el7             base     1.2 M

Transaction Summary
================================================================================
Install  4 Packages (+37 Dependent packages)
Upgrade             ( 10 Dependent packages)

Total download size: 43 M
Downloading packages:
Delta RPMs disabled because /usr/bin/applydeltarpm not installed.
Public key for lyx-fonts-2.2.3-1.el7.noarch.rpm is not installed
warning: /var/cache/yum/x86_64/7/epel/packages/lyx-fonts-2.2.3-1.el7.noarch.rpm: Header V3 RSA/SHA256 Signature, key ID 352c64e5: NOKEY
--------------------------------------------------------------------------------
Total                                               23 MB/s |  43 MB  00:01     
Retrieving key from file:///etc/pki/rpm-gpg/RPM-GPG-KEY-EPEL-7
Importing GPG key 0x352C64E5:
 Userid     : "Fedora EPEL (7) <epel@fedoraproject.org>"
 Fingerprint: 91e9 7d7c 4a5e 96f1 7f3e 888f 6a2f aea2 352c 64e5
 Package    : epel-release-7-9.noarch (@extras)
 From       : /etc/pki/rpm-gpg/RPM-GPG-KEY-EPEL-7
Running transaction check
Running transaction test
Transaction test succeeded
Running transaction
  Updating   : nspr-4.13.1-1.0.el7_3.x86_64                                1/61 
  Updating   : nss-util-3.28.4-3.el7.x86_64                                2/61 
  Installing : freetype-2.4.11-15.el7.x86_64                               3/61 
  Updating   : 1:openssl-libs-1.0.2k-8.el7.x86_64                          4/61 
  Installing : libfontenc-1.1.3-3.el7.x86_64                               5/61 
  Updating   : chkconfig-1.7.4-1.el7.x86_64                                6/61 
  Installing : GeoIP-1.5.0-11.el7.x86_64                                   7/61 
  Installing : apr-1.4.8-3.el7_4.1.x86_64                                  8/61 
  Installing : libxslt-1.1.28-5.el7.x86_64                                 9/61 
  Installing : fontpackages-filesystem-1.44-8.el7.noarch                  10/61 
  Installing : libjpeg-turbo-1.2.90-5.el7.x86_64                          11/61 
  Installing : libICE-1.0.9-9.el7.x86_64                                  12/61 
  Installing : libSM-1.2.2-2.el7.x86_64                                   13/61 
  Installing : lyx-fonts-2.2.3-1.el7.noarch                               14/61 
  Installing : fontconfig-2.10.95-11.el7.x86_64                           15/61 
  Installing : python-lxml-3.2.1-4.el7.x86_64                             16/61 
  Installing : python-javapackages-3.4.1-11.el7.noarch                    17/61 
  Installing : javapackages-tools-3.4.1-11.el7.noarch                     18/61 
  Installing : apr-util-1.5.2-6.el7.x86_64                                19/61 
  Installing : libXfont-1.5.2-1.el7.x86_64                                20/61 
  Installing : 1:xorg-x11-font-utils-7.5-20.el7.x86_64                    21/61 
  Installing : ttmkfdir-3.0.9-42.el7.x86_64                               22/61 
  Installing : xorg-x11-fonts-Type1-7.5-9.el7.noarch                      23/61 
  Updating   : nss-softokn-freebl-3.28.3-8.el7_4.x86_64                   24/61 
  Updating   : nss-softokn-3.28.3-8.el7_4.x86_64                          25/61 
  Updating   : nss-sysinit-3.28.4-15.el7_4.x86_64                         26/61 
  Updating   : nss-3.28.4-15.el7_4.x86_64                                 27/61 
  Installing : nss-pem-1.0.3-4.el7.x86_64                                 28/61 
  Installing : alsa-lib-1.1.3-3.el7.x86_64                                29/61 
  Installing : copy-jdk-configs-2.2-5.el7_4.noarch                        30/61 
  Installing : libXau-1.0.8-2.1.el7.x86_64                                31/61 
  Installing : libxcb-1.12-1.el7.x86_64                                   32/61 
  Installing : tzdata-java-2018d-1.el7.noarch                             33/61 
  Updating   : 32:bind-license-9.9.4-51.el7_4.2.noarch                    34/61 
  Installing : 32:bind-libs-9.9.4-51.el7_4.2.x86_64                       35/61 
  Installing : libX11-common-1.6.5-1.el7.noarch                           36/61 
  Installing : libX11-1.6.5-1.el7.x86_64                                  37/61 
  Installing : libXext-1.3.3-3.el7.x86_64                                 38/61 
  Installing : libXi-1.7.9-1.el7.x86_64                                   39/61 
  Installing : libXtst-1.2.3-1.el7.x86_64                                 40/61 
  Installing : giflib-4.1.6-9.el7.x86_64                                  41/61 
  Installing : libXrender-0.9.10-1.el7.x86_64                             42/61 
  Installing : libXcomposite-0.4.4-4.1.el7.x86_64                         43/61 
  Installing : lksctp-tools-1.0.17-2.el7.x86_64                           44/61 
  Installing : 1:java-1.8.0-openjdk-headless-1.8.0.161-0.b14.el7_4.x86_   45/61 
  Installing : 2:libpng-1.5.13-7.el7_2.x86_64                             46/61 
  Installing : 1:java-1.8.0-openjdk-1.8.0.161-0.b14.el7_4.x86_64          47/61 
  Installing : 32:bind-utils-9.9.4-51.el7_4.2.x86_64                      48/61 
  Updating   : nss-tools-3.28.4-15.el7_4.x86_64                           49/61 
  Installing : httpd-tools-2.4.6-67.el7.centos.6.x86_64                   50/61 
  Installing : 1:openssl-1.0.2k-8.el7.x86_64                              51/61 
  Cleanup    : nss-tools-3.21.0-9.el7_2.x86_64                            52/61 
  Cleanup    : 32:bind-license-9.9.4-29.el7_2.4.noarch                    53/61 
  Cleanup    : nss-3.21.0-9.el7_2.x86_64                                  54/61 
  Cleanup    : nss-sysinit-3.21.0-9.el7_2.x86_64                          55/61 
  Cleanup    : nss-softokn-3.16.2.3-14.2.el7_2.x86_64                     56/61 
  Cleanup    : nss-util-3.21.0-2.2.el7_2.x86_64                           57/61 
  Cleanup    : nspr-4.11.0-1.el7_2.x86_64                                 58/61 
  Cleanup    : nss-softokn-freebl-3.16.2.3-14.2.el7_2.x86_64              59/61 
  Cleanup    : chkconfig-1.3.61-5.el7_2.1.x86_64                          60/61 
  Cleanup    : 1:openssl-libs-1.0.1e-51.el7_2.7.x86_64                    61/61 
  Verifying  : libXext-1.3.3-3.el7.x86_64                                  1/61 
  Verifying  : libX11-1.6.5-1.el7.x86_64                                   2/61 
  Verifying  : libXi-1.7.9-1.el7.x86_64                                    3/61 
  Verifying  : 1:java-1.8.0-openjdk-1.8.0.161-0.b14.el7_4.x86_64           4/61 
  Verifying  : libICE-1.0.9-9.el7.x86_64                                   5/61 
  Verifying  : giflib-4.1.6-9.el7.x86_64                                   6/61 
  Verifying  : libjpeg-turbo-1.2.90-5.el7.x86_64                           7/61 
  Verifying  : nss-pem-1.0.3-4.el7.x86_64                                  8/61 
  Verifying  : libXrender-0.9.10-1.el7.x86_64                              9/61 
  Verifying  : lyx-fonts-2.2.3-1.el7.noarch                               10/61 
  Verifying  : python-lxml-3.2.1-4.el7.x86_64                             11/61 
  Verifying  : 2:libpng-1.5.13-7.el7_2.x86_64                             12/61 
  Verifying  : freetype-2.4.11-15.el7.x86_64                              13/61 
  Verifying  : 32:bind-libs-9.9.4-51.el7_4.2.x86_64                       14/61 
  Verifying  : fontpackages-filesystem-1.44-8.el7.noarch                  15/61 
  Verifying  : ttmkfdir-3.0.9-42.el7.x86_64                               16/61 
  Verifying  : nspr-4.13.1-1.0.el7_3.x86_64                               17/61 
  Verifying  : nss-util-3.28.4-3.el7.x86_64                               18/61 
  Verifying  : 1:openssl-1.0.2k-8.el7.x86_64                              19/61 
  Verifying  : python-javapackages-3.4.1-11.el7.noarch                    20/61 
  Verifying  : nss-softokn-3.28.3-8.el7_4.x86_64                          21/61 
  Verifying  : httpd-tools-2.4.6-67.el7.centos.6.x86_64                   22/61 
  Verifying  : libXcomposite-0.4.4-4.1.el7.x86_64                         23/61 
  Verifying  : 1:openssl-libs-1.0.2k-8.el7.x86_64                         24/61 
  Verifying  : libXtst-1.2.3-1.el7.x86_64                                 25/61 
  Verifying  : 32:bind-utils-9.9.4-51.el7_4.2.x86_64                      26/61 
  Verifying  : lksctp-tools-1.0.17-2.el7.x86_64                           27/61 
  Verifying  : libX11-common-1.6.5-1.el7.noarch                           28/61 
  Verifying  : nss-sysinit-3.28.4-15.el7_4.x86_64                         29/61 
  Verifying  : libxcb-1.12-1.el7.x86_64                                   30/61 
  Verifying  : xorg-x11-fonts-Type1-7.5-9.el7.noarch                      31/61 
  Verifying  : nss-tools-3.28.4-15.el7_4.x86_64                           32/61 
  Verifying  : libxslt-1.1.28-5.el7.x86_64                                33/61 
  Verifying  : apr-util-1.5.2-6.el7.x86_64                                34/61 
  Verifying  : libXfont-1.5.2-1.el7.x86_64                                35/61 
  Verifying  : javapackages-tools-3.4.1-11.el7.noarch                     36/61 
  Verifying  : apr-1.4.8-3.el7_4.1.x86_64                                 37/61 
  Verifying  : 32:bind-license-9.9.4-51.el7_4.2.noarch                    38/61 
  Verifying  : tzdata-java-2018d-1.el7.noarch                             39/61 
  Verifying  : libXau-1.0.8-2.1.el7.x86_64                                40/61 
  Verifying  : GeoIP-1.5.0-11.el7.x86_64                                  41/61 
  Verifying  : libSM-1.2.2-2.el7.x86_64                                   42/61 
  Verifying  : fontconfig-2.10.95-11.el7.x86_64                           43/61 
  Verifying  : copy-jdk-configs-2.2-5.el7_4.noarch                        44/61 
  Verifying  : 1:java-1.8.0-openjdk-headless-1.8.0.161-0.b14.el7_4.x86_   45/61 
  Verifying  : nss-3.28.4-15.el7_4.x86_64                                 46/61 
  Verifying  : chkconfig-1.7.4-1.el7.x86_64                               47/61 
  Verifying  : libfontenc-1.1.3-3.el7.x86_64                              48/61 
  Verifying  : nss-softokn-freebl-3.28.3-8.el7_4.x86_64                   49/61 
  Verifying  : alsa-lib-1.1.3-3.el7.x86_64                                50/61 
  Verifying  : 1:xorg-x11-font-utils-7.5-20.el7.x86_64                    51/61 
  Verifying  : 32:bind-license-9.9.4-29.el7_2.4.noarch                    52/61 
  Verifying  : nss-softokn-3.16.2.3-14.2.el7_2.x86_64                     53/61 
  Verifying  : nss-softokn-freebl-3.16.2.3-14.2.el7_2.x86_64              54/61 
  Verifying  : chkconfig-1.3.61-5.el7_2.1.x86_64                          55/61 
  Verifying  : nspr-4.11.0-1.el7_2.x86_64                                 56/61 
  Verifying  : nss-3.21.0-9.el7_2.x86_64                                  57/61 
  Verifying  : nss-tools-3.21.0-9.el7_2.x86_64                            58/61 
  Verifying  : nss-util-3.21.0-2.2.el7_2.x86_64                           59/61 
  Verifying  : 1:openssl-libs-1.0.1e-51.el7_2.7.x86_64                    60/61 
  Verifying  : nss-sysinit-3.21.0-9.el7_2.x86_64                          61/61 

Installed:
  bind-utils.x86_64 32:9.9.4-51.el7_4.2                                         
  httpd-tools.x86_64 0:2.4.6-67.el7.centos.6                                    
  java-1.8.0-openjdk.x86_64 1:1.8.0.161-0.b14.el7_4                             
  openssl.x86_64 1:1.0.2k-8.el7                                                 

Dependency Installed:
  GeoIP.x86_64 0:1.5.0-11.el7                                                   
  alsa-lib.x86_64 0:1.1.3-3.el7                                                 
  apr.x86_64 0:1.4.8-3.el7_4.1                                                  
  apr-util.x86_64 0:1.5.2-6.el7                                                 
  bind-libs.x86_64 32:9.9.4-51.el7_4.2                                          
  copy-jdk-configs.noarch 0:2.2-5.el7_4                                         
  fontconfig.x86_64 0:2.10.95-11.el7                                            
  fontpackages-filesystem.noarch 0:1.44-8.el7                                   
  freetype.x86_64 0:2.4.11-15.el7                                               
  giflib.x86_64 0:4.1.6-9.el7                                                   
  java-1.8.0-openjdk-headless.x86_64 1:1.8.0.161-0.b14.el7_4                    
  javapackages-tools.noarch 0:3.4.1-11.el7                                      
  libICE.x86_64 0:1.0.9-9.el7                                                   
  libSM.x86_64 0:1.2.2-2.el7                                                    
  libX11.x86_64 0:1.6.5-1.el7                                                   
  libX11-common.noarch 0:1.6.5-1.el7                                            
  libXau.x86_64 0:1.0.8-2.1.el7                                                 
  libXcomposite.x86_64 0:0.4.4-4.1.el7                                          
  libXext.x86_64 0:1.3.3-3.el7                                                  
  libXfont.x86_64 0:1.5.2-1.el7                                                 
  libXi.x86_64 0:1.7.9-1.el7                                                    
  libXrender.x86_64 0:0.9.10-1.el7                                              
  libXtst.x86_64 0:1.2.3-1.el7                                                  
  libfontenc.x86_64 0:1.1.3-3.el7                                               
  libjpeg-turbo.x86_64 0:1.2.90-5.el7                                           
  libpng.x86_64 2:1.5.13-7.el7_2                                                
  libxcb.x86_64 0:1.12-1.el7                                                    
  libxslt.x86_64 0:1.1.28-5.el7                                                 
  lksctp-tools.x86_64 0:1.0.17-2.el7                                            
  lyx-fonts.noarch 0:2.2.3-1.el7                                                
  nss-pem.x86_64 0:1.0.3-4.el7                                                  
  python-javapackages.noarch 0:3.4.1-11.el7                                     
  python-lxml.x86_64 0:3.2.1-4.el7                                              
  ttmkfdir.x86_64 0:3.0.9-42.el7                                                
  tzdata-java.noarch 0:2018d-1.el7                                              
  xorg-x11-font-utils.x86_64 1:7.5-20.el7                                       
  xorg-x11-fonts-Type1.noarch 0:7.5-9.el7                                       

Dependency Updated:
  bind-license.noarch 32:9.9.4-51.el7_4.2                                       
  chkconfig.x86_64 0:1.7.4-1.el7                                                
  nspr.x86_64 0:4.13.1-1.0.el7_3                                                
  nss.x86_64 0:3.28.4-15.el7_4                                                  
  nss-softokn.x86_64 0:3.28.3-8.el7_4                                           
  nss-softokn-freebl.x86_64 0:3.28.3-8.el7_4                                    
  nss-sysinit.x86_64 0:3.28.4-15.el7_4                                          
  nss-tools.x86_64 0:3.28.4-15.el7_4                                            
  nss-util.x86_64 0:3.28.4-3.el7                                                
  openssl-libs.x86_64 1:1.0.2k-8.el7                                            

Complete!
Loaded plugins: fastestmirror, ovl
Cleaning repos: base epel extras updates
Cleaning up everything
Cleaning up list of fastest mirrors
 ---> faa7c2db328b
Removing intermediate container 79e5bca83247
Step 5 : RUN mkdir -p ${HOME} ${PROCESSING_DIR} ${BIN_DIR} && chmod 777 ${HOME} && chmod 555 ${BIN_DIR}
 ---> Running in aa794fe1df49
 ---> ef95e1bc771f
Removing intermediate container aa794fe1df49
Step 6 : COPY . ${BIN_DIR}
 ---> 94f26bc90668
Removing intermediate container 04b0499d3c5e
Step 7 : WORKDIR ${BIN_DIR}
 ---> Running in 105344fd7c46
 ---> 3bc166f4a534
Removing intermediate container 105344fd7c46
Step 8 : ENTRYPOINT ./run.sh
 ---> Running in eca18b314f9e
 ---> 021db626ba7f
Removing intermediate container eca18b314f9e
Step 9 : USER 1000
 ---> Running in e0418fcd1a5d
 ---> d7602b23d63a
Removing intermediate container e0418fcd1a5d
Successfully built d7602b23d63a
--- openshift/origin-metrics-deployer:latest took 134 seconds ---




--- Building component '/data/src/github.com/openshift/origin-metrics/hack/../hack/tests/../../hack/../heapster/' with docker tag 'openshift/origin-metrics-heapster:latest' ---
Sending build context to Docker daemon 7.168 kB

Step 1 : FROM openshift/origin-metrics-heapster-base:v1.3.0-2
Trying to pull repository docker.io/openshift/origin-metrics-heapster-base ... 
v1.3.0-2: Pulling from docker.io/openshift/origin-metrics-heapster-base
93857f76ae30: Already exists
4e61ce2c52dd: Pulling fs layer
dd390b33ea7b: Pulling fs layer
3fc0170be004: Pulling fs layer
f4e99900d503: Pulling fs layer
f4e99900d503: Waiting
dd390b33ea7b: Verifying Checksum
dd390b33ea7b: Download complete
f4e99900d503: Verifying Checksum
f4e99900d503: Download complete
3fc0170be004: Verifying Checksum
3fc0170be004: Download complete
4e61ce2c52dd: Verifying Checksum
4e61ce2c52dd: Download complete
4e61ce2c52dd: Pull complete
4e61ce2c52dd: Pull complete
dd390b33ea7b: Pull complete
dd390b33ea7b: Pull complete
3fc0170be004: Pull complete
3fc0170be004: Pull complete
f4e99900d503: Pull complete
f4e99900d503: Pull complete
Digest: sha256:749fd880577885a94daccc5646410bc7964061ed35574db634e23f3a7e477643
Status: Downloaded newer image for docker.io/openshift/origin-metrics-heapster-base:v1.3.0-2
 ---> 0ebd3407458b
Step 2 : MAINTAINER Hawkular Metrics <hawkular-dev@lists.jboss.org>
 ---> Running in 4ffc26e9c09c
 ---> a4cb86781e34
Removing intermediate container 4ffc26e9c09c
Step 3 : ADD heapster-wrapper.sh heapster-readiness.sh /opt/
 ---> b5f0f9665c7d
Removing intermediate container 2f359a905977
Step 4 : ENTRYPOINT opt/heapster-wrapper.sh
 ---> Running in 4947e0ecd1cf
 ---> 3fdf8b25bbf7
Removing intermediate container 4947e0ecd1cf
Successfully built 3fdf8b25bbf7
--- openshift/origin-metrics-heapster:latest took 62 seconds ---




--- Building component '/data/src/github.com/openshift/origin-metrics/hack/../hack/tests/../../hack/../hawkular-metrics/' with docker tag 'openshift/origin-metrics-hawkular-metrics:latest' ---
Sending build context to Docker daemon 63.49 kB

Step 1 : FROM jboss/wildfly:11.0.0.Final
Trying to pull repository docker.io/jboss/wildfly ... 
11.0.0.Final: Pulling from docker.io/jboss/wildfly
469cfcc7a4b3: Pulling fs layer
05677e4d61f0: Pulling fs layer
a9520f492457: Pulling fs layer
4d201219d6b1: Pulling fs layer
b55e40a220af: Pulling fs layer
4d201219d6b1: Waiting
b55e40a220af: Waiting
a9520f492457: Download complete
05677e4d61f0: Verifying Checksum
05677e4d61f0: Download complete
469cfcc7a4b3: Verifying Checksum
469cfcc7a4b3: Download complete
4d201219d6b1: Verifying Checksum
4d201219d6b1: Download complete
b55e40a220af: Verifying Checksum
b55e40a220af: Download complete
469cfcc7a4b3: Pull complete
469cfcc7a4b3: Pull complete
05677e4d61f0: Pull complete
05677e4d61f0: Pull complete
a9520f492457: Pull complete
a9520f492457: Pull complete
4d201219d6b1: Pull complete
4d201219d6b1: Pull complete
b55e40a220af: Pull complete
b55e40a220af: Pull complete
Digest: sha256:57b2bcdfd63ddfa8cacb15f7ffb20a1c79539fe2b1c0eda2899c9ac4e0d01b6a
Status: Downloaded newer image for docker.io/jboss/wildfly:11.0.0.Final
 ---> 6926d48f2e5b
Step 2 : MAINTAINER Hawkular Metrics <hawkular-dev@lists.jboss.org>
 ---> Running in 75fa3e660ba0
 ---> 434aec6a36d3
Removing intermediate container 75fa3e660ba0
Step 3 : ENV HAWKULAR_METRICS_ENDPOINT_PORT "8080" HAWKULAR_METRICS_VERSION "0.30.5.Final" HAWKULAR_METRICS_DIRECTORY "/opt/hawkular" HAWKULAR_METRICS_SCRIPT_DIRECTORY "/opt/hawkular/scripts/" PATH $PATH:$HAWKULAR_METRICS_SCRIPT_DIRECTORY JAVA_OPTS_APPEND "-XX:+HeapDumpOnOutOfMemoryError -XX:HeapDumpPath=/tmp/heapdump"
 ---> Running in 2687c60d46c5
 ---> 8a7d96fda915
Removing intermediate container 2687c60d46c5
Step 4 : ARG DEV_BUILD="false"
 ---> Running in 1fa737669594
 ---> 78fc1fe3d11b
Removing intermediate container 1fa737669594
Step 5 : EXPOSE 8080 8444
 ---> Running in 565c87661931
 ---> a621402906d6
Removing intermediate container 565c87661931
Step 6 : RUN cd $JBOSS_HOME/bin &&     curl -Lo $JBOSS_HOME/bin/jmx_prometheus_javaagent.jar https://repo1.maven.org/maven2/io/prometheus/jmx/jmx_prometheus_javaagent/0.9/jmx_prometheus_javaagent-0.9.jar
 ---> Running in a3769a8d3890
  % Total    % Received % Xferd  Average Speed   Time    Time     Time  Current
                                 Dload  Upload   Total   Spent    Left  Speed

  0     0    0     0    0     0      0      0 --:--:-- --:--:-- --:--:--     0
100 1223k  100 1223k    0     0  4309k      0 --:--:-- --:--:-- --:--:-- 4323k
 ---> cb103da4cdc1
Removing intermediate container a3769a8d3890
Step 7 : COPY prometheus.yaml $JBOSS_HOME/standalone/configuration/prometheus.yaml
 ---> 377bfe112472
Removing intermediate container 1cc3ab3ac7a8
Step 8 : RUN mkdir /tmp/hawkular
 ---> Running in df1bf70f779b
 ---> e1e7331baf4b
Removing intermediate container df1bf70f779b
Step 9 : COPY dev/* /tmp/hawkular/
 ---> 35429f0800f8
Removing intermediate container 8c0f529ede1f
Step 10 : RUN cd $JBOSS_HOME/standalone/deployments/ &&     if [ ${DEV_BUILD} = "true" ] && [ -s /tmp/hawkular/hawkular-metrics.war ]; then mv /tmp/hawkular/hawkular-metrics.war .; rm -rf /tmp/hawkular; else curl -Lo hawkular-metrics.war https://origin-repository.jboss.org/nexus/service/local/artifact/maven/content?r=public\&g=org.hawkular.metrics\&a=hawkular-metrics-openshift\&e=war\&v=${HAWKULAR_METRICS_VERSION}; fi
 ---> Running in c482368bd89e
  % Total    % Received % Xferd  Average Speed   Time    Time     Time  Current
                                 Dload  Upload   Total   Spent    Left  Speed

  0     0    0     0    0     0      0      0 --:--:-- --:--:-- --:--:--     0
  0     0    0     0    0     0      0      0 --:--:-- --:--:-- --:--:--     0
  0     0    0     0    0     0      0      0 --:--:-- --:--:-- --:--:--     0
curl: (56) TCP connection reset by peer
The command '/bin/sh -c cd $JBOSS_HOME/standalone/deployments/ &&     if [ ${DEV_BUILD} = "true" ] && [ -s /tmp/hawkular/hawkular-metrics.war ]; then mv /tmp/hawkular/hawkular-metrics.war .; rm -rf /tmp/hawkular; else curl -Lo hawkular-metrics.war https://origin-repository.jboss.org/nexus/service/local/artifact/maven/content?r=public\&g=org.hawkular.metrics\&a=hawkular-metrics-openshift\&e=war\&v=${HAWKULAR_METRICS_VERSION}; fi' returned a non-zero code: 56
+ cleanup
+ out=1
+ trap test.cleanup SIGINT SIGTERM EXIT
+ '[' 1 -ne 0 ']'
+ Error 'Test failed'
[ERROR] Test failed
+ echo '[ERROR]' Test failed

+ echo
++ date +%s
+ ENDTIME=1525726472
+ '[' '' = true ']'
+ test.cleanup
+ Info
[INFO]
+ echo '[INFO]'
+ Info 'Deleting test project test-1525726226'
[INFO] Deleting test project test-1525726226
+ echo '[INFO]' Deleting test project test-1525726226
+ oc delete project test-1525726226
Error from server (NotFound): namespaces "test-1525726226" not found
+ exit
[ERROR] PID 1986: /data/src/github.com/openshift/origin/ci_test_every_pr.sh:99: `"${ORIGIN_METRICS_DIR}/hack/e2e-tests.sh" -x --test=DefaultInstall` exited with status 1.
[INFO] 		Stack Trace: 
[INFO] 		  1: /data/src/github.com/openshift/origin/ci_test_every_pr.sh:99: `"${ORIGIN_METRICS_DIR}/hack/e2e-tests.sh" -x --test=DefaultInstall`
[INFO]   Exiting with code 1.
>>>>>>>>>>>> ENV VARIABLES <<<<<<<<<<<<<<<<<<
ADMIN_KUBECONFIG=/tmp/openshift/ci_test_every_pr/openshift.local.config/master/admin.kubeconfig
API_BIND_HOST=172.18.8.28
API_HOST=172.18.8.28
API_PORT=8443
API_SCHEME=https
ARTIFACT_DIR=/tmp/openshift/ci_test_every_pr/artifacts
BASETMPDIR=/tmp/openshift/ci_test_every_pr
_=/bin/env
CLUSTER_ADMIN_CONTEXT=default/172-18-8-28:8443/system:admin
ETCD_DATA_DIR=/tmp/openshift/ci_test_every_pr/etcd
ETCD_HOST=127.0.0.1
ETCD_PEER_PORT=7001
ETCD_PORT=4001
FAKE_HOME_DIR=/tmp/openshift/ci_test_every_pr/openshift.local.home
GIT_BRANCH=master
GIT_URL=https://github.com/openshift/origin-metrics
GOPATH=/data
HISTCONTROL=ignoredups
HISTSIZE=1000
HOME=/home/centos
HOSTNAME=ip-172-18-8-28
KUBE_CACHE_MUTATION_DETECTOR=true
KUBECONFIG=/tmp/openshift/ci_test_every_pr/openshift.local.config/master/admin.kubeconfig
KUBELET_BIND_HOST=172.18.8.28
KUBELET_HOST=172.18.8.28
KUBELET_PORT=10250
KUBELET_SCHEME=https
LANG=en_US.UTF-8
LESSOPEN=||/usr/bin/lesspipe.sh %s
LOG_DIR=/tmp/openshift/ci_test_every_pr/logs
LOGGER_PID=2050
LOGNAME=centos
MAIL=/var/spool/mail/centos
MASTER_ADDR=https://172.18.8.28:8443
MASTER_CONFIG_DIR=/tmp/openshift/ci_test_every_pr/openshift.local.config/master
MAX_IMAGES_BULK_IMPORTED_PER_REPOSITORY=3
NODE_CONFIG_DIR=/tmp/openshift/ci_test_every_pr/openshift.local.config/node-172.18.8.28
NUM_OS_JUNIT_SUITES_IN_FLIGHT=1
NUM_OS_JUNIT_TESTS_IN_FLIGHT=0
OLDPWD=/data/src/github.com/openshift/origin-metrics/hack/tests
OPENSHIFT_ROUTER_IMAGE=openshift/origin-haproxy-router:c106caf
ORIGIN_METRICS_DIR=/data/src/github.com/openshift/origin-metrics
OS_ORIGINAL_WD=/data/src/github.com/openshift/origin
OS_PID=2256
OS_ROOT=/data/src/github.com/openshift/origin
OS_TMP_ENV_SET=ci_test_every_pr
OS_USE_STACKTRACE=true
PATH=/data/src/github.com/openshift/origin/_output/local/bin/linux/amd64:/data/bin:/data/bin:/data/src/github.com/openshift/origin/_output/etcd/bin:/data/src/github.com/openshift/origin/_output/local/bin/linux/amd64:/bin:/usr/local/sbin:/sbin:/bin:/usr/sbin:/usr/bin:/root/bin:/home/centos/.local/bin:/home/centos/bin
PUBLIC_MASTER_HOST=172.18.8.28
PWD=/data/src/github.com/openshift/origin
QTDIR=/usr/lib64/qt-3.3
QT_GRAPHICSSYSTEM_CHECKED=1
QT_GRAPHICSSYSTEM=native
QTINC=/usr/lib64/qt-3.3/include
QTLIB=/usr/lib64/qt-3.3/lib
SAR_LOGFILE=/tmp/openshift/ci_test_every_pr/logs/sar.log
SELINUX_LEVEL_REQUESTED=
SELINUX_ROLE_REQUESTED=
SELINUX_USE_CURRENT_RANGE=
SERVER_CONFIG_DIR=/tmp/openshift/ci_test_every_pr/openshift.local.config
SHELL=/bin/bash
SHLVL=3
SSH_CLIENT=50.17.198.52 43814 22
SSH_CONNECTION=50.17.198.52 43814 172.18.8.28 22
TAG=c106caf
TERM=vt100
TIME_MIN=60000
TIME_MS=1
TIME_SEC=1000
USE_IMAGES=openshift/origin-${component}:c106caf
USE_LOCAL_SOURCE=true
USER=centos
USE_SUDO=true
VERBOSE=1
VOLUME_DIR=/tmp/openshift/ci_test_every_pr/volumes
XDG_RUNTIME_DIR=/run/user/1000
XDG_SESSION_ID=6
>>>>>>>>>>>> END ENV VARIABLES <<<<<<<<<<<<<<

[FAIL] !!!!! Test Failed !!!!

[INFO] Dumping container logs to /tmp/openshift/ci_test_every_pr/logs/containers
[INFO] Dumping etcd contents to /tmp/openshift/ci_test_every_pr/artifacts/etcd_dump.json
[INFO] Tearing down test
[INFO] Stopping k8s docker containers
[INFO] Removing k8s docker containers
[INFO] Pruning etcd data directory...
[INFO] Cleanup complete
[INFO] Exiting at Mon May  7 20:54:39 UTC 2018
./ci_test_every_pr.sh took 278 seconds
Error while running ssh/sudo command: 
set -e
pushd /data/src/github.com/openshift//origin-metrics/hack/tests >/dev/null
export PATH=$GOPATH/bin:$PATH

echo '***************************************************'
echo 'Running GIT_URL=https://github.com/openshift/origin-metrics GIT_BRANCH=master ORIGIN_METRICS_DIR=/data/src/github.com/openshift/origin-metrics OS_ROOT=/data/src/github.com/openshift/origin USE_LOCAL_SOURCE=true VERBOSE=1 ./ci_test_every_pr.sh...'
time GIT_URL=https://github.com/openshift/origin-metrics GIT_BRANCH=master ORIGIN_METRICS_DIR=/data/src/github.com/openshift/origin-metrics OS_ROOT=/data/src/github.com/openshift/origin USE_LOCAL_SOURCE=true VERBOSE=1 ./ci_test_every_pr.sh
echo 'Finished GIT_URL=https://github.com/openshift/origin-metrics GIT_BRANCH=master ORIGIN_METRICS_DIR=/data/src/github.com/openshift/origin-metrics OS_ROOT=/data/src/github.com/openshift/origin USE_LOCAL_SOURCE=true VERBOSE=1 ./ci_test_every_pr.sh'
echo '***************************************************'

popd >/dev/null
        
The SSH command responded with a non-zero exit status. Vagrant
assumes that this means the command failed. The output for this command
should be in the log above. Please read the output to determine what
went wrong.
==> openshiftdev: Downloading logs
==> openshiftdev: Downloading artifacts from '/var/log/yum.log' to '/var/lib/jenkins/jobs/test-origin-metrics/workspace/origin/artifacts/yum.log'
==> openshiftdev: Downloading artifacts from '/var/log/secure' to '/var/lib/jenkins/jobs/test-origin-metrics/workspace/origin/artifacts/secure'
==> openshiftdev: Downloading artifacts from '/var/log/audit/audit.log' to '/var/lib/jenkins/jobs/test-origin-metrics/workspace/origin/artifacts/audit.log'
==> openshiftdev: /tmp/origin-metrics/ did not exist on the remote system.  This is often the case for tests that were not run.
Build step 'Execute shell' marked build as failure
[description-setter] Description set: <a href="https://github.com/openshift/origin-metrics/pull/419">https://github.com/openshift/origin-metrics/pull/419</a>
[PostBuildScript] - Execution post build scripts.
[workspace] $ /bin/sh -xe /tmp/jenkins8514748280291533559.sh
+ INSTANCE_NAME=origin_metrics-centos7-329
+ pushd origin
~/jobs/test-origin-metrics/workspace/origin ~/jobs/test-origin-metrics/workspace
+ '[' -f .vagrant-openshift.json ']'
+ /usr/bin/vagrant destroy -f
==> openshiftdev: Terminating the instance...
==> openshiftdev: Running cleanup tasks for 'shell' provisioner...
+ popd
~/jobs/test-origin-metrics/workspace
[BFA] Scanning build for known causes...
[BFA] Found failure cause(s):
[BFA] Command Failure from category failure
[BFA] Done. 0s
Finished: FAILURE