Console Output

Skipping 427 KB.. Full Log
[openshift/origin-node] Installing:
[openshift/origin-node]  bridge-utils           x86_64 1.5-9.el7             base                  32 k
[openshift/origin-node]  conntrack-tools        x86_64 1.4.4-7.el7           base                 187 k
[openshift/origin-node]  device-mapper-persistent-data
[openshift/origin-node]                         x86_64 0.8.5-3.el7_9.2       updates              423 k
[openshift/origin-node]  e2fsprogs              x86_64 1.42.9-19.el7         base                 701 k
[openshift/origin-node]  ethtool                x86_64 2:4.8-10.el7          base                 127 k
[openshift/origin-node]  iscsi-initiator-utils  x86_64 6.2.0.874-22.el7_9    updates              423 k
[openshift/origin-node]  nmap-ncat              x86_64 2:6.40-19.el7         base                 206 k
[openshift/origin-node]  openssl                x86_64 1:1.0.2k-24.el7_9     updates              494 k
[openshift/origin-node]  origin-hyperkube       x86_64 3.11.0-1.522.9cb9d16  origin-local-release  34 M
[openshift/origin-node]  origin-node            x86_64 3.11.0-1.522.9cb9d16  origin-local-release 6.2 M
[openshift/origin-node]  origin-sdn-ovs         x86_64 3.11.0-1.522.9cb9d16  origin-local-release 4.1 M
[openshift/origin-node]  xfsprogs               x86_64 4.5.0-22.el7          base                 897 k
[openshift/origin-node] Updating:
[openshift/origin-node]  binutils               x86_64 2.27-44.base.el7_9.1  updates              5.9 M
[openshift/origin-node]  device-mapper          x86_64 7:1.02.170-6.el7_9.5  updates              297 k
[openshift/origin-node]  device-mapper-libs     x86_64 7:1.02.170-6.el7_9.5  updates              325 k
[openshift/origin-node] Installing for dependencies:
[openshift/origin-node]  e2fsprogs-libs         x86_64 1.42.9-19.el7         base                 168 k
[openshift/origin-node]  iscsi-initiator-utils-iscsiuio
[openshift/origin-node]                         x86_64 6.2.0.874-22.el7_9    updates               94 k
[openshift/origin-node]  libnetfilter_cthelper  x86_64 1.0.0-11.el7          base                  18 k
[openshift/origin-node]  libnetfilter_cttimeout x86_64 1.0.0-7.el7           base                  18 k
[openshift/origin-node]  libnetfilter_queue     x86_64 1.0.2-2.el7_2         base                  23 k
[openshift/origin-node]  libpcap                x86_64 14:1.5.3-12.el7       base                 139 k
[openshift/origin-node]  libselinux-utils       x86_64 2.5-15.el7            base                 151 k
[openshift/origin-node]  libss                  x86_64 1.42.9-19.el7         base                  47 k
[openshift/origin-node]  make                   x86_64 1:3.82-24.el7         base                 421 k
[openshift/origin-node]  openvswitch            x86_64 2.7.0-1.el7           cbs-paas7-openshift-multiarch-el7-build
[openshift/origin-node]                                                                           2.5 M
[openshift/origin-node]  policycoreutils        x86_64 2.5-34.el7            base                 917 k
[openshift/origin-node]  selinux-policy         noarch 3.13.1-268.el7_9.2    updates              498 k
[openshift/origin-node] Updating for dependencies:
[openshift/origin-node]  openssl-libs           x86_64 1:1.0.2k-24.el7_9     updates              1.2 M
[openshift/origin-node] Transaction Summary
[openshift/origin-node] ================================================================================
[openshift/origin-node] Install  12 Packages (+12 Dependent packages)
[openshift/origin-node] Upgrade   3 Packages (+ 1 Dependent package)
[openshift/origin-node] Total download size: 61 M
[openshift/origin-node] Downloading packages:
[openshift/origin-node] Delta RPMs disabled because /usr/bin/applydeltarpm not installed.
[openshift/origin-node] --------------------------------------------------------------------------------
[openshift/origin-node] Total                                               49 MB/s |  61 MB  00:01     
[openshift/origin-node] Running transaction check
[openshift/origin-node] Running transaction test
[openshift/origin-node] Transaction test succeeded
[openshift/origin-node] Running transaction
[openshift/origin-node]   Updating   : 1:openssl-libs-1.0.2k-24.el7_9.x86_64                       1/32 
[openshift/origin-node]   Installing : iscsi-initiator-utils-6.2.0.874-22.el7_9.x86_64             2/32 
[openshift/origin-node]   Installing : iscsi-initiator-utils-iscsiuio-6.2.0.874-22.el7_9.x86_64    3/32 
[openshift/origin-node]   Updating   : 7:device-mapper-1.02.170-6.el7_9.5.x86_64                   4/32 
[openshift/origin-node]   Updating   : 7:device-mapper-libs-1.02.170-6.el7_9.5.x86_64              5/32 
[openshift/origin-node]   Installing : libss-1.42.9-19.el7.x86_64                                  6/32 
[openshift/origin-node]   Installing : libnetfilter_cthelper-1.0.0-11.el7.x86_64                   7/32 
[openshift/origin-node]   Installing : bridge-utils-1.5-9.el7.x86_64                               8/32 
[openshift/origin-node]   Installing : e2fsprogs-libs-1.42.9-19.el7.x86_64                         9/32 
[openshift/origin-node]   Installing : libnetfilter_cttimeout-1.0.0-7.el7.x86_64                  10/32 
[openshift/origin-node]   Installing : 1:make-3.82-24.el7.x86_64                                  11/32 
[openshift/origin-node]   Installing : 1:openssl-1.0.2k-24.el7_9.x86_64                           12/32 
[openshift/origin-node]   Installing : openvswitch-2.7.0-1.el7.x86_64                             13/32 
[openshift/origin-node]   Installing : libselinux-utils-2.5-15.el7.x86_64                         14/32 
[openshift/origin-node]   Installing : policycoreutils-2.5-34.el7.x86_64                          15/32 
[openshift/origin-node]   Installing : selinux-policy-3.13.1-268.el7_9.2.noarch                   16/32 
[openshift/origin-node]   Installing : origin-hyperkube-3.11.0-1.522.9cb9d16.x86_64               17/32 
[openshift/origin-node]   Installing : origin-node-3.11.0-1.522.9cb9d16.x86_64                    18/32 
[openshift/origin-node]   Installing : libnetfilter_queue-1.0.2-2.el7_2.x86_64                    19/32 
[openshift/origin-node]   Installing : conntrack-tools-1.4.4-7.el7.x86_64                         20/32 
[openshift/origin-node]   Installing : 14:libpcap-1.5.3-12.el7.x86_64                             21/32 
[openshift/origin-node]   Installing : 2:ethtool-4.8-10.el7.x86_64                                22/32 
[openshift/origin-node]   Installing : origin-sdn-ovs-3.11.0-1.522.9cb9d16.x86_64                 23/32 
[openshift/origin-node]   Installing : 2:nmap-ncat-6.40-19.el7.x86_64                             24/32 
[openshift/origin-node]   Installing : e2fsprogs-1.42.9-19.el7.x86_64                             25/32 
[openshift/origin-node]   Updating   : binutils-2.27-44.base.el7_9.1.x86_64                       26/32 
[openshift/origin-node] install-info: No such file or directory for /usr/share/info/as.info.gz
[openshift/origin-node] install-info: No such file or directory for /usr/share/info/binutils.info.gz
[openshift/origin-node] install-info: No such file or directory for /usr/share/info/gprof.info.gz
[openshift/origin-node] install-info: No such file or directory for /usr/share/info/ld.info.gz
[openshift/origin-node] install-info: No such file or directory for /usr/share/info/standards.info.gz
[openshift/origin-node]   Installing : xfsprogs-4.5.0-22.el7.x86_64                               27/32 
[openshift/origin-node]   Installing : device-mapper-persistent-data-0.8.5-3.el7_9.2.x86_64       28/32 
[openshift/origin-node]   Cleanup    : 7:device-mapper-1.02.170-6.el7.x86_64                      29/32 
[openshift/origin-node]   Cleanup    : 7:device-mapper-libs-1.02.170-6.el7.x86_64                 30/32 
[openshift/origin-node]   Cleanup    : binutils-2.27-44.base.el7.x86_64                           31/32 
[openshift/origin-node]   Cleanup    : 1:openssl-libs-1.0.2k-19.el7.x86_64                        32/32 
[openshift/origin-node]   Verifying  : iscsi-initiator-utils-iscsiuio-6.2.0.874-22.el7_9.x86_64    1/32 
[openshift/origin-node]   Verifying  : 2:ethtool-4.8-10.el7.x86_64                                 2/32 
[openshift/origin-node]   Verifying  : 1:openssl-libs-1.0.2k-24.el7_9.x86_64                       3/32 
[openshift/origin-node]   Verifying  : e2fsprogs-1.42.9-19.el7.x86_64                              4/32 
[openshift/origin-node]   Verifying  : 14:libpcap-1.5.3-12.el7.x86_64                              5/32 
[openshift/origin-node]   Verifying  : 7:device-mapper-libs-1.02.170-6.el7_9.5.x86_64              6/32 
[openshift/origin-node]   Verifying  : conntrack-tools-1.4.4-7.el7.x86_64                          7/32 
[openshift/origin-node]   Verifying  : device-mapper-persistent-data-0.8.5-3.el7_9.2.x86_64        8/32 
[openshift/origin-node]   Verifying  : policycoreutils-2.5-34.el7.x86_64                           9/32 
[openshift/origin-node]   Verifying  : libnetfilter_queue-1.0.2-2.el7_2.x86_64                    10/32 
[openshift/origin-node]   Verifying  : iscsi-initiator-utils-6.2.0.874-22.el7_9.x86_64            11/32 
[openshift/origin-node]   Verifying  : origin-hyperkube-3.11.0-1.522.9cb9d16.x86_64               12/32 
[openshift/origin-node]   Verifying  : xfsprogs-4.5.0-22.el7.x86_64                               13/32 
[openshift/origin-node]   Verifying  : libselinux-utils-2.5-15.el7.x86_64                         14/32 
[openshift/origin-node]   Verifying  : 1:make-3.82-24.el7.x86_64                                  15/32 
[openshift/origin-node]   Verifying  : libnetfilter_cttimeout-1.0.0-7.el7.x86_64                  16/32 
[openshift/origin-node]   Verifying  : 1:openssl-1.0.2k-24.el7_9.x86_64                           17/32 
[openshift/origin-node]   Verifying  : binutils-2.27-44.base.el7_9.1.x86_64                       18/32 
[openshift/origin-node]   Verifying  : e2fsprogs-libs-1.42.9-19.el7.x86_64                        19/32 
[openshift/origin-node]   Verifying  : openvswitch-2.7.0-1.el7.x86_64                             20/32 
[openshift/origin-node]   Verifying  : bridge-utils-1.5-9.el7.x86_64                              21/32 
[openshift/origin-node]   Verifying  : selinux-policy-3.13.1-268.el7_9.2.noarch                   22/32 
[openshift/origin-node]   Verifying  : libnetfilter_cthelper-1.0.0-11.el7.x86_64                  23/32 
[openshift/origin-node]   Verifying  : libss-1.42.9-19.el7.x86_64                                 24/32 
[openshift/origin-node]   Verifying  : origin-sdn-ovs-3.11.0-1.522.9cb9d16.x86_64                 25/32 
[openshift/origin-node]   Verifying  : origin-node-3.11.0-1.522.9cb9d16.x86_64                    26/32 
[openshift/origin-node]   Verifying  : 2:nmap-ncat-6.40-19.el7.x86_64                             27/32 
[openshift/origin-node]   Verifying  : 7:device-mapper-1.02.170-6.el7_9.5.x86_64                  28/32 
[openshift/origin-node]   Verifying  : binutils-2.27-44.base.el7.x86_64                           29/32 
[openshift/origin-node]   Verifying  : 7:device-mapper-1.02.170-6.el7.x86_64                      30/32 
[openshift/origin-node]   Verifying  : 7:device-mapper-libs-1.02.170-6.el7.x86_64                 31/32 
[openshift/origin-node]   Verifying  : 1:openssl-libs-1.0.2k-19.el7.x86_64                        32/32 
[openshift/origin-node] Installed:
[openshift/origin-node]   bridge-utils.x86_64 0:1.5-9.el7                                               
[openshift/origin-node]   conntrack-tools.x86_64 0:1.4.4-7.el7                                          
[openshift/origin-node]   device-mapper-persistent-data.x86_64 0:0.8.5-3.el7_9.2                        
[openshift/origin-node]   e2fsprogs.x86_64 0:1.42.9-19.el7                                              
[openshift/origin-node]   ethtool.x86_64 2:4.8-10.el7                                                   
[openshift/origin-node]   iscsi-initiator-utils.x86_64 0:6.2.0.874-22.el7_9                             
[openshift/origin-node]   nmap-ncat.x86_64 2:6.40-19.el7                                                
[openshift/origin-node]   openssl.x86_64 1:1.0.2k-24.el7_9                                              
[openshift/origin-node]   origin-hyperkube.x86_64 0:3.11.0-1.522.9cb9d16                                
[openshift/origin-node]   origin-node.x86_64 0:3.11.0-1.522.9cb9d16                                     
[openshift/origin-node]   origin-sdn-ovs.x86_64 0:3.11.0-1.522.9cb9d16                                  
[openshift/origin-node]   xfsprogs.x86_64 0:4.5.0-22.el7                                                
[openshift/origin-node] Dependency Installed:
[openshift/origin-node]   e2fsprogs-libs.x86_64 0:1.42.9-19.el7                                         
[openshift/origin-node]   iscsi-initiator-utils-iscsiuio.x86_64 0:6.2.0.874-22.el7_9                    
[openshift/origin-node]   libnetfilter_cthelper.x86_64 0:1.0.0-11.el7                                   
[openshift/origin-node]   libnetfilter_cttimeout.x86_64 0:1.0.0-7.el7                                   
[openshift/origin-node]   libnetfilter_queue.x86_64 0:1.0.2-2.el7_2                                     
[openshift/origin-node]   libpcap.x86_64 14:1.5.3-12.el7                                                
[openshift/origin-node]   libselinux-utils.x86_64 0:2.5-15.el7                                          
[openshift/origin-node]   libss.x86_64 0:1.42.9-19.el7                                                  
[openshift/origin-node]   make.x86_64 1:3.82-24.el7                                                     
[openshift/origin-node]   openvswitch.x86_64 0:2.7.0-1.el7                                              
[openshift/origin-node]   policycoreutils.x86_64 0:2.5-34.el7                                           
[openshift/origin-node]   selinux-policy.noarch 0:3.13.1-268.el7_9.2                                    
[openshift/origin-node] Updated:
[openshift/origin-node]   binutils.x86_64 0:2.27-44.base.el7_9.1                                        
[openshift/origin-node]   device-mapper.x86_64 7:1.02.170-6.el7_9.5                                     
[openshift/origin-node]   device-mapper-libs.x86_64 7:1.02.170-6.el7_9.5                                
[openshift/origin-node] Dependency Updated:
[openshift/origin-node]   openssl-libs.x86_64 1:1.0.2k-24.el7_9                                         
[openshift/origin-node] Complete!
[openshift/origin-node] Loaded plugins: fastestmirror, ovl
[openshift/origin-node] Cleaning repos: base cbs-paas7-openshift-multiarch-el7-build
[openshift/origin-node]               : centos-ceph-luminous extras updates
[openshift/origin-node] Cleaning up list of fastest mirrors
[openshift/origin-node] --> LABEL io.k8s.display-name="OpenShift Node"       io.k8s.description="This is a component of OpenShift and contains the software for individual nodes when using SDN."       io.openshift.tags="openshift,node"
[openshift/origin-node] --> ENV OPENSHIFT_CONTAINERIZED=true     KUBECONFIG=/etc/origin/node/node.kubeconfig
[openshift/origin-node] --> ENTRYPOINT [ "/usr/local/bin/origin-node-run.sh" ]
[openshift/origin-node] --> Committing changes to openshift/origin-node:9cb9d16 ...
[openshift/origin-node] --> Tagged as openshift/origin-node:latest
[openshift/origin-node] --> Done
[INFO] hack/build-images.sh exited with code 0 after 00h 05m 14s
+ sed -i 's|go/src|data/src|' _output/local/releases/rpms/origin-local-release.repo
+ sudo cp _output/local/releases/rpms/origin-local-release.repo /etc/yum.repos.d/
+ set +o xtrace
########## FINISHED STAGE: SUCCESS: BUILD AN ORIGIN RELEASE [00h 18m 58s] ##########
[workspace] $ /bin/bash /tmp/jenkins8593402897873801291.sh
########## STARTING STAGE: BUILD AN OPENSHIFT-ANSIBLE RELEASE ##########
+ [[ -s /var/lib/jenkins/jobs/test_branch_origin_extended_conformance_install_in_tree/workspace/activate ]]
+ source /var/lib/jenkins/jobs/test_branch_origin_extended_conformance_install_in_tree/workspace/activate
++ export VIRTUAL_ENV=/var/lib/jenkins/origin-ci-tool/95a472392910104fc805c4ab8af39791105c956d
++ VIRTUAL_ENV=/var/lib/jenkins/origin-ci-tool/95a472392910104fc805c4ab8af39791105c956d
++ export PATH=/var/lib/jenkins/origin-ci-tool/95a472392910104fc805c4ab8af39791105c956d/bin:/sbin:/usr/sbin:/bin:/usr/bin
++ PATH=/var/lib/jenkins/origin-ci-tool/95a472392910104fc805c4ab8af39791105c956d/bin:/sbin:/usr/sbin:/bin:/usr/bin
++ unset PYTHON_HOME
++ export OCT_CONFIG_HOME=/var/lib/jenkins/jobs/test_branch_origin_extended_conformance_install_in_tree/workspace/.config
++ OCT_CONFIG_HOME=/var/lib/jenkins/jobs/test_branch_origin_extended_conformance_install_in_tree/workspace/.config
++ mktemp
+ script=/tmp/tmp.vvjMQoGxE8
+ cat
+ chmod +x /tmp/tmp.vvjMQoGxE8
+ scp -F /var/lib/jenkins/jobs/test_branch_origin_extended_conformance_install_in_tree/workspace/.config/origin-ci-tool/inventory/.ssh_config /tmp/tmp.vvjMQoGxE8 openshiftdevel:/tmp/tmp.vvjMQoGxE8
+ ssh -F /var/lib/jenkins/jobs/test_branch_origin_extended_conformance_install_in_tree/workspace/.config/origin-ci-tool/inventory/.ssh_config -t openshiftdevel 'bash -l -c "timeout 14400 /tmp/tmp.vvjMQoGxE8"'
+ cd /data/src/github.com/openshift/openshift-ansible
+ tito_tmp_dir=tito
+ mkdir -p tito
+ tito tag --offline --accept-auto-changelog
Creating output directory: /tmp/tito
Tagging new version of openshift-ansible: 3.11.613-1 -> 3.11.614-1

Created tag: openshift-ansible-3.11.614-1
   View: git show HEAD
   Undo: tito tag -u
   Push: git push --follow-tags origin
+ tito build --output=tito --rpm --test --offline --quiet
Creating output directory: /data/src/github.com/openshift/openshift-ansible/tito
Building package [openshift-ansible-3.11.614-1]
Wrote: /data/src/github.com/openshift/openshift-ansible/tito/openshift-ansible-git-0.0894c4a.tar.gz

Successfully built: /data/src/github.com/openshift/openshift-ansible/tito/openshift-ansible-3.11.614-1.git.0.0894c4a.el7_9.src.rpm
	- /data/src/github.com/openshift/openshift-ansible/tito/noarch/openshift-ansible-3.11.614-1.git.0.0894c4a.el7_9.noarch.rpm
	- /data/src/github.com/openshift/openshift-ansible/tito/noarch/openshift-ansible-docs-3.11.614-1.git.0.0894c4a.el7_9.noarch.rpm
	- /data/src/github.com/openshift/openshift-ansible/tito/noarch/openshift-ansible-playbooks-3.11.614-1.git.0.0894c4a.el7_9.noarch.rpm
	- /data/src/github.com/openshift/openshift-ansible/tito/noarch/openshift-ansible-roles-3.11.614-1.git.0.0894c4a.el7_9.noarch.rpm
	- /data/src/github.com/openshift/openshift-ansible/tito/noarch/openshift-ansible-test-3.11.614-1.git.0.0894c4a.el7_9.noarch.rpm
+ createrepo tito/noarch
Spawning worker 0 with 2 pkgs
Spawning worker 1 with 1 pkgs
Spawning worker 2 with 1 pkgs
Spawning worker 3 with 1 pkgs
Workers Finished
Saving Primary metadata
Saving file lists metadata
Saving other metadata
Generating sqlite DBs
Sqlite DBs complete
+ cat
++ pwd
+ sudo cp ./openshift-ansible-local-release.repo /etc/yum.repos.d
+ set +o xtrace
########## FINISHED STAGE: SUCCESS: BUILD AN OPENSHIFT-ANSIBLE RELEASE [00h 00m 38s] ##########
[workspace] $ /bin/bash /tmp/jenkins5946797510923632417.sh
########## STARTING STAGE: INSTALL THE OPENSHIFT-ANSIBLE RELEASE ##########
+ [[ -s /var/lib/jenkins/jobs/test_branch_origin_extended_conformance_install_in_tree/workspace/activate ]]
+ source /var/lib/jenkins/jobs/test_branch_origin_extended_conformance_install_in_tree/workspace/activate
++ export VIRTUAL_ENV=/var/lib/jenkins/origin-ci-tool/95a472392910104fc805c4ab8af39791105c956d
++ VIRTUAL_ENV=/var/lib/jenkins/origin-ci-tool/95a472392910104fc805c4ab8af39791105c956d
++ export PATH=/var/lib/jenkins/origin-ci-tool/95a472392910104fc805c4ab8af39791105c956d/bin:/sbin:/usr/sbin:/bin:/usr/bin
++ PATH=/var/lib/jenkins/origin-ci-tool/95a472392910104fc805c4ab8af39791105c956d/bin:/sbin:/usr/sbin:/bin:/usr/bin
++ unset PYTHON_HOME
++ export OCT_CONFIG_HOME=/var/lib/jenkins/jobs/test_branch_origin_extended_conformance_install_in_tree/workspace/.config
++ OCT_CONFIG_HOME=/var/lib/jenkins/jobs/test_branch_origin_extended_conformance_install_in_tree/workspace/.config
++ mktemp
+ script=/tmp/tmp.2giN2QoZ5b
+ cat
+ chmod +x /tmp/tmp.2giN2QoZ5b
+ scp -F /var/lib/jenkins/jobs/test_branch_origin_extended_conformance_install_in_tree/workspace/.config/origin-ci-tool/inventory/.ssh_config /tmp/tmp.2giN2QoZ5b openshiftdevel:/tmp/tmp.2giN2QoZ5b
+ ssh -F /var/lib/jenkins/jobs/test_branch_origin_extended_conformance_install_in_tree/workspace/.config/origin-ci-tool/inventory/.ssh_config -t openshiftdevel 'bash -l -c "timeout 3600 /tmp/tmp.2giN2QoZ5b"'
+ cd /data/src/github.com/openshift/openshift-ansible
++ git describe --tags --abbrev=0 --exact-match HEAD
+ last_tag=openshift-ansible-3.11.614-1
++ git log -n 1 --pretty=%h
+ last_commit=0894c4a
+ [[ release-3.11 == \r\e\l\e\a\s\e\-\3\.\7 ]]
+ [[ release-3.11 == \r\e\l\e\a\s\e\-\3\.\6 ]]
+ [[ release-3.11 == \r\e\l\e\a\s\e\-\3\.\5 ]]
+ sudo yum install -y openshift-ansible-3.11.614-1.git.0.0894c4a.el7_9
Loaded plugins: amazon-id, search-disabled-repos
https://mirror.openshift.com/enterprise/rhel/aos-cd/tools/charlie/repodata/repomd.xml: [Errno 14] HTTPS Error 401 - Unauthorized
Trying other mirror.
https://mirror.openshift.com/enterprise/rhel/rhel-7-server-ansible-2.4-rpms/repodata/repomd.xml: [Errno 14] HTTPS Error 401 - Unauthorized
Trying other mirror.
https://use-mirror2.ops.rhcloud.com/libra/rhui-rhel-server-7-extras/repodata/7ffa72650ca317fc263548693661d26485fbe2be7d541d0074e6720009912af8-updateinfo.xml.gz: [Errno 14] HTTPS Error 404 - Not Found
Trying other mirror.
To address this issue please refer to the below knowledge base article 

https://access.redhat.com/articles/1320623

If above article doesn't help to resolve this issue please open a ticket with Red Hat Support.

https://mirror.ops.rhcloud.com/libra/rhui-rhel-server-7-extras/repodata/89d558a4bc351f7c2954fbf5e7e8927dd87f25887a31738c5836ebcac9e21d30-primary.sqlite.bz2: [Errno 14] HTTPS Error 404 - Not Found
Trying other mirror.
https://mirror.ops.rhcloud.com/libra/rhui-rhel-server-7-releases-optional/repodata/4df63e1a3d63bec32a79c73d47e73b63391a644b29e18cf40522afdab7019e51-updateinfo.xml.gz: [Errno 14] HTTPS Error 404 - Not Found
Trying other mirror.
https://mirror.ops.rhcloud.com/libra/rhui-rhel-server-7-releases/repodata/bf0e4591c3bc3122db7a7663fd683777c51e839f40464c5598a231d53df45fc2-updateinfo.xml.gz: [Errno 14] HTTPS Error 404 - Not Found
Trying other mirror.
https://use-mirror2.ops.rhcloud.com/libra/rhui-rhel-server-7-rhscl/repodata/e7872d4190363eb14cf1f290d848e49de7194f954527fdaf3235d7db73d8d213-updateinfo.xml.gz: [Errno 14] HTTPS Error 404 - Not Found
Trying other mirror.
https://mirror.ops.rhcloud.com/libra/rhui-rhel-server-7-extras/repodata/7ffa72650ca317fc263548693661d26485fbe2be7d541d0074e6720009912af8-updateinfo.xml.gz: [Errno 14] HTTPS Error 404 - Not Found
Trying other mirror.
https://use-mirror2.ops.rhcloud.com/libra/rhui-rhel-server-7-releases-optional/repodata/4df63e1a3d63bec32a79c73d47e73b63391a644b29e18cf40522afdab7019e51-updateinfo.xml.gz: [Errno 14] HTTPS Error 404 - Not Found
Trying other mirror.
https://mirror.ops.rhcloud.com/libra/rhui-rhel-server-7-rhscl/repodata/e7872d4190363eb14cf1f290d848e49de7194f954527fdaf3235d7db73d8d213-updateinfo.xml.gz: [Errno 14] HTTPS Error 404 - Not Found
Trying other mirror.
https://use-mirror2.ops.rhcloud.com/libra/rhui-rhel-server-7-releases/repodata/bf0e4591c3bc3122db7a7663fd683777c51e839f40464c5598a231d53df45fc2-updateinfo.xml.gz: [Errno 14] HTTPS Error 404 - Not Found
Trying other mirror.
https://use-mirror1.ops.rhcloud.com/libra/rhui-rhel-server-7-extras/repodata/7ffa72650ca317fc263548693661d26485fbe2be7d541d0074e6720009912af8-updateinfo.xml.gz: [Errno 14] HTTPS Error 404 - Not Found
Trying other mirror.
https://use-mirror1.ops.rhcloud.com/libra/rhui-rhel-server-7-releases-optional/repodata/4df63e1a3d63bec32a79c73d47e73b63391a644b29e18cf40522afdab7019e51-updateinfo.xml.gz: [Errno 14] HTTPS Error 404 - Not Found
Trying other mirror.
https://use-mirror1.ops.rhcloud.com/libra/rhui-rhel-server-7-releases/repodata/bf0e4591c3bc3122db7a7663fd683777c51e839f40464c5598a231d53df45fc2-updateinfo.xml.gz: [Errno 14] HTTPS Error 404 - Not Found
Trying other mirror.
https://use-mirror1.ops.rhcloud.com/libra/rhui-rhel-server-7-rhscl/repodata/e7872d4190363eb14cf1f290d848e49de7194f954527fdaf3235d7db73d8d213-updateinfo.xml.gz: [Errno 14] HTTPS Error 404 - Not Found
Trying other mirror.
https://euw-mirror1.ops.rhcloud.com/libra/rhui-rhel-server-7-extras/repodata/7ffa72650ca317fc263548693661d26485fbe2be7d541d0074e6720009912af8-updateinfo.xml.gz: [Errno 12] Timeout on https://euw-mirror1.ops.rhcloud.com/libra/rhui-rhel-server-7-extras/repodata/7ffa72650ca317fc263548693661d26485fbe2be7d541d0074e6720009912af8-updateinfo.xml.gz: (28, 'Connection timed out after 120001 milliseconds')
Trying other mirror.
https://euw-mirror1.ops.rhcloud.com/libra/rhui-rhel-server-7-releases-optional/repodata/4df63e1a3d63bec32a79c73d47e73b63391a644b29e18cf40522afdab7019e51-updateinfo.xml.gz: [Errno 12] Timeout on https://euw-mirror1.ops.rhcloud.com/libra/rhui-rhel-server-7-releases-optional/repodata/4df63e1a3d63bec32a79c73d47e73b63391a644b29e18cf40522afdab7019e51-updateinfo.xml.gz: (28, 'Connection timed out after 120001 milliseconds')
Trying other mirror.
https://euw-mirror1.ops.rhcloud.com/libra/rhui-rhel-server-7-releases/repodata/bf0e4591c3bc3122db7a7663fd683777c51e839f40464c5598a231d53df45fc2-updateinfo.xml.gz: [Errno 12] Timeout on https://euw-mirror1.ops.rhcloud.com/libra/rhui-rhel-server-7-releases/repodata/bf0e4591c3bc3122db7a7663fd683777c51e839f40464c5598a231d53df45fc2-updateinfo.xml.gz: (28, 'Connection timed out after 120001 milliseconds')
Trying other mirror.
https://euw-mirror1.ops.rhcloud.com/libra/rhui-rhel-server-7-rhscl/repodata/e7872d4190363eb14cf1f290d848e49de7194f954527fdaf3235d7db73d8d213-updateinfo.xml.gz: [Errno 12] Timeout on https://euw-mirror1.ops.rhcloud.com/libra/rhui-rhel-server-7-rhscl/repodata/e7872d4190363eb14cf1f290d848e49de7194f954527fdaf3235d7db73d8d213-updateinfo.xml.gz: (28, 'Connection timed out after 120001 milliseconds')
Trying other mirror.
https://gce-mirror1.ops.rhcloud.com/libra/rhui-rhel-server-7-extras/repodata/7ffa72650ca317fc263548693661d26485fbe2be7d541d0074e6720009912af8-updateinfo.xml.gz: [Errno 12] Timeout on https://gce-mirror1.ops.rhcloud.com/libra/rhui-rhel-server-7-extras/repodata/7ffa72650ca317fc263548693661d26485fbe2be7d541d0074e6720009912af8-updateinfo.xml.gz: (28, 'Connection timed out after 120001 milliseconds')
Trying other mirror.
https://euw-mirror1.ops.rhcloud.com/libra/rhui-rhel-server-7-releases-optional/repodata/4df63e1a3d63bec32a79c73d47e73b63391a644b29e18cf40522afdab7019e51-updateinfo.xml.gz: [Errno 12] Timeout on https://euw-mirror1.ops.rhcloud.com/libra/rhui-rhel-server-7-releases-optional/repodata/4df63e1a3d63bec32a79c73d47e73b63391a644b29e18cf40522afdab7019e51-updateinfo.xml.gz: (28, 'Connection timed out after 120001 milliseconds')
Trying other mirror.
https://euw-mirror1.ops.rhcloud.com/libra/rhui-rhel-server-7-releases/repodata/bf0e4591c3bc3122db7a7663fd683777c51e839f40464c5598a231d53df45fc2-updateinfo.xml.gz: [Errno 12] Timeout on https://euw-mirror1.ops.rhcloud.com/libra/rhui-rhel-server-7-releases/repodata/bf0e4591c3bc3122db7a7663fd683777c51e839f40464c5598a231d53df45fc2-updateinfo.xml.gz: (28, 'Connection timed out after 120001 milliseconds')
Trying other mirror.
https://euw-mirror1.ops.rhcloud.com/libra/rhui-rhel-server-7-rhscl/repodata/e7872d4190363eb14cf1f290d848e49de7194f954527fdaf3235d7db73d8d213-updateinfo.xml.gz: [Errno 12] Timeout on https://euw-mirror1.ops.rhcloud.com/libra/rhui-rhel-server-7-rhscl/repodata/e7872d4190363eb14cf1f290d848e49de7194f954527fdaf3235d7db73d8d213-updateinfo.xml.gz: (28, 'Connection timed out after 120001 milliseconds')
Trying other mirror.
https://euw-mirror1.ops.rhcloud.com/libra/rhui-rhel-server-7-releases-optional/repodata/4df63e1a3d63bec32a79c73d47e73b63391a644b29e18cf40522afdab7019e51-updateinfo.xml.gz: [Errno 12] Timeout on https://euw-mirror1.ops.rhcloud.com/libra/rhui-rhel-server-7-releases-optional/repodata/4df63e1a3d63bec32a79c73d47e73b63391a644b29e18cf40522afdab7019e51-updateinfo.xml.gz: (28, 'Connection timed out after 120001 milliseconds')
Trying other mirror.
https://gce-mirror2.ops.rhcloud.com/libra/rhui-rhel-server-7-extras/repodata/7ffa72650ca317fc263548693661d26485fbe2be7d541d0074e6720009912af8-updateinfo.xml.gz: [Errno 12] Timeout on https://gce-mirror2.ops.rhcloud.com/libra/rhui-rhel-server-7-extras/repodata/7ffa72650ca317fc263548693661d26485fbe2be7d541d0074e6720009912af8-updateinfo.xml.gz: (28, 'Connection timed out after 120001 milliseconds')
Trying other mirror.
https://euw-mirror1.ops.rhcloud.com/libra/rhui-rhel-server-7-releases/repodata/bf0e4591c3bc3122db7a7663fd683777c51e839f40464c5598a231d53df45fc2-updateinfo.xml.gz: [Errno 12] Timeout on https://euw-mirror1.ops.rhcloud.com/libra/rhui-rhel-server-7-releases/repodata/bf0e4591c3bc3122db7a7663fd683777c51e839f40464c5598a231d53df45fc2-updateinfo.xml.gz: (28, 'Connection timed out after 120001 milliseconds')
Trying other mirror.
https://euw-mirror1.ops.rhcloud.com/libra/rhui-rhel-server-7-rhscl/repodata/e7872d4190363eb14cf1f290d848e49de7194f954527fdaf3235d7db73d8d213-updateinfo.xml.gz: [Errno 12] Timeout on https://euw-mirror1.ops.rhcloud.com/libra/rhui-rhel-server-7-rhscl/repodata/e7872d4190363eb14cf1f290d848e49de7194f954527fdaf3235d7db73d8d213-updateinfo.xml.gz: (28, 'Connection timed out after 120001 milliseconds')
Trying other mirror.
https://euw-mirror1.ops.rhcloud.com/libra/rhui-rhel-server-7-releases-optional/repodata/4df63e1a3d63bec32a79c73d47e73b63391a644b29e18cf40522afdab7019e51-updateinfo.xml.gz: [Errno 12] Timeout on https://euw-mirror1.ops.rhcloud.com/libra/rhui-rhel-server-7-releases-optional/repodata/4df63e1a3d63bec32a79c73d47e73b63391a644b29e18cf40522afdab7019e51-updateinfo.xml.gz: (28, 'Connection timed out after 120001 milliseconds')
Trying other mirror.
https://euw-mirror1.ops.rhcloud.com/libra/rhui-rhel-server-7-extras/repodata/7ffa72650ca317fc263548693661d26485fbe2be7d541d0074e6720009912af8-updateinfo.xml.gz: [Errno 12] Timeout on https://euw-mirror1.ops.rhcloud.com/libra/rhui-rhel-server-7-extras/repodata/7ffa72650ca317fc263548693661d26485fbe2be7d541d0074e6720009912af8-updateinfo.xml.gz: (28, 'Connection timed out after 120001 milliseconds')
Trying other mirror.
https://euw-mirror1.ops.rhcloud.com/libra/rhui-rhel-server-7-releases/repodata/bf0e4591c3bc3122db7a7663fd683777c51e839f40464c5598a231d53df45fc2-updateinfo.xml.gz: [Errno 12] Timeout on https://euw-mirror1.ops.rhcloud.com/libra/rhui-rhel-server-7-releases/repodata/bf0e4591c3bc3122db7a7663fd683777c51e839f40464c5598a231d53df45fc2-updateinfo.xml.gz: (28, 'Connection timed out after 120001 milliseconds')
Trying other mirror.
https://euw-mirror1.ops.rhcloud.com/libra/rhui-rhel-server-7-rhscl/repodata/e7872d4190363eb14cf1f290d848e49de7194f954527fdaf3235d7db73d8d213-updateinfo.xml.gz: [Errno 12] Timeout on https://euw-mirror1.ops.rhcloud.com/libra/rhui-rhel-server-7-rhscl/repodata/e7872d4190363eb14cf1f290d848e49de7194f954527fdaf3235d7db73d8d213-updateinfo.xml.gz: (28, 'Connection timed out after 120001 milliseconds')
Trying other mirror.
Resolving Dependencies
--> Running transaction check
---> Package openshift-ansible.noarch 0:3.11.614-1.git.0.0894c4a.el7_9 will be installed
--> Processing Dependency: openshift-ansible-roles = 3.11.614-1.git.0.0894c4a.el7_9 for package: openshift-ansible-3.11.614-1.git.0.0894c4a.el7_9.noarch
--> Processing Dependency: openshift-ansible-playbooks = 3.11.614-1.git.0.0894c4a.el7_9 for package: openshift-ansible-3.11.614-1.git.0.0894c4a.el7_9.noarch
--> Processing Dependency: openshift-ansible-docs = 3.11.614-1.git.0.0894c4a.el7_9 for package: openshift-ansible-3.11.614-1.git.0.0894c4a.el7_9.noarch
--> Processing Dependency: python2-crypto for package: openshift-ansible-3.11.614-1.git.0.0894c4a.el7_9.noarch
--> Processing Dependency: httpd-tools for package: openshift-ansible-3.11.614-1.git.0.0894c4a.el7_9.noarch
--> Running transaction check
---> Package httpd-tools.x86_64 0:2.4.6-97.el7_9.4 will be installed
--> Processing Dependency: libaprutil-1.so.0()(64bit) for package: httpd-tools-2.4.6-97.el7_9.4.x86_64
--> Processing Dependency: libapr-1.so.0()(64bit) for package: httpd-tools-2.4.6-97.el7_9.4.x86_64
---> Package openshift-ansible-docs.noarch 0:3.11.614-1.git.0.0894c4a.el7_9 will be installed
---> Package openshift-ansible-playbooks.noarch 0:3.11.614-1.git.0.0894c4a.el7_9 will be installed
---> Package openshift-ansible-roles.noarch 0:3.11.614-1.git.0.0894c4a.el7_9 will be installed
---> Package python2-crypto.x86_64 0:2.6.1-15.el7 will be installed
--> Processing Dependency: libtomcrypt.so.0()(64bit) for package: python2-crypto-2.6.1-15.el7.x86_64
--> Running transaction check
---> Package apr.x86_64 0:1.4.8-7.el7 will be installed
---> Package apr-util.x86_64 0:1.5.2-6.el7 will be installed
---> Package libtomcrypt.x86_64 0:1.17-26.el7 will be installed
--> Processing Dependency: libtommath >= 0.42.0 for package: libtomcrypt-1.17-26.el7.x86_64
--> Processing Dependency: libtommath.so.0()(64bit) for package: libtomcrypt-1.17-26.el7.x86_64
--> Running transaction check
---> Package libtommath.x86_64 0:0.42.0-6.el7 will be installed
--> Finished Dependency Resolution

Dependencies Resolved

================================================================================
 Package         Arch   Version           Repository                       Size
================================================================================
Installing:
 openshift-ansible
                 noarch 3.11.614-1.git.0.0894c4a.el7_9
                                          openshift-ansible-local-release 606 k
Installing for dependencies:
 apr             x86_64 1.4.8-7.el7       rhel-7-server-rhui-rpms         104 k
 apr-util        x86_64 1.5.2-6.el7       oso-rhui-rhel-server-releases    92 k
 httpd-tools     x86_64 2.4.6-97.el7_9.4  rhel-7-server-rhui-rpms          94 k
 libtomcrypt     x86_64 1.17-26.el7       oso-rhui-rhel-server-extras     224 k
 libtommath      x86_64 0.42.0-6.el7      oso-rhui-rhel-server-extras      36 k
 openshift-ansible-docs
                 noarch 3.11.614-1.git.0.0894c4a.el7_9
                                          openshift-ansible-local-release 618 k
 openshift-ansible-playbooks
                 noarch 3.11.614-1.git.0.0894c4a.el7_9
                                          openshift-ansible-local-release 765 k
 openshift-ansible-roles
                 noarch 3.11.614-1.git.0.0894c4a.el7_9
                                          openshift-ansible-local-release 2.3 M
 python2-crypto  x86_64 2.6.1-15.el7      oso-rhui-rhel-server-extras     477 k

Transaction Summary
================================================================================
Install  1 Package (+9 Dependent packages)

Total download size: 5.2 M
Installed size: 25 M
Downloading packages:
--------------------------------------------------------------------------------
Total                                              7.3 MB/s | 5.2 MB  00:00     
Running transaction check
Running transaction test
Transaction test succeeded
Running transaction
  Installing : apr-1.4.8-7.el7.x86_64                                      1/10 
  Installing : apr-util-1.5.2-6.el7.x86_64                                 2/10 
  Installing : httpd-tools-2.4.6-97.el7_9.4.x86_64                         3/10 
  Installing : libtommath-0.42.0-6.el7.x86_64                              4/10 
  Installing : libtomcrypt-1.17-26.el7.x86_64                              5/10 
  Installing : python2-crypto-2.6.1-15.el7.x86_64                          6/10 
  Installing : openshift-ansible-docs-3.11.614-1.git.0.0894c4a.el7_9.no    7/10 
  Installing : openshift-ansible-playbooks-3.11.614-1.git.0.0894c4a.el7    8/10 
  Installing : openshift-ansible-roles-3.11.614-1.git.0.0894c4a.el7_9.n    9/10 
  Installing : openshift-ansible-3.11.614-1.git.0.0894c4a.el7_9.noarch    10/10 
  Verifying  : python2-crypto-2.6.1-15.el7.x86_64                          1/10 
  Verifying  : apr-1.4.8-7.el7.x86_64                                      2/10 
  Verifying  : httpd-tools-2.4.6-97.el7_9.4.x86_64                         3/10 
  Verifying  : openshift-ansible-3.11.614-1.git.0.0894c4a.el7_9.noarch     4/10 
  Verifying  : openshift-ansible-docs-3.11.614-1.git.0.0894c4a.el7_9.no    5/10 
  Verifying  : libtommath-0.42.0-6.el7.x86_64                              6/10 
  Verifying  : openshift-ansible-playbooks-3.11.614-1.git.0.0894c4a.el7    7/10 
  Verifying  : openshift-ansible-roles-3.11.614-1.git.0.0894c4a.el7_9.n    8/10 
  Verifying  : libtomcrypt-1.17-26.el7.x86_64                              9/10 
  Verifying  : apr-util-1.5.2-6.el7.x86_64                                10/10 

Installed:
  openshift-ansible.noarch 0:3.11.614-1.git.0.0894c4a.el7_9                     

Dependency Installed:
  apr.x86_64 0:1.4.8-7.el7                                                      
  apr-util.x86_64 0:1.5.2-6.el7                                                 
  httpd-tools.x86_64 0:2.4.6-97.el7_9.4                                         
  libtomcrypt.x86_64 0:1.17-26.el7                                              
  libtommath.x86_64 0:0.42.0-6.el7                                              
  openshift-ansible-docs.noarch 0:3.11.614-1.git.0.0894c4a.el7_9                
  openshift-ansible-playbooks.noarch 0:3.11.614-1.git.0.0894c4a.el7_9           
  openshift-ansible-roles.noarch 0:3.11.614-1.git.0.0894c4a.el7_9               
  python2-crypto.x86_64 0:2.6.1-15.el7                                          

Complete!
+ rpm -q openshift-ansible-3.11.614-1.git.0.0894c4a.el7_9
openshift-ansible-3.11.614-1.git.0.0894c4a.el7_9.noarch
+ set +o xtrace
########## FINISHED STAGE: SUCCESS: INSTALL THE OPENSHIFT-ANSIBLE RELEASE [00h 10m 29s] ##########
[workspace] $ /bin/bash /tmp/jenkins4188752139364302549.sh
########## STARTING STAGE: INSTALL ANSIBLE PLUGINS ##########
+ [[ -s /var/lib/jenkins/jobs/test_branch_origin_extended_conformance_install_in_tree/workspace/activate ]]
+ source /var/lib/jenkins/jobs/test_branch_origin_extended_conformance_install_in_tree/workspace/activate
++ export VIRTUAL_ENV=/var/lib/jenkins/origin-ci-tool/95a472392910104fc805c4ab8af39791105c956d
++ VIRTUAL_ENV=/var/lib/jenkins/origin-ci-tool/95a472392910104fc805c4ab8af39791105c956d
++ export PATH=/var/lib/jenkins/origin-ci-tool/95a472392910104fc805c4ab8af39791105c956d/bin:/sbin:/usr/sbin:/bin:/usr/bin
++ PATH=/var/lib/jenkins/origin-ci-tool/95a472392910104fc805c4ab8af39791105c956d/bin:/sbin:/usr/sbin:/bin:/usr/bin
++ unset PYTHON_HOME
++ export OCT_CONFIG_HOME=/var/lib/jenkins/jobs/test_branch_origin_extended_conformance_install_in_tree/workspace/.config
++ OCT_CONFIG_HOME=/var/lib/jenkins/jobs/test_branch_origin_extended_conformance_install_in_tree/workspace/.config
++ mktemp
+ script=/tmp/tmp.o7oXVOQgfY
+ cat
+ chmod +x /tmp/tmp.o7oXVOQgfY
+ scp -F /var/lib/jenkins/jobs/test_branch_origin_extended_conformance_install_in_tree/workspace/.config/origin-ci-tool/inventory/.ssh_config /tmp/tmp.o7oXVOQgfY openshiftdevel:/tmp/tmp.o7oXVOQgfY
+ ssh -F /var/lib/jenkins/jobs/test_branch_origin_extended_conformance_install_in_tree/workspace/.config/origin-ci-tool/inventory/.ssh_config -t openshiftdevel 'bash -l -c "timeout 14400 /tmp/tmp.o7oXVOQgfY"'
+ cd /data/src/github.com/openshift/origin
+ sudo chmod o+rw /etc/environment
++ pwd
+ echo ANSIBLE_JUNIT_DIR=/data/src/github.com/openshift/origin/_output/scripts/ansible_junit
+ sudo mkdir -p /usr/share/ansible/plugins/callback
+ for plugin in ''\''default_with_output_lists'\''' ''\''generate_junit'\'''
+ wget https://raw.githubusercontent.com/openshift/origin-ci-tool/master/oct/ansible/oct/callback_plugins/default_with_output_lists.py
--2022-01-22 20:02:03--  https://raw.githubusercontent.com/openshift/origin-ci-tool/master/oct/ansible/oct/callback_plugins/default_with_output_lists.py
Resolving raw.githubusercontent.com (raw.githubusercontent.com)... 185.199.109.133, 185.199.110.133, 185.199.111.133, ...
Connecting to raw.githubusercontent.com (raw.githubusercontent.com)|185.199.109.133|:443... connected.
HTTP request sent, awaiting response... 200 OK
Length: 1932 (1.9K) [text/plain]
Saving to: ‘default_with_output_lists.py’

     0K .                                                     100% 19.7M=0s

2022-01-22 20:02:03 (19.7 MB/s) - ‘default_with_output_lists.py’ saved [1932/1932]

+ sudo mv default_with_output_lists.py /usr/share/ansible/plugins/callback
+ for plugin in ''\''default_with_output_lists'\''' ''\''generate_junit'\'''
+ wget https://raw.githubusercontent.com/openshift/origin-ci-tool/master/oct/ansible/oct/callback_plugins/generate_junit.py
--2022-01-22 20:02:03--  https://raw.githubusercontent.com/openshift/origin-ci-tool/master/oct/ansible/oct/callback_plugins/generate_junit.py
Resolving raw.githubusercontent.com (raw.githubusercontent.com)... 185.199.108.133, 185.199.109.133, 185.199.110.133, ...
Connecting to raw.githubusercontent.com (raw.githubusercontent.com)|185.199.108.133|:443... connected.
HTTP request sent, awaiting response... 200 OK
Length: 11212 (11K) [text/plain]
Saving to: ‘generate_junit.py’

     0K ..........                                            100% 36.6M=0s

2022-01-22 20:02:03 (36.6 MB/s) - ‘generate_junit.py’ saved [11212/11212]

+ sudo mv generate_junit.py /usr/share/ansible/plugins/callback
+ sudo sed -r -i -e 's/^#?stdout_callback.*/stdout_callback = default_with_output_lists/' -e 's/^#?callback_whitelist.*/callback_whitelist = generate_junit/' /etc/ansible/ansible.cfg
+ set +o xtrace
########## FINISHED STAGE: SUCCESS: INSTALL ANSIBLE PLUGINS [00h 00m 02s] ##########
[workspace] $ /bin/bash /tmp/jenkins8849603673688917646.sh
########## STARTING STAGE: DETERMINE THE RELEASE COMMIT FOR ORIGIN IMAGES AND VERSION FOR RPMS ##########
+ [[ -s /var/lib/jenkins/jobs/test_branch_origin_extended_conformance_install_in_tree/workspace/activate ]]
+ source /var/lib/jenkins/jobs/test_branch_origin_extended_conformance_install_in_tree/workspace/activate
++ export VIRTUAL_ENV=/var/lib/jenkins/origin-ci-tool/95a472392910104fc805c4ab8af39791105c956d
++ VIRTUAL_ENV=/var/lib/jenkins/origin-ci-tool/95a472392910104fc805c4ab8af39791105c956d
++ export PATH=/var/lib/jenkins/origin-ci-tool/95a472392910104fc805c4ab8af39791105c956d/bin:/sbin:/usr/sbin:/bin:/usr/bin
++ PATH=/var/lib/jenkins/origin-ci-tool/95a472392910104fc805c4ab8af39791105c956d/bin:/sbin:/usr/sbin:/bin:/usr/bin
++ unset PYTHON_HOME
++ export OCT_CONFIG_HOME=/var/lib/jenkins/jobs/test_branch_origin_extended_conformance_install_in_tree/workspace/.config
++ OCT_CONFIG_HOME=/var/lib/jenkins/jobs/test_branch_origin_extended_conformance_install_in_tree/workspace/.config
++ mktemp
+ script=/tmp/tmp.ddNEk4yHui
+ cat
+ chmod +x /tmp/tmp.ddNEk4yHui
+ scp -F /var/lib/jenkins/jobs/test_branch_origin_extended_conformance_install_in_tree/workspace/.config/origin-ci-tool/inventory/.ssh_config /tmp/tmp.ddNEk4yHui openshiftdevel:/tmp/tmp.ddNEk4yHui
+ ssh -F /var/lib/jenkins/jobs/test_branch_origin_extended_conformance_install_in_tree/workspace/.config/origin-ci-tool/inventory/.ssh_config -t openshiftdevel 'bash -l -c "timeout 14400 /tmp/tmp.ddNEk4yHui"'
+ cd /data/src/github.com/openshift/origin
+ jobs_repo=/data/src/github.com/openshift/aos-cd-jobs/
+ git log -1 --pretty=%h
+ source hack/lib/init.sh
++ set -o errexit
++ set -o nounset
++ set -o pipefail
+++ date +%s
++ OS_SCRIPT_START_TIME=1642881724
++ export OS_SCRIPT_START_TIME
++ readonly -f os::util::absolute_path
+++ dirname hack/lib/init.sh
++ init_source=hack/lib/../..
+++ os::util::absolute_path hack/lib/../..
+++ local relative_path=hack/lib/../..
+++ local absolute_path
+++ pushd hack/lib/../..
++++ pwd
+++ relative_path=/data/src/github.com/openshift/origin
+++ [[ -h /data/src/github.com/openshift/origin ]]
+++ absolute_path=/data/src/github.com/openshift/origin
+++ popd
+++ echo /data/src/github.com/openshift/origin
++ OS_ROOT=/data/src/github.com/openshift/origin
++ export OS_ROOT
++ cd /data/src/github.com/openshift/origin
+++ find /data/src/github.com/openshift/origin/hack/lib -type f -name '*.sh' -not -path '*/hack/lib/init.sh'
++ for library_file in '$( find "${OS_ROOT}/hack/lib" -type f -name '\''*.sh'\'' -not -path '\''*/hack/lib/init.sh'\'' )'
++ source /data/src/github.com/openshift/origin/hack/lib/build/archive.sh
+++ readonly -f os::build::archive::name
+++ readonly -f os::build::archive::zip
+++ readonly -f os::build::archive::tar
+++ readonly -f os::build::archive::internal::is_hardlink_supported
+++ readonly -f os::build::archive::extract_tar
+++ readonly -f os::build::archive::detect_local_release_tars
++ for library_file in '$( find "${OS_ROOT}/hack/lib" -type f -name '\''*.sh'\'' -not -path '\''*/hack/lib/init.sh'\'' )'
++ source /data/src/github.com/openshift/origin/hack/lib/build/binaries.sh
+++ readonly -f os::build::binaries_from_targets
+++ readonly -f os::build::host_platform
+++ readonly -f os::build::host_platform_friendly
+++ readonly -f os::build::platform_arch
+++ readonly -f os::build::setup_env
+++ readonly -f os::build::build_static_binaries
+++ readonly -f os::build::build_binaries
+++ readonly -f os::build::export_targets
+++ readonly -f os::build::place_bins
+++ readonly -f os::build::release_sha
+++ readonly -f os::build::make_openshift_binary_symlinks
+++ readonly -f os::build::ldflag
+++ readonly -f os::build::require_clean_tree
+++ readonly -f os::build::commit_range
++ for library_file in '$( find "${OS_ROOT}/hack/lib" -type f -name '\''*.sh'\'' -not -path '\''*/hack/lib/init.sh'\'' )'
++ source /data/src/github.com/openshift/origin/hack/lib/build/environment.sh
+++ readonly -f os::build::environment::create
+++ readonly -f os::build::environment::release::workingdir
+++ readonly -f os::build::environment::cleanup
+++ readonly -f os::build::environment::start
+++ readonly -f os::build::environment::withsource
+++ readonly -f os::build::environment::volume_name
+++ readonly -f os::build::environment::remove_volume
+++ readonly -f os::build::environment::run
++ for library_file in '$( find "${OS_ROOT}/hack/lib" -type f -name '\''*.sh'\'' -not -path '\''*/hack/lib/init.sh'\'' )'
++ source /data/src/github.com/openshift/origin/hack/lib/build/images.sh
+++ readonly -f os::build::image
+++ readonly -f os::build::image::internal::generic
+++ readonly -f os::build::image::internal::imagebuilder
+++ readonly -f os::build::image::internal::docker
++ for library_file in '$( find "${OS_ROOT}/hack/lib" -type f -name '\''*.sh'\'' -not -path '\''*/hack/lib/init.sh'\'' )'
++ source /data/src/github.com/openshift/origin/hack/lib/build/release.sh
++ for library_file in '$( find "${OS_ROOT}/hack/lib" -type f -name '\''*.sh'\'' -not -path '\''*/hack/lib/init.sh'\'' )'
++ source /data/src/github.com/openshift/origin/hack/lib/build/rpm.sh
++ for library_file in '$( find "${OS_ROOT}/hack/lib" -type f -name '\''*.sh'\'' -not -path '\''*/hack/lib/init.sh'\'' )'
++ source /data/src/github.com/openshift/origin/hack/lib/build/version.sh
+++ readonly -f os::build::version::get_vars
+++ readonly -f os::build::version::git_vars
+++ readonly -f os::build::version::etcd_vars
+++ readonly -f os::build::version::kubernetes_vars
+++ readonly -f os::build::version::save_vars
++ for library_file in '$( find "${OS_ROOT}/hack/lib" -type f -name '\''*.sh'\'' -not -path '\''*/hack/lib/init.sh'\'' )'
++ source /data/src/github.com/openshift/origin/hack/lib/log/output.sh
+++ readonly -f os::log::info
+++ readonly -f os::log::warning
+++ readonly -f os::log::error
+++ readonly -f os::log::fatal
+++ readonly -f os::log::debug
++ for library_file in '$( find "${OS_ROOT}/hack/lib" -type f -name '\''*.sh'\'' -not -path '\''*/hack/lib/init.sh'\'' )'
++ source /data/src/github.com/openshift/origin/hack/lib/log/stacktrace.sh
+++ readonly -f os::log::stacktrace::install
+++ readonly -f os::log::stacktrace::print
++ for library_file in '$( find "${OS_ROOT}/hack/lib" -type f -name '\''*.sh'\'' -not -path '\''*/hack/lib/init.sh'\'' )'
++ source /data/src/github.com/openshift/origin/hack/lib/log/system.sh
+++ readonly -f os::log::system::install_cleanup
+++ readonly -f os::log::system::clean_up
+++ readonly -f os::log::system::internal::prune_datafile
+++ readonly -f os::log::system::internal::plot
+++ readonly -f os::log::system::start
+++ readonly -f os::log::system::internal::run
++ for library_file in '$( find "${OS_ROOT}/hack/lib" -type f -name '\''*.sh'\'' -not -path '\''*/hack/lib/init.sh'\'' )'
++ source /data/src/github.com/openshift/origin/hack/lib/test/junit.sh
+++ readonly -f os::test::junit::declare_suite_start
+++ readonly -f os::test::junit::declare_suite_end
+++ readonly -f os::test::junit::declare_test_start
+++ readonly -f os::test::junit::declare_test_end
+++ readonly -f os::test::junit::check_test_counters
+++ readonly -f os::test::junit::reconcile_output
++ for library_file in '$( find "${OS_ROOT}/hack/lib" -type f -name '\''*.sh'\'' -not -path '\''*/hack/lib/init.sh'\'' )'
++ source /data/src/github.com/openshift/origin/hack/lib/util/docs.sh
+++ readonly -f generate_manual_pages
+++ readonly -f generate_documentation
+++ readonly -f os::util::gen-docs
+++ readonly -f os::util::set-man-placeholder
+++ readonly -f os::util::set-docs-placeholder
++ for library_file in '$( find "${OS_ROOT}/hack/lib" -type f -name '\''*.sh'\'' -not -path '\''*/hack/lib/init.sh'\'' )'
++ source /data/src/github.com/openshift/origin/hack/lib/util/ensure.sh
+++ readonly -f os::util::ensure::system_binary_exists
+++ readonly -f os::util::ensure::built_binary_exists
+++ readonly -f os::util::ensure::gopath_binary_exists
+++ readonly -f os::util::ensure::iptables_privileges_exist
++ for library_file in '$( find "${OS_ROOT}/hack/lib" -type f -name '\''*.sh'\'' -not -path '\''*/hack/lib/init.sh'\'' )'
++ source /data/src/github.com/openshift/origin/hack/lib/util/environment.sh
+++ readonly -f os::util::environment::use_sudo
+++ readonly -f os::util::environment::setup_time_vars
+++ readonly -f os::util::environment::setup_all_server_vars
+++ readonly -f os::util::environment::update_path_var
+++ readonly -f os::util::environment::setup_tmpdir_vars
+++ readonly -f os::util::environment::setup_kubelet_vars
+++ readonly -f os::util::environment::setup_etcd_vars
+++ readonly -f os::util::environment::setup_server_vars
+++ readonly -f os::util::environment::setup_images_vars
++ for library_file in '$( find "${OS_ROOT}/hack/lib" -type f -name '\''*.sh'\'' -not -path '\''*/hack/lib/init.sh'\'' )'
++ source /data/src/github.com/openshift/origin/hack/lib/util/find.sh
+++ readonly -f os::util::find::system_binary
+++ readonly -f os::util::find::built_binary
+++ readonly -f os::util::find::gopath_binary
++ for library_file in '$( find "${OS_ROOT}/hack/lib" -type f -name '\''*.sh'\'' -not -path '\''*/hack/lib/init.sh'\'' )'
++ source /data/src/github.com/openshift/origin/hack/lib/util/golang.sh
+++ readonly -f os::golang::verify_go_version
+++ readonly -f os::golang::verify_glide_version
++ for library_file in '$( find "${OS_ROOT}/hack/lib" -type f -name '\''*.sh'\'' -not -path '\''*/hack/lib/init.sh'\'' )'
++ source /data/src/github.com/openshift/origin/hack/lib/util/misc.sh
+++ readonly -f os::util::describe_return_code
+++ readonly -f os::util::install_describe_return_code
+++ [[ -z '' ]]
++++ pwd
+++ OS_ORIGINAL_WD=/data/src/github.com/openshift/origin
+++ readonly OS_ORIGINAL_WD
+++ export OS_ORIGINAL_WD
+++ readonly -f os::util::repository_relative_path
+++ readonly -f os::util::format_seconds
+++ readonly -f os::util::sed
+++ readonly -f os::util::base64decode
++ for library_file in '$( find "${OS_ROOT}/hack/lib" -type f -name '\''*.sh'\'' -not -path '\''*/hack/lib/init.sh'\'' )'
++ source /data/src/github.com/openshift/origin/hack/lib/util/text.sh
+++ readonly -f os::text::reset
+++ readonly -f os::text::bold
+++ readonly -f os::text::red
+++ readonly -f os::text::green
+++ readonly -f os::text::blue
+++ readonly -f os::text::yellow
+++ readonly -f os::text::clear_last_line
+++ readonly -f os::text::internal::is_tty
+++ readonly -f os::text::print_bold
+++ readonly -f os::text::print_red
+++ readonly -f os::text::print_red_bold
+++ readonly -f os::text::print_green
+++ readonly -f os::text::print_green_bold
+++ readonly -f os::text::print_blue
+++ readonly -f os::text::print_blue_bold
+++ readonly -f os::text::print_yellow
+++ readonly -f os::text::print_yellow_bold
++ for library_file in '$( find "${OS_ROOT}/hack/lib" -type f -name '\''*.sh'\'' -not -path '\''*/hack/lib/init.sh'\'' )'
++ source /data/src/github.com/openshift/origin/hack/lib/util/trap.sh
+++ readonly -f os::util::trap::init_err
+++ readonly -f os::util::trap::init_exit
+++ readonly -f os::util::trap::err_handler
+++ readonly -f os::util::trap::exit_handler
++ for library_file in '$( find "${OS_ROOT}/hack/lib" -type f -name '\''*.sh'\'' -not -path '\''*/hack/lib/init.sh'\'' )'
++ source /data/src/github.com/openshift/origin/hack/lib/cleanup.sh
+++ readonly -f os::cleanup::all
+++ readonly -f os::cleanup::dump_etcd
+++ readonly -f os::cleanup::internal::dump_etcd_v3
+++ readonly -f os::cleanup::prune_etcd
+++ readonly -f os::cleanup::containers
+++ readonly -f os::cleanup::dump_container_logs
+++ readonly -f os::cleanup::internal::list_our_containers
+++ readonly -f os::cleanup::internal::list_k8s_containers
+++ readonly -f os::cleanup::internal::list_containers
+++ readonly -f os::cleanup::tmpdir
+++ readonly -f os::cleanup::dump_events
+++ readonly -f os::cleanup::find_cache_alterations
+++ readonly -f os::cleanup::dump_pprof_output
+++ readonly -f os::cleanup::truncate_large_logs
+++ readonly -f os::cleanup::processes
++ for library_file in '$( find "${OS_ROOT}/hack/lib" -type f -name '\''*.sh'\'' -not -path '\''*/hack/lib/init.sh'\'' )'
++ source /data/src/github.com/openshift/origin/hack/lib/cmd.sh
+++ readonly -f os::cmd::expect_success
+++ readonly -f os::cmd::expect_failure
+++ readonly -f os::cmd::expect_success_and_text
+++ readonly -f os::cmd::expect_failure_and_text
+++ readonly -f os::cmd::expect_success_and_not_text
+++ readonly -f os::cmd::expect_failure_and_not_text
+++ readonly -f os::cmd::expect_code
+++ readonly -f os::cmd::expect_code_and_text
+++ readonly -f os::cmd::expect_code_and_not_text
+++ millisecond=1
+++ second=1000
+++ minute=60000
+++ readonly -f os::cmd::try_until_success
+++ readonly -f os::cmd::try_until_failure
+++ readonly -f os::cmd::try_until_text
+++ readonly -f os::cmd::try_until_text
+++ os_cmd_internal_tmpdir=/tmp/cmd
+++ os_cmd_internal_tmpout=/tmp/cmd/tmp_stdout.log
+++ os_cmd_internal_tmperr=/tmp/cmd/tmp_stderr.log
+++ readonly -f os::cmd::internal::expect_exit_code_run_grep
+++ readonly -f os::cmd::internal::init_tempdir
+++ readonly -f os::cmd::internal::describe_call
+++ readonly -f os::cmd::internal::determine_caller
+++ readonly -f os::cmd::internal::describe_expectation
+++ readonly -f os::cmd::internal::seconds_since_epoch
+++ readonly -f os::cmd::internal::run_collecting_output
+++ readonly -f os::cmd::internal::success_func
+++ readonly -f os::cmd::internal::failure_func
+++ readonly -f os::cmd::internal::specific_code_func
+++ readonly -f os::cmd::internal::get_results
+++ readonly -f os::cmd::internal::get_last_results
+++ readonly -f os::cmd::internal::mark_attempt
+++ readonly -f os::cmd::internal::compress_output
+++ readonly -f os::cmd::internal::print_results
+++ readonly -f os::cmd::internal::assemble_causes
+++ readonly -f os::cmd::internal::run_until_exit_code
+++ readonly -f os::cmd::internal::run_until_text
++ for library_file in '$( find "${OS_ROOT}/hack/lib" -type f -name '\''*.sh'\'' -not -path '\''*/hack/lib/init.sh'\'' )'
++ source /data/src/github.com/openshift/origin/hack/lib/constants.sh
+++ readonly OS_GO_PACKAGE=github.com/openshift/origin
+++ OS_GO_PACKAGE=github.com/openshift/origin
+++ readonly OS_BUILD_ENV_GOLANG=1.10
+++ OS_BUILD_ENV_GOLANG=1.10
+++ readonly OS_BUILD_ENV_IMAGE=openshift/origin-release:golang-1.10
+++ OS_BUILD_ENV_IMAGE=openshift/origin-release:golang-1.10
+++ readonly OS_REQUIRED_GO_VERSION=go1.10
+++ OS_REQUIRED_GO_VERSION=go1.10
+++ readonly OS_GLIDE_MINOR_VERSION=13
+++ OS_GLIDE_MINOR_VERSION=13
+++ readonly OS_REQUIRED_GLIDE_VERSION=0.13
+++ OS_REQUIRED_GLIDE_VERSION=0.13
+++ readonly 'OS_GOFLAGS_TAGS=include_gcs include_oss containers_image_openpgp no_openssl'
+++ OS_GOFLAGS_TAGS='include_gcs include_oss containers_image_openpgp no_openssl'
+++ readonly OS_GOFLAGS_TAGS_LINUX_AMD64=gssapi
+++ OS_GOFLAGS_TAGS_LINUX_AMD64=gssapi
+++ readonly OS_GOFLAGS_TAGS_LINUX_S390X=gssapi
+++ OS_GOFLAGS_TAGS_LINUX_S390X=gssapi
+++ readonly OS_GOFLAGS_TAGS_LINUX_ARM64=gssapi
+++ OS_GOFLAGS_TAGS_LINUX_ARM64=gssapi
+++ readonly OS_GOFLAGS_TAGS_LINUX_PPC64LE=gssapi
+++ OS_GOFLAGS_TAGS_LINUX_PPC64LE=gssapi
+++ readonly OS_OUTPUT_BASEPATH=_output
+++ OS_OUTPUT_BASEPATH=_output
+++ readonly OS_BASE_OUTPUT=/data/src/github.com/openshift/origin/_output
+++ OS_BASE_OUTPUT=/data/src/github.com/openshift/origin/_output
+++ readonly OS_OUTPUT_SCRIPTPATH=/data/src/github.com/openshift/origin/_output/scripts
+++ OS_OUTPUT_SCRIPTPATH=/data/src/github.com/openshift/origin/_output/scripts
+++ readonly OS_OUTPUT_SUBPATH=_output/local
+++ OS_OUTPUT_SUBPATH=_output/local
+++ readonly OS_OUTPUT=/data/src/github.com/openshift/origin/_output/local
+++ OS_OUTPUT=/data/src/github.com/openshift/origin/_output/local
+++ readonly OS_OUTPUT_RELEASEPATH=/data/src/github.com/openshift/origin/_output/local/releases
+++ OS_OUTPUT_RELEASEPATH=/data/src/github.com/openshift/origin/_output/local/releases
+++ readonly OS_OUTPUT_RPMPATH=/data/src/github.com/openshift/origin/_output/local/releases/rpms
+++ OS_OUTPUT_RPMPATH=/data/src/github.com/openshift/origin/_output/local/releases/rpms
+++ readonly OS_OUTPUT_BINPATH=/data/src/github.com/openshift/origin/_output/local/bin
+++ OS_OUTPUT_BINPATH=/data/src/github.com/openshift/origin/_output/local/bin
+++ readonly OS_OUTPUT_PKGDIR=/data/src/github.com/openshift/origin/_output/local/pkgdir
+++ OS_OUTPUT_PKGDIR=/data/src/github.com/openshift/origin/_output/local/pkgdir
+++ OS_SDN_COMPILE_TARGETS_LINUX=(cmd/sdn-cni-plugin vendor/github.com/containernetworking/plugins/plugins/ipam/host-local vendor/github.com/containernetworking/plugins/plugins/main/loopback)
+++ readonly OS_SDN_COMPILE_TARGETS_LINUX
+++ OS_IMAGE_COMPILE_TARGETS_LINUX=("${OS_SDN_COMPILE_TARGETS_LINUX[@]}")
+++ readonly OS_IMAGE_COMPILE_TARGETS_LINUX
+++ OS_SCRATCH_IMAGE_COMPILE_TARGETS_LINUX=(images/pod)
+++ readonly OS_SCRATCH_IMAGE_COMPILE_TARGETS_LINUX
+++ OS_IMAGE_COMPILE_BINARIES=("${OS_SCRATCH_IMAGE_COMPILE_TARGETS_LINUX[@]##*/}" "${OS_IMAGE_COMPILE_TARGETS_LINUX[@]##*/}")
+++ readonly OS_IMAGE_COMPILE_BINARIES
+++ OS_CROSS_COMPILE_TARGETS=(cmd/hypershift cmd/openshift cmd/oc cmd/oadm cmd/template-service-broker cmd/openshift-node-config vendor/k8s.io/kubernetes/cmd/hyperkube)
+++ readonly OS_CROSS_COMPILE_TARGETS
+++ OS_CROSS_COMPILE_BINARIES=("${OS_CROSS_COMPILE_TARGETS[@]##*/}")
+++ readonly OS_CROSS_COMPILE_BINARIES
+++ OS_TEST_TARGETS=(test/extended/extended.test)
+++ readonly OS_TEST_TARGETS
+++ OS_GOVET_BLACKLIST=()
+++ readonly OS_GOVET_BLACKLIST
+++ OPENSHIFT_BINARY_SYMLINKS=()
+++ readonly OPENSHIFT_BINARY_SYMLINKS
+++ OC_BINARY_SYMLINKS=(openshift-deploy openshift-sti-build openshift-docker-build openshift-git-clone openshift-manage-dockerfile openshift-extract-image-content openshift-router openshift-recycle)
+++ readonly OC_BINARY_SYMLINKS
+++ OC_BINARY_COPY=(kubectl)
+++ readonly OC_BINARY_COPY
+++ OS_BINARY_RELEASE_CLIENT_WINDOWS=(oc.exe kubectl.exe README.md ./LICENSE)
+++ readonly OS_BINARY_RELEASE_CLIENT_WINDOWS
+++ OS_BINARY_RELEASE_CLIENT_MAC=(oc kubectl README.md ./LICENSE)
+++ readonly OS_BINARY_RELEASE_CLIENT_MAC
+++ OS_BINARY_RELEASE_CLIENT_LINUX=(./oc ./kubectl ./README.md ./LICENSE)
+++ readonly OS_BINARY_RELEASE_CLIENT_LINUX
+++ OS_BINARY_RELEASE_SERVER_LINUX=('./*')
+++ readonly OS_BINARY_RELEASE_SERVER_LINUX
+++ OS_BINARY_RELEASE_CLIENT_EXTRA=(${OS_ROOT}/README.md ${OS_ROOT}/LICENSE)
+++ readonly OS_BINARY_RELEASE_CLIENT_EXTRA
+++ readonly -f os::build::ldflags
+++ readonly -f os::util::list_go_src_files
+++ readonly -f os::util::list_go_src_dirs
+++ readonly -f os::util::list_test_packages_under
+++ readonly -f os::build::generate_windows_versioninfo
+++ readonly -f os::build::clean_windows_versioninfo
+++ OS_ALL_IMAGES=(origin-pod origin-base origin-cli origin-hypershift origin-hyperkube origin-control-plane origin-node origin-deployer origin-docker-builder origin-keepalived-ipfailover origin-haproxy-router origin-f5-router origin-egress-router origin-egress-http-proxy origin-egress-dns-proxy origin-recycler origin-template-service-broker origin-tests)
+++ readonly OS_ALL_IMAGES
+++ readonly -f os::build::images
++ for library_file in '$( find "${OS_ROOT}/hack/lib" -type f -name '\''*.sh'\'' -not -path '\''*/hack/lib/init.sh'\'' )'
++ source /data/src/github.com/openshift/origin/hack/lib/start.sh
+++ readonly -f os::start::configure_server
+++ readonly -f os::start::internal::create_master_certs
+++ readonly -f os::start::internal::configure_node
+++ readonly -f os::start::internal::configure_master
+++ readonly -f os::start::internal::patch_master_config
+++ readonly -f os::start::server
+++ readonly -f os::start::master
+++ readonly -f os::start::all_in_one
+++ readonly -f os::start::etcd
+++ readonly -f os::start::api_server
+++ readonly -f os::start::controllers
+++ readonly -f os::start::internal::start_node
+++ readonly -f os::start::internal::openshift_executable
+++ readonly -f os::start::internal::determine_hostnames
+++ readonly -f os::start::router
+++ readonly -f os::start::registry
++ unset library_files library_file init_source
++ os::log::stacktrace::install
++ set -o errtrace
++ export OS_USE_STACKTRACE=true
++ OS_USE_STACKTRACE=true
++ os::util::trap::init_err
++ trap -p ERR
++ grep -q os::util::trap::err_handler
++ trap 'os::util::trap::err_handler;' ERR
++ os::util::environment::update_path_var
++ local prefix
++ os::util::find::system_binary go
+++ os::build::host_platform
++++ go env GOHOSTOS
++++ go env GOHOSTARCH
+++ echo linux/amd64
++ prefix+=/data/src/github.com/openshift/origin/_output/local/bin/linux/amd64:
++ [[ -n /data ]]
++ prefix+=/data/bin:
++ PATH=/data/src/github.com/openshift/origin/_output/local/bin/linux/amd64:/data/bin:/usr/local/bin:/usr/bin:/usr/local/sbin:/usr/sbin:/home/origin/.local/bin:/home/origin/bin
++ export PATH
++ [[ -z '' ]]
+++ basename /tmp/tmp.ddNEk4yHui .sh
++ os::util::environment::setup_tmpdir_vars tmp.ddNEk4yHui
++ local sub_dir=tmp.ddNEk4yHui
++ BASETMPDIR=/tmp/openshift/tmp.ddNEk4yHui
++ export BASETMPDIR
++ VOLUME_DIR=/tmp/openshift/tmp.ddNEk4yHui/volumes
++ export VOLUME_DIR
++ BASEOUTDIR=/data/src/github.com/openshift/origin/_output/scripts/tmp.ddNEk4yHui
++ export BASEOUTDIR
++ LOG_DIR=/data/src/github.com/openshift/origin/_output/scripts/tmp.ddNEk4yHui/logs
++ export LOG_DIR
++ ARTIFACT_DIR=/data/src/github.com/openshift/origin/_output/scripts/tmp.ddNEk4yHui/artifacts
++ export ARTIFACT_DIR
++ FAKE_HOME_DIR=/data/src/github.com/openshift/origin/_output/scripts/tmp.ddNEk4yHui/openshift.local.home
++ export FAKE_HOME_DIR
++ mkdir -p /data/src/github.com/openshift/origin/_output/scripts/tmp.ddNEk4yHui/logs /tmp/openshift/tmp.ddNEk4yHui/volumes /data/src/github.com/openshift/origin/_output/scripts/tmp.ddNEk4yHui/artifacts /data/src/github.com/openshift/origin/_output/scripts/tmp.ddNEk4yHui/openshift.local.home
++ export OS_TMP_ENV_SET=tmp.ddNEk4yHui
++ OS_TMP_ENV_SET=tmp.ddNEk4yHui
++ [[ -n '' ]]
+ os::build::rpm::get_nvra_vars
++ uname -i
+ OS_RPM_ARCHITECTURE=x86_64
+ os::build::version::get_vars
+ [[ -n '' ]]
+ os::build::version::git_vars
+ [[ -n '' ]]
+ os::build::version::kubernetes_vars
++ go run /data/src/github.com/openshift/origin/tools/godepversion/godepversion.go /data/src/github.com/openshift/origin/Godeps/Godeps.json k8s.io/kubernetes/pkg/api comment
+ KUBE_GIT_VERSION=v1.11.0-62-gd4cacc0
++ go run /data/src/github.com/openshift/origin/tools/godepversion/godepversion.go /data/src/github.com/openshift/origin/Godeps/Godeps.json k8s.io/kubernetes/pkg/api
+ KUBE_GIT_COMMIT=d4cacc0
++ echo v1.11.0-62-gd4cacc0
++ sed 's/-\([0-9]\{1,\}\)-g\([0-9a-f]\{7,40\}\)$/\+\2/'
+ KUBE_GIT_VERSION=v1.11.0+d4cacc0
+ [[ v1.11.0+d4cacc0 =~ ^v([0-9]+)\.([0-9]+)\. ]]
+ KUBE_GIT_MAJOR=1
+ KUBE_GIT_MINOR=11+
+ os::build::version::etcd_vars
++ go run /data/src/github.com/openshift/origin/tools/godepversion/godepversion.go /data/src/github.com/openshift/origin/Godeps/Godeps.json github.com/coreos/etcd/etcdserver comment
+ ETCD_GIT_VERSION=v3.2.16-0-g121edf0
++ go run /data/src/github.com/openshift/origin/tools/godepversion/godepversion.go /data/src/github.com/openshift/origin/Godeps/Godeps.json github.com/coreos/etcd/etcdserver
+ ETCD_GIT_COMMIT=121edf0
+ git=(git --work-tree "${OS_ROOT}")
+ local git
+ [[ -n '' ]]
++ git --work-tree /data/src/github.com/openshift/origin rev-parse --short 'HEAD^{commit}'
+ OS_GIT_COMMIT=9cb9d16
+ [[ -z '' ]]
++ git --work-tree /data/src/github.com/openshift/origin status --porcelain
+ git_status=
+ [[ -z '' ]]
+ OS_GIT_TREE_STATE=clean
+ [[ -n '' ]]
++ git --work-tree /data/src/github.com/openshift/origin describe --long --tags --abbrev=7 --match 'v[0-9]*' '9cb9d16^{commit}'
+ OS_GIT_VERSION=v3.11.0-522-g9cb9d16
+ [[ v3.11.0-522-g9cb9d16 =~ ^v([0-9]+)\.([0-9]+)\.([0-9]+)(\.[0-9]+)*([-].*)?$ ]]
+ OS_GIT_MAJOR=3
+ OS_GIT_MINOR=11
+ OS_GIT_PATCH=0
+ [[ -n -522-g9cb9d16 ]]
+ OS_GIT_MINOR+=+
++ echo v3.11.0-522-g9cb9d16
++ sed 's/-\([0-9]\{1,\}\)-g\([0-9a-f]\{7,40\}\)$/\+\2-\1/'
+ OS_GIT_VERSION=v3.11.0+9cb9d16-522
++ echo v3.11.0+9cb9d16-522
++ sed 's/-0$//'
+ OS_GIT_VERSION=v3.11.0+9cb9d16-522
+ [[ clean == \d\i\r\t\y ]]
+ [[ v3.11.0+9cb9d16-522 =~ ^v([0-9](\.[0-9]+)*)(.*) ]]
+ OS_RPM_VERSION=3.11.0
+ metadata=+9cb9d16-522
+ [[ + == \+ ]]
+ [[ +9cb9d16-522 =~ ^\+([a-z0-9]{7,40})(-([0-9]+))?(-dirty)?$ ]]
+ build_sha=9cb9d16
+ build_num=522
+ OS_RPM_RELEASE=1.522.9cb9d16
++ os::build::version::save_vars
++ cat
++ tr '\n' ' '
+ OS_RPM_GIT_VARS='OS_GIT_COMMIT='\''9cb9d16'\'' OS_GIT_TREE_STATE='\''clean'\'' OS_GIT_VERSION='\''v3.11.0+9cb9d16-522'\'' OS_GIT_MAJOR='\''3'\'' OS_GIT_MINOR='\''11+'\'' OS_GIT_PATCH='\''0'\'' KUBE_GIT_MAJOR='\''1'\'' KUBE_GIT_MINOR='\''11+'\'' KUBE_GIT_COMMIT='\''d4cacc0'\'' KUBE_GIT_VERSION='\''v1.11.0+d4cacc0'\'' ETCD_GIT_VERSION='\''v3.2.16-0-g121edf0'\'' ETCD_GIT_COMMIT='\''121edf0'\'' '
+ export OS_RPM_VERSION OS_RPM_RELEASE OS_RPM_ARCHITECTURE OS_RPM_GIT_VARS
+ echo -3.11.0-1.522.9cb9d16
+ source hack/lib/init.sh
++ set -o errexit
++ set -o nounset
++ set -o pipefail
+++ date +%s
++ OS_SCRIPT_START_TIME=1642881732
++ export OS_SCRIPT_START_TIME
++ readonly -f os::util::absolute_path
+++ dirname hack/lib/init.sh
++ init_source=hack/lib/../..
+++ os::util::absolute_path hack/lib/../..
+++ local relative_path=hack/lib/../..
+++ local absolute_path
+++ pushd hack/lib/../..
++++ pwd
+++ relative_path=/data/src/github.com/openshift/origin
+++ [[ -h /data/src/github.com/openshift/origin ]]
+++ absolute_path=/data/src/github.com/openshift/origin
+++ popd
+++ echo /data/src/github.com/openshift/origin
++ OS_ROOT=/data/src/github.com/openshift/origin
++ export OS_ROOT
++ cd /data/src/github.com/openshift/origin
+++ find /data/src/github.com/openshift/origin/hack/lib -type f -name '*.sh' -not -path '*/hack/lib/init.sh'
++ for library_file in '$( find "${OS_ROOT}/hack/lib" -type f -name '\''*.sh'\'' -not -path '\''*/hack/lib/init.sh'\'' )'
++ source /data/src/github.com/openshift/origin/hack/lib/build/archive.sh
+++ readonly -f os::build::archive::name
+++ readonly -f os::build::archive::zip
+++ readonly -f os::build::archive::tar
+++ readonly -f os::build::archive::internal::is_hardlink_supported
+++ readonly -f os::build::archive::extract_tar
+++ readonly -f os::build::archive::detect_local_release_tars
++ for library_file in '$( find "${OS_ROOT}/hack/lib" -type f -name '\''*.sh'\'' -not -path '\''*/hack/lib/init.sh'\'' )'
++ source /data/src/github.com/openshift/origin/hack/lib/build/binaries.sh
+++ readonly -f os::build::binaries_from_targets
+++ readonly -f os::build::host_platform
+++ readonly -f os::build::host_platform_friendly
+++ readonly -f os::build::platform_arch
+++ readonly -f os::build::setup_env
+++ readonly -f os::build::build_static_binaries
+++ readonly -f os::build::build_binaries
+++ readonly -f os::build::export_targets
+++ readonly -f os::build::place_bins
+++ readonly -f os::build::release_sha
+++ readonly -f os::build::make_openshift_binary_symlinks
+++ readonly -f os::build::ldflag
+++ readonly -f os::build::require_clean_tree
+++ readonly -f os::build::commit_range
++ for library_file in '$( find "${OS_ROOT}/hack/lib" -type f -name '\''*.sh'\'' -not -path '\''*/hack/lib/init.sh'\'' )'
++ source /data/src/github.com/openshift/origin/hack/lib/build/environment.sh
+++ readonly -f os::build::environment::create
+++ readonly -f os::build::environment::release::workingdir
+++ readonly -f os::build::environment::cleanup
+++ readonly -f os::build::environment::start
+++ readonly -f os::build::environment::withsource
+++ readonly -f os::build::environment::volume_name
+++ readonly -f os::build::environment::remove_volume
+++ readonly -f os::build::environment::run
++ for library_file in '$( find "${OS_ROOT}/hack/lib" -type f -name '\''*.sh'\'' -not -path '\''*/hack/lib/init.sh'\'' )'
++ source /data/src/github.com/openshift/origin/hack/lib/build/images.sh
+++ readonly -f os::build::image
+++ readonly -f os::build::image::internal::generic
+++ readonly -f os::build::image::internal::imagebuilder
+++ readonly -f os::build::image::internal::docker
++ for library_file in '$( find "${OS_ROOT}/hack/lib" -type f -name '\''*.sh'\'' -not -path '\''*/hack/lib/init.sh'\'' )'
++ source /data/src/github.com/openshift/origin/hack/lib/build/release.sh
++ for library_file in '$( find "${OS_ROOT}/hack/lib" -type f -name '\''*.sh'\'' -not -path '\''*/hack/lib/init.sh'\'' )'
++ source /data/src/github.com/openshift/origin/hack/lib/build/rpm.sh
++ for library_file in '$( find "${OS_ROOT}/hack/lib" -type f -name '\''*.sh'\'' -not -path '\''*/hack/lib/init.sh'\'' )'
++ source /data/src/github.com/openshift/origin/hack/lib/build/version.sh
+++ readonly -f os::build::version::get_vars
+++ readonly -f os::build::version::git_vars
+++ readonly -f os::build::version::etcd_vars
+++ readonly -f os::build::version::kubernetes_vars
+++ readonly -f os::build::version::save_vars
++ for library_file in '$( find "${OS_ROOT}/hack/lib" -type f -name '\''*.sh'\'' -not -path '\''*/hack/lib/init.sh'\'' )'
++ source /data/src/github.com/openshift/origin/hack/lib/log/output.sh
+++ readonly -f os::log::info
+++ readonly -f os::log::warning
+++ readonly -f os::log::error
+++ readonly -f os::log::fatal
+++ readonly -f os::log::debug
++ for library_file in '$( find "${OS_ROOT}/hack/lib" -type f -name '\''*.sh'\'' -not -path '\''*/hack/lib/init.sh'\'' )'
++ source /data/src/github.com/openshift/origin/hack/lib/log/stacktrace.sh
+++ readonly -f os::log::stacktrace::install
+++ readonly -f os::log::stacktrace::print
++ for library_file in '$( find "${OS_ROOT}/hack/lib" -type f -name '\''*.sh'\'' -not -path '\''*/hack/lib/init.sh'\'' )'
++ source /data/src/github.com/openshift/origin/hack/lib/log/system.sh
+++ readonly -f os::log::system::install_cleanup
+++ readonly -f os::log::system::clean_up
+++ readonly -f os::log::system::internal::prune_datafile
+++ readonly -f os::log::system::internal::plot
+++ readonly -f os::log::system::start
+++ readonly -f os::log::system::internal::run
++ for library_file in '$( find "${OS_ROOT}/hack/lib" -type f -name '\''*.sh'\'' -not -path '\''*/hack/lib/init.sh'\'' )'
++ source /data/src/github.com/openshift/origin/hack/lib/test/junit.sh
+++ readonly -f os::test::junit::declare_suite_start
+++ readonly -f os::test::junit::declare_suite_end
+++ readonly -f os::test::junit::declare_test_start
+++ readonly -f os::test::junit::declare_test_end
+++ readonly -f os::test::junit::check_test_counters
+++ readonly -f os::test::junit::reconcile_output
++ for library_file in '$( find "${OS_ROOT}/hack/lib" -type f -name '\''*.sh'\'' -not -path '\''*/hack/lib/init.sh'\'' )'
++ source /data/src/github.com/openshift/origin/hack/lib/util/docs.sh
+++ readonly -f generate_manual_pages
+++ readonly -f generate_documentation
+++ readonly -f os::util::gen-docs
+++ readonly -f os::util::set-man-placeholder
+++ readonly -f os::util::set-docs-placeholder
++ for library_file in '$( find "${OS_ROOT}/hack/lib" -type f -name '\''*.sh'\'' -not -path '\''*/hack/lib/init.sh'\'' )'
++ source /data/src/github.com/openshift/origin/hack/lib/util/ensure.sh
+++ readonly -f os::util::ensure::system_binary_exists
+++ readonly -f os::util::ensure::built_binary_exists
+++ readonly -f os::util::ensure::gopath_binary_exists
+++ readonly -f os::util::ensure::iptables_privileges_exist
++ for library_file in '$( find "${OS_ROOT}/hack/lib" -type f -name '\''*.sh'\'' -not -path '\''*/hack/lib/init.sh'\'' )'
++ source /data/src/github.com/openshift/origin/hack/lib/util/environment.sh
+++ readonly -f os::util::environment::use_sudo
+++ readonly -f os::util::environment::setup_time_vars
+++ readonly -f os::util::environment::setup_all_server_vars
+++ readonly -f os::util::environment::update_path_var
+++ readonly -f os::util::environment::setup_tmpdir_vars
+++ readonly -f os::util::environment::setup_kubelet_vars
+++ readonly -f os::util::environment::setup_etcd_vars
+++ readonly -f os::util::environment::setup_server_vars
+++ readonly -f os::util::environment::setup_images_vars
++ for library_file in '$( find "${OS_ROOT}/hack/lib" -type f -name '\''*.sh'\'' -not -path '\''*/hack/lib/init.sh'\'' )'
++ source /data/src/github.com/openshift/origin/hack/lib/util/find.sh
+++ readonly -f os::util::find::system_binary
+++ readonly -f os::util::find::built_binary
+++ readonly -f os::util::find::gopath_binary
++ for library_file in '$( find "${OS_ROOT}/hack/lib" -type f -name '\''*.sh'\'' -not -path '\''*/hack/lib/init.sh'\'' )'
++ source /data/src/github.com/openshift/origin/hack/lib/util/golang.sh
+++ readonly -f os::golang::verify_go_version
+++ readonly -f os::golang::verify_glide_version
++ for library_file in '$( find "${OS_ROOT}/hack/lib" -type f -name '\''*.sh'\'' -not -path '\''*/hack/lib/init.sh'\'' )'
++ source /data/src/github.com/openshift/origin/hack/lib/util/misc.sh
+++ readonly -f os::util::describe_return_code
+++ readonly -f os::util::install_describe_return_code
+++ [[ -z '' ]]
++++ pwd
+++ OS_ORIGINAL_WD=/data/src/github.com/openshift/origin
+++ readonly OS_ORIGINAL_WD
+++ export OS_ORIGINAL_WD
+++ readonly -f os::util::repository_relative_path
+++ readonly -f os::util::format_seconds
+++ readonly -f os::util::sed
+++ readonly -f os::util::base64decode
++ for library_file in '$( find "${OS_ROOT}/hack/lib" -type f -name '\''*.sh'\'' -not -path '\''*/hack/lib/init.sh'\'' )'
++ source /data/src/github.com/openshift/origin/hack/lib/util/text.sh
+++ readonly -f os::text::reset
+++ readonly -f os::text::bold
+++ readonly -f os::text::red
+++ readonly -f os::text::green
+++ readonly -f os::text::blue
+++ readonly -f os::text::yellow
+++ readonly -f os::text::clear_last_line
+++ readonly -f os::text::internal::is_tty
+++ readonly -f os::text::print_bold
+++ readonly -f os::text::print_red
+++ readonly -f os::text::print_red_bold
+++ readonly -f os::text::print_green
+++ readonly -f os::text::print_green_bold
+++ readonly -f os::text::print_blue
+++ readonly -f os::text::print_blue_bold
+++ readonly -f os::text::print_yellow
+++ readonly -f os::text::print_yellow_bold
++ for library_file in '$( find "${OS_ROOT}/hack/lib" -type f -name '\''*.sh'\'' -not -path '\''*/hack/lib/init.sh'\'' )'
++ source /data/src/github.com/openshift/origin/hack/lib/util/trap.sh
+++ readonly -f os::util::trap::init_err
+++ readonly -f os::util::trap::init_exit
+++ readonly -f os::util::trap::err_handler
+++ readonly -f os::util::trap::exit_handler
++ for library_file in '$( find "${OS_ROOT}/hack/lib" -type f -name '\''*.sh'\'' -not -path '\''*/hack/lib/init.sh'\'' )'
++ source /data/src/github.com/openshift/origin/hack/lib/cleanup.sh
+++ readonly -f os::cleanup::all
+++ readonly -f os::cleanup::dump_etcd
+++ readonly -f os::cleanup::internal::dump_etcd_v3
+++ readonly -f os::cleanup::prune_etcd
+++ readonly -f os::cleanup::containers
+++ readonly -f os::cleanup::dump_container_logs
+++ readonly -f os::cleanup::internal::list_our_containers
+++ readonly -f os::cleanup::internal::list_k8s_containers
+++ readonly -f os::cleanup::internal::list_containers
+++ readonly -f os::cleanup::tmpdir
+++ readonly -f os::cleanup::dump_events
+++ readonly -f os::cleanup::find_cache_alterations
+++ readonly -f os::cleanup::dump_pprof_output
+++ readonly -f os::cleanup::truncate_large_logs
+++ readonly -f os::cleanup::processes
++ for library_file in '$( find "${OS_ROOT}/hack/lib" -type f -name '\''*.sh'\'' -not -path '\''*/hack/lib/init.sh'\'' )'
++ source /data/src/github.com/openshift/origin/hack/lib/cmd.sh
+++ readonly -f os::cmd::expect_success
+++ readonly -f os::cmd::expect_failure
+++ readonly -f os::cmd::expect_success_and_text
+++ readonly -f os::cmd::expect_failure_and_text
+++ readonly -f os::cmd::expect_success_and_not_text
+++ readonly -f os::cmd::expect_failure_and_not_text
+++ readonly -f os::cmd::expect_code
+++ readonly -f os::cmd::expect_code_and_text
+++ readonly -f os::cmd::expect_code_and_not_text
+++ millisecond=1
+++ second=1000
+++ minute=60000
+++ readonly -f os::cmd::try_until_success
+++ readonly -f os::cmd::try_until_failure
+++ readonly -f os::cmd::try_until_text
+++ readonly -f os::cmd::try_until_text
+++ os_cmd_internal_tmpdir=/tmp/cmd
+++ os_cmd_internal_tmpout=/tmp/cmd/tmp_stdout.log
+++ os_cmd_internal_tmperr=/tmp/cmd/tmp_stderr.log
+++ readonly -f os::cmd::internal::expect_exit_code_run_grep
+++ readonly -f os::cmd::internal::init_tempdir
+++ readonly -f os::cmd::internal::describe_call
+++ readonly -f os::cmd::internal::determine_caller
+++ readonly -f os::cmd::internal::describe_expectation
+++ readonly -f os::cmd::internal::seconds_since_epoch
+++ readonly -f os::cmd::internal::run_collecting_output
+++ readonly -f os::cmd::internal::success_func
+++ readonly -f os::cmd::internal::failure_func
+++ readonly -f os::cmd::internal::specific_code_func
+++ readonly -f os::cmd::internal::get_results
+++ readonly -f os::cmd::internal::get_last_results
+++ readonly -f os::cmd::internal::mark_attempt
+++ readonly -f os::cmd::internal::compress_output
+++ readonly -f os::cmd::internal::print_results
+++ readonly -f os::cmd::internal::assemble_causes
+++ readonly -f os::cmd::internal::run_until_exit_code
+++ readonly -f os::cmd::internal::run_until_text
++ for library_file in '$( find "${OS_ROOT}/hack/lib" -type f -name '\''*.sh'\'' -not -path '\''*/hack/lib/init.sh'\'' )'
++ source /data/src/github.com/openshift/origin/hack/lib/constants.sh
+++ readonly OS_GO_PACKAGE=github.com/openshift/origin
+++ OS_GO_PACKAGE=github.com/openshift/origin
+++ readonly OS_BUILD_ENV_GOLANG=1.10
+++ OS_BUILD_ENV_GOLANG=1.10
+++ readonly OS_BUILD_ENV_IMAGE=openshift/origin-release:golang-1.10
+++ OS_BUILD_ENV_IMAGE=openshift/origin-release:golang-1.10
+++ readonly OS_REQUIRED_GO_VERSION=go1.10
+++ OS_REQUIRED_GO_VERSION=go1.10
+++ readonly OS_GLIDE_MINOR_VERSION=13
+++ OS_GLIDE_MINOR_VERSION=13
+++ readonly OS_REQUIRED_GLIDE_VERSION=0.13
+++ OS_REQUIRED_GLIDE_VERSION=0.13
+++ readonly 'OS_GOFLAGS_TAGS=include_gcs include_oss containers_image_openpgp no_openssl'
+++ OS_GOFLAGS_TAGS='include_gcs include_oss containers_image_openpgp no_openssl'
+++ readonly OS_GOFLAGS_TAGS_LINUX_AMD64=gssapi
+++ OS_GOFLAGS_TAGS_LINUX_AMD64=gssapi
+++ readonly OS_GOFLAGS_TAGS_LINUX_S390X=gssapi
+++ OS_GOFLAGS_TAGS_LINUX_S390X=gssapi
+++ readonly OS_GOFLAGS_TAGS_LINUX_ARM64=gssapi
+++ OS_GOFLAGS_TAGS_LINUX_ARM64=gssapi
+++ readonly OS_GOFLAGS_TAGS_LINUX_PPC64LE=gssapi
+++ OS_GOFLAGS_TAGS_LINUX_PPC64LE=gssapi
+++ readonly OS_OUTPUT_BASEPATH=_output
+++ OS_OUTPUT_BASEPATH=_output
+++ readonly OS_BASE_OUTPUT=/data/src/github.com/openshift/origin/_output
+++ OS_BASE_OUTPUT=/data/src/github.com/openshift/origin/_output
+++ readonly OS_OUTPUT_SCRIPTPATH=/data/src/github.com/openshift/origin/_output/scripts
+++ OS_OUTPUT_SCRIPTPATH=/data/src/github.com/openshift/origin/_output/scripts
+++ readonly OS_OUTPUT_SUBPATH=_output/local
+++ OS_OUTPUT_SUBPATH=_output/local
+++ readonly OS_OUTPUT=/data/src/github.com/openshift/origin/_output/local
+++ OS_OUTPUT=/data/src/github.com/openshift/origin/_output/local
+++ readonly OS_OUTPUT_RELEASEPATH=/data/src/github.com/openshift/origin/_output/local/releases
+++ OS_OUTPUT_RELEASEPATH=/data/src/github.com/openshift/origin/_output/local/releases
+++ readonly OS_OUTPUT_RPMPATH=/data/src/github.com/openshift/origin/_output/local/releases/rpms
+++ OS_OUTPUT_RPMPATH=/data/src/github.com/openshift/origin/_output/local/releases/rpms
+++ readonly OS_OUTPUT_BINPATH=/data/src/github.com/openshift/origin/_output/local/bin
+++ OS_OUTPUT_BINPATH=/data/src/github.com/openshift/origin/_output/local/bin
+++ readonly OS_OUTPUT_PKGDIR=/data/src/github.com/openshift/origin/_output/local/pkgdir
+++ OS_OUTPUT_PKGDIR=/data/src/github.com/openshift/origin/_output/local/pkgdir
+++ OS_SDN_COMPILE_TARGETS_LINUX=(cmd/sdn-cni-plugin vendor/github.com/containernetworking/plugins/plugins/ipam/host-local vendor/github.com/containernetworking/plugins/plugins/main/loopback)
+++ readonly OS_SDN_COMPILE_TARGETS_LINUX
+++ OS_IMAGE_COMPILE_TARGETS_LINUX=("${OS_SDN_COMPILE_TARGETS_LINUX[@]}")
+++ readonly OS_IMAGE_COMPILE_TARGETS_LINUX
+++ OS_SCRATCH_IMAGE_COMPILE_TARGETS_LINUX=(images/pod)
+++ readonly OS_SCRATCH_IMAGE_COMPILE_TARGETS_LINUX
+++ OS_IMAGE_COMPILE_BINARIES=("${OS_SCRATCH_IMAGE_COMPILE_TARGETS_LINUX[@]##*/}" "${OS_IMAGE_COMPILE_TARGETS_LINUX[@]##*/}")
+++ readonly OS_IMAGE_COMPILE_BINARIES
+++ OS_CROSS_COMPILE_TARGETS=(cmd/hypershift cmd/openshift cmd/oc cmd/oadm cmd/template-service-broker cmd/openshift-node-config vendor/k8s.io/kubernetes/cmd/hyperkube)
+++ readonly OS_CROSS_COMPILE_TARGETS
+++ OS_CROSS_COMPILE_BINARIES=("${OS_CROSS_COMPILE_TARGETS[@]##*/}")
+++ readonly OS_CROSS_COMPILE_BINARIES
+++ OS_TEST_TARGETS=(test/extended/extended.test)
+++ readonly OS_TEST_TARGETS
+++ OS_GOVET_BLACKLIST=()
+++ readonly OS_GOVET_BLACKLIST
+++ OPENSHIFT_BINARY_SYMLINKS=()
+++ readonly OPENSHIFT_BINARY_SYMLINKS
+++ OC_BINARY_SYMLINKS=(openshift-deploy openshift-sti-build openshift-docker-build openshift-git-clone openshift-manage-dockerfile openshift-extract-image-content openshift-router openshift-recycle)
+++ readonly OC_BINARY_SYMLINKS
+++ OC_BINARY_COPY=(kubectl)
+++ readonly OC_BINARY_COPY
+++ OS_BINARY_RELEASE_CLIENT_WINDOWS=(oc.exe kubectl.exe README.md ./LICENSE)
+++ readonly OS_BINARY_RELEASE_CLIENT_WINDOWS
+++ OS_BINARY_RELEASE_CLIENT_MAC=(oc kubectl README.md ./LICENSE)
+++ readonly OS_BINARY_RELEASE_CLIENT_MAC
+++ OS_BINARY_RELEASE_CLIENT_LINUX=(./oc ./kubectl ./README.md ./LICENSE)
+++ readonly OS_BINARY_RELEASE_CLIENT_LINUX
+++ OS_BINARY_RELEASE_SERVER_LINUX=('./*')
+++ readonly OS_BINARY_RELEASE_SERVER_LINUX
+++ OS_BINARY_RELEASE_CLIENT_EXTRA=(${OS_ROOT}/README.md ${OS_ROOT}/LICENSE)
+++ readonly OS_BINARY_RELEASE_CLIENT_EXTRA
+++ readonly -f os::build::ldflags
+++ readonly -f os::util::list_go_src_files
+++ readonly -f os::util::list_go_src_dirs
+++ readonly -f os::util::list_test_packages_under
+++ readonly -f os::build::generate_windows_versioninfo
+++ readonly -f os::build::clean_windows_versioninfo
+++ OS_ALL_IMAGES=(origin-pod origin-base origin-cli origin-hypershift origin-hyperkube origin-control-plane origin-node origin-deployer origin-docker-builder origin-keepalived-ipfailover origin-haproxy-router origin-f5-router origin-egress-router origin-egress-http-proxy origin-egress-dns-proxy origin-recycler origin-template-service-broker origin-tests)
+++ readonly OS_ALL_IMAGES
+++ readonly -f os::build::images
++ for library_file in '$( find "${OS_ROOT}/hack/lib" -type f -name '\''*.sh'\'' -not -path '\''*/hack/lib/init.sh'\'' )'
++ source /data/src/github.com/openshift/origin/hack/lib/start.sh
+++ readonly -f os::start::configure_server
+++ readonly -f os::start::internal::create_master_certs
+++ readonly -f os::start::internal::configure_node
+++ readonly -f os::start::internal::configure_master
+++ readonly -f os::start::internal::patch_master_config
+++ readonly -f os::start::server
+++ readonly -f os::start::master
+++ readonly -f os::start::all_in_one
+++ readonly -f os::start::etcd
+++ readonly -f os::start::api_server
+++ readonly -f os::start::controllers
+++ readonly -f os::start::internal::start_node
+++ readonly -f os::start::internal::openshift_executable
+++ readonly -f os::start::internal::determine_hostnames
+++ readonly -f os::start::router
+++ readonly -f os::start::registry
++ unset library_files library_file init_source
++ os::log::stacktrace::install
++ set -o errtrace
++ export OS_USE_STACKTRACE=true
++ OS_USE_STACKTRACE=true
++ os::util::trap::init_err
++ trap -p ERR
++ grep -q os::util::trap::err_handler
++ trap 'os::util::trap::err_handler;' ERR
++ os::util::environment::update_path_var
++ local prefix
++ os::util::find::system_binary go
+++ os::build::host_platform
++++ go env GOHOSTOS
++++ go env GOHOSTARCH
+++ echo linux/amd64
++ prefix+=/data/src/github.com/openshift/origin/_output/local/bin/linux/amd64:
++ [[ -n /data ]]
++ prefix+=/data/bin:
++ PATH=/data/src/github.com/openshift/origin/_output/local/bin/linux/amd64:/data/bin:/usr/local/bin:/usr/bin:/usr/local/sbin:/usr/sbin:/home/origin/.local/bin:/home/origin/bin
++ export PATH
++ [[ -z '' ]]
+++ basename /tmp/tmp.ddNEk4yHui .sh
++ os::util::environment::setup_tmpdir_vars tmp.ddNEk4yHui
++ local sub_dir=tmp.ddNEk4yHui
++ BASETMPDIR=/tmp/openshift/tmp.ddNEk4yHui
++ export BASETMPDIR
++ VOLUME_DIR=/tmp/openshift/tmp.ddNEk4yHui/volumes
++ export VOLUME_DIR
++ BASEOUTDIR=/data/src/github.com/openshift/origin/_output/scripts/tmp.ddNEk4yHui
++ export BASEOUTDIR
++ LOG_DIR=/data/src/github.com/openshift/origin/_output/scripts/tmp.ddNEk4yHui/logs
++ export LOG_DIR
++ ARTIFACT_DIR=/data/src/github.com/openshift/origin/_output/scripts/tmp.ddNEk4yHui/artifacts
++ export ARTIFACT_DIR
++ FAKE_HOME_DIR=/data/src/github.com/openshift/origin/_output/scripts/tmp.ddNEk4yHui/openshift.local.home
++ export FAKE_HOME_DIR
++ mkdir -p /data/src/github.com/openshift/origin/_output/scripts/tmp.ddNEk4yHui/logs /tmp/openshift/tmp.ddNEk4yHui/volumes /data/src/github.com/openshift/origin/_output/scripts/tmp.ddNEk4yHui/artifacts /data/src/github.com/openshift/origin/_output/scripts/tmp.ddNEk4yHui/openshift.local.home
++ export OS_TMP_ENV_SET=tmp.ddNEk4yHui
++ OS_TMP_ENV_SET=tmp.ddNEk4yHui
++ [[ -n '' ]]
+ os::build::rpm::get_nvra_vars
++ uname -i
+ OS_RPM_ARCHITECTURE=x86_64
+ os::build::version::get_vars
+ [[ -n '' ]]
+ os::build::version::git_vars
+ [[ -n '' ]]
+ os::build::version::kubernetes_vars
++ go run /data/src/github.com/openshift/origin/tools/godepversion/godepversion.go /data/src/github.com/openshift/origin/Godeps/Godeps.json k8s.io/kubernetes/pkg/api comment
+ KUBE_GIT_VERSION=v1.11.0-62-gd4cacc0
++ go run /data/src/github.com/openshift/origin/tools/godepversion/godepversion.go /data/src/github.com/openshift/origin/Godeps/Godeps.json k8s.io/kubernetes/pkg/api
+ KUBE_GIT_COMMIT=d4cacc0
++ echo v1.11.0-62-gd4cacc0
++ sed 's/-\([0-9]\{1,\}\)-g\([0-9a-f]\{7,40\}\)$/\+\2/'
+ KUBE_GIT_VERSION=v1.11.0+d4cacc0
+ [[ v1.11.0+d4cacc0 =~ ^v([0-9]+)\.([0-9]+)\. ]]
+ KUBE_GIT_MAJOR=1
+ KUBE_GIT_MINOR=11+
+ os::build::version::etcd_vars
++ go run /data/src/github.com/openshift/origin/tools/godepversion/godepversion.go /data/src/github.com/openshift/origin/Godeps/Godeps.json github.com/coreos/etcd/etcdserver comment
+ ETCD_GIT_VERSION=v3.2.16-0-g121edf0
++ go run /data/src/github.com/openshift/origin/tools/godepversion/godepversion.go /data/src/github.com/openshift/origin/Godeps/Godeps.json github.com/coreos/etcd/etcdserver
+ ETCD_GIT_COMMIT=121edf0
+ git=(git --work-tree "${OS_ROOT}")
+ local git
+ [[ -n '' ]]
++ git --work-tree /data/src/github.com/openshift/origin rev-parse --short 'HEAD^{commit}'
+ OS_GIT_COMMIT=9cb9d16
+ [[ -z '' ]]
++ git --work-tree /data/src/github.com/openshift/origin status --porcelain
+ git_status=
+ [[ -z '' ]]
+ OS_GIT_TREE_STATE=clean
+ [[ -n '' ]]
++ git --work-tree /data/src/github.com/openshift/origin describe --long --tags --abbrev=7 --match 'v[0-9]*' '9cb9d16^{commit}'
+ OS_GIT_VERSION=v3.11.0-522-g9cb9d16
+ [[ v3.11.0-522-g9cb9d16 =~ ^v([0-9]+)\.([0-9]+)\.([0-9]+)(\.[0-9]+)*([-].*)?$ ]]
+ OS_GIT_MAJOR=3
+ OS_GIT_MINOR=11
+ OS_GIT_PATCH=0
+ [[ -n -522-g9cb9d16 ]]
+ OS_GIT_MINOR+=+
++ echo v3.11.0-522-g9cb9d16
++ sed 's/-\([0-9]\{1,\}\)-g\([0-9a-f]\{7,40\}\)$/\+\2-\1/'
+ OS_GIT_VERSION=v3.11.0+9cb9d16-522
++ echo v3.11.0+9cb9d16-522
++ sed 's/-0$//'
+ OS_GIT_VERSION=v3.11.0+9cb9d16-522
+ [[ clean == \d\i\r\t\y ]]
+ [[ v3.11.0+9cb9d16-522 =~ ^v([0-9](\.[0-9]+)*)(.*) ]]
+ OS_RPM_VERSION=3.11.0
+ metadata=+9cb9d16-522
+ [[ + == \+ ]]
+ [[ +9cb9d16-522 =~ ^\+([a-z0-9]{7,40})(-([0-9]+))?(-dirty)?$ ]]
+ build_sha=9cb9d16
+ build_num=522
+ OS_RPM_RELEASE=1.522.9cb9d16
++ os::build::version::save_vars
++ cat
++ tr '\n' ' '
+ OS_RPM_GIT_VARS='OS_GIT_COMMIT='\''9cb9d16'\'' OS_GIT_TREE_STATE='\''clean'\'' OS_GIT_VERSION='\''v3.11.0+9cb9d16-522'\'' OS_GIT_MAJOR='\''3'\'' OS_GIT_MINOR='\''11+'\'' OS_GIT_PATCH='\''0'\'' KUBE_GIT_MAJOR='\''1'\'' KUBE_GIT_MINOR='\''11+'\'' KUBE_GIT_COMMIT='\''d4cacc0'\'' KUBE_GIT_VERSION='\''v1.11.0+d4cacc0'\'' ETCD_GIT_VERSION='\''v3.2.16-0-g121edf0'\'' ETCD_GIT_COMMIT='\''121edf0'\'' '
+ export OS_RPM_VERSION OS_RPM_RELEASE OS_RPM_ARCHITECTURE OS_RPM_GIT_VARS
+ echo 3.11+
+ sed s/+//
+ set +o xtrace
########## FINISHED STAGE: SUCCESS: DETERMINE THE RELEASE COMMIT FOR ORIGIN IMAGES AND VERSION FOR RPMS [00h 00m 09s] ##########
[workspace] $ /bin/bash /tmp/jenkins2214128569306106903.sh
########## STARTING STAGE: BUILD THE IMAGE REGISTRY CONTAINER IMAGE ##########
+ [[ -s /var/lib/jenkins/jobs/test_branch_origin_extended_conformance_install_in_tree/workspace/activate ]]
+ source /var/lib/jenkins/jobs/test_branch_origin_extended_conformance_install_in_tree/workspace/activate
++ export VIRTUAL_ENV=/var/lib/jenkins/origin-ci-tool/95a472392910104fc805c4ab8af39791105c956d
++ VIRTUAL_ENV=/var/lib/jenkins/origin-ci-tool/95a472392910104fc805c4ab8af39791105c956d
++ export PATH=/var/lib/jenkins/origin-ci-tool/95a472392910104fc805c4ab8af39791105c956d/bin:/sbin:/usr/sbin:/bin:/usr/bin
++ PATH=/var/lib/jenkins/origin-ci-tool/95a472392910104fc805c4ab8af39791105c956d/bin:/sbin:/usr/sbin:/bin:/usr/bin
++ unset PYTHON_HOME
++ export OCT_CONFIG_HOME=/var/lib/jenkins/jobs/test_branch_origin_extended_conformance_install_in_tree/workspace/.config
++ OCT_CONFIG_HOME=/var/lib/jenkins/jobs/test_branch_origin_extended_conformance_install_in_tree/workspace/.config
++ mktemp
+ script=/tmp/tmp.sWlhxPWSYB
+ cat
+ chmod +x /tmp/tmp.sWlhxPWSYB
+ scp -F /var/lib/jenkins/jobs/test_branch_origin_extended_conformance_install_in_tree/workspace/.config/origin-ci-tool/inventory/.ssh_config /tmp/tmp.sWlhxPWSYB openshiftdevel:/tmp/tmp.sWlhxPWSYB
+ ssh -F /var/lib/jenkins/jobs/test_branch_origin_extended_conformance_install_in_tree/workspace/.config/origin-ci-tool/inventory/.ssh_config -t openshiftdevel 'bash -l -c "timeout 3600 /tmp/tmp.sWlhxPWSYB"'
+ cd /data/src/github.com/openshift/image-registry
+ [[ release-3.11 == \m\a\s\t\e\r ]]
+ [[ release-3.11 == \r\e\l\e\a\s\e\-\3\.\7 ]]
+ [[ release-3.11 == \r\e\l\e\a\s\e\-\3\.\8 ]]
+ [[ release-3.11 == \r\e\l\e\a\s\e\-\3\.\9 ]]
+ set +o xtrace
########## FINISHED STAGE: SUCCESS: BUILD THE IMAGE REGISTRY CONTAINER IMAGE [00h 00m 01s] ##########
[workspace] $ /bin/bash /tmp/jenkins2277414493588279563.sh
########## STARTING STAGE: BUILD THE KUBERNETES METRICS SERVER CONTAINER IMAGE ##########
+ [[ -s /var/lib/jenkins/jobs/test_branch_origin_extended_conformance_install_in_tree/workspace/activate ]]
+ source /var/lib/jenkins/jobs/test_branch_origin_extended_conformance_install_in_tree/workspace/activate
++ export VIRTUAL_ENV=/var/lib/jenkins/origin-ci-tool/95a472392910104fc805c4ab8af39791105c956d
++ VIRTUAL_ENV=/var/lib/jenkins/origin-ci-tool/95a472392910104fc805c4ab8af39791105c956d
++ export PATH=/var/lib/jenkins/origin-ci-tool/95a472392910104fc805c4ab8af39791105c956d/bin:/sbin:/usr/sbin:/bin:/usr/bin
++ PATH=/var/lib/jenkins/origin-ci-tool/95a472392910104fc805c4ab8af39791105c956d/bin:/sbin:/usr/sbin:/bin:/usr/bin
++ unset PYTHON_HOME
++ export OCT_CONFIG_HOME=/var/lib/jenkins/jobs/test_branch_origin_extended_conformance_install_in_tree/workspace/.config
++ OCT_CONFIG_HOME=/var/lib/jenkins/jobs/test_branch_origin_extended_conformance_install_in_tree/workspace/.config
++ mktemp
+ script=/tmp/tmp.Rdp83FSvl6
+ cat
+ chmod +x /tmp/tmp.Rdp83FSvl6
+ scp -F /var/lib/jenkins/jobs/test_branch_origin_extended_conformance_install_in_tree/workspace/.config/origin-ci-tool/inventory/.ssh_config /tmp/tmp.Rdp83FSvl6 openshiftdevel:/tmp/tmp.Rdp83FSvl6
+ ssh -F /var/lib/jenkins/jobs/test_branch_origin_extended_conformance_install_in_tree/workspace/.config/origin-ci-tool/inventory/.ssh_config -t openshiftdevel 'bash -l -c "timeout 3600 /tmp/tmp.Rdp83FSvl6"'
+ cd /data/src/github.com/openshift/kubernetes-metrics-server
+ [[ release-3.11 == \m\a\s\t\e\r ]]
+ [[ release-3.11 == \r\e\l\e\a\s\e\-\3\.\9 ]]
+ set +o xtrace
########## FINISHED STAGE: SUCCESS: BUILD THE KUBERNETES METRICS SERVER CONTAINER IMAGE [00h 00m 01s] ##########
[workspace] $ /bin/bash /tmp/jenkins6377386627316886716.sh
########## STARTING STAGE: INSTALL ORIGIN ##########
+ [[ -s /var/lib/jenkins/jobs/test_branch_origin_extended_conformance_install_in_tree/workspace/activate ]]
+ source /var/lib/jenkins/jobs/test_branch_origin_extended_conformance_install_in_tree/workspace/activate
++ export VIRTUAL_ENV=/var/lib/jenkins/origin-ci-tool/95a472392910104fc805c4ab8af39791105c956d
++ VIRTUAL_ENV=/var/lib/jenkins/origin-ci-tool/95a472392910104fc805c4ab8af39791105c956d
++ export PATH=/var/lib/jenkins/origin-ci-tool/95a472392910104fc805c4ab8af39791105c956d/bin:/sbin:/usr/sbin:/bin:/usr/bin
++ PATH=/var/lib/jenkins/origin-ci-tool/95a472392910104fc805c4ab8af39791105c956d/bin:/sbin:/usr/sbin:/bin:/usr/bin
++ unset PYTHON_HOME
++ export OCT_CONFIG_HOME=/var/lib/jenkins/jobs/test_branch_origin_extended_conformance_install_in_tree/workspace/.config
++ OCT_CONFIG_HOME=/var/lib/jenkins/jobs/test_branch_origin_extended_conformance_install_in_tree/workspace/.config
++ mktemp
+ script=/tmp/tmp.dGoNm2Qxuo
+ cat
+ chmod +x /tmp/tmp.dGoNm2Qxuo
+ scp -F /var/lib/jenkins/jobs/test_branch_origin_extended_conformance_install_in_tree/workspace/.config/origin-ci-tool/inventory/.ssh_config /tmp/tmp.dGoNm2Qxuo openshiftdevel:/tmp/tmp.dGoNm2Qxuo
+ ssh -F /var/lib/jenkins/jobs/test_branch_origin_extended_conformance_install_in_tree/workspace/.config/origin-ci-tool/inventory/.ssh_config -t openshiftdevel 'bash -l -c "timeout 14400 /tmp/tmp.dGoNm2Qxuo"'
+ cd /data/src/github.com/openshift/openshift-ansible
++ pwd
+ ansible_repo=/data/src/github.com/openshift/openshift-ansible
+ jobs_repo=/data/src/github.com/openshift/aos-cd-jobs/
+ cd /data/src/github.com/openshift/aos-cd-jobs/
++ cat ./ORIGIN_PKG_VERSION
+ export ORIGIN_PKG_VERSION=-3.11.0-1.522.9cb9d16
+ ORIGIN_PKG_VERSION=-3.11.0-1.522.9cb9d16
++ cat ./ORIGIN_RELEASE
+ export ORIGIN_RELEASE=3.11
+ ORIGIN_RELEASE=3.11
++ cat ./ORIGIN_COMMIT
+ export ORIGIN_COMMIT=9cb9d16
+ ORIGIN_COMMIT=9cb9d16
+ sh /data/src/github.com/openshift/openshift-ansible/test/ci/install.sh /usr/share/ansible/openshift-ansible/playbooks /data/src/github.com/openshift/openshift-ansible/test/ci/inventory/local.txt /data/src/github.com/openshift/openshift-ansible/test/ci/extra_vars/default.yml
sh: /data/src/github.com/openshift/openshift-ansible/test/ci/install.sh: No such file or directory
++ export status=FAILURE
++ status=FAILURE
+ set +o xtrace
########## FINISHED STAGE: FAILURE: INSTALL ORIGIN [00h 00m 01s] ##########
Build step 'Execute shell' marked build as failure
[PostBuildScript] - [INFO] Executing post build scripts.
[workspace] $ /bin/bash /tmp/jenkins6372194071484293936.sh
########## STARTING STAGE: DOWNLOAD ARTIFACTS FROM THE REMOTE HOST ##########
+ [[ -s /var/lib/jenkins/jobs/test_branch_origin_extended_conformance_install_in_tree/workspace/activate ]]
+ source /var/lib/jenkins/jobs/test_branch_origin_extended_conformance_install_in_tree/workspace/activate
++ export VIRTUAL_ENV=/var/lib/jenkins/origin-ci-tool/95a472392910104fc805c4ab8af39791105c956d
++ VIRTUAL_ENV=/var/lib/jenkins/origin-ci-tool/95a472392910104fc805c4ab8af39791105c956d
++ export PATH=/var/lib/jenkins/origin-ci-tool/95a472392910104fc805c4ab8af39791105c956d/bin:/sbin:/usr/sbin:/bin:/usr/bin
++ PATH=/var/lib/jenkins/origin-ci-tool/95a472392910104fc805c4ab8af39791105c956d/bin:/sbin:/usr/sbin:/bin:/usr/bin
++ unset PYTHON_HOME
++ export OCT_CONFIG_HOME=/var/lib/jenkins/jobs/test_branch_origin_extended_conformance_install_in_tree/workspace/.config
++ OCT_CONFIG_HOME=/var/lib/jenkins/jobs/test_branch_origin_extended_conformance_install_in_tree/workspace/.config
+ trap 'exit 0' EXIT
++ pwd
+ ARTIFACT_DIR=/var/lib/jenkins/jobs/test_branch_origin_extended_conformance_install_in_tree/workspace/artifacts/gathered
+ rm -rf /var/lib/jenkins/jobs/test_branch_origin_extended_conformance_install_in_tree/workspace/artifacts/gathered
+ mkdir -p /var/lib/jenkins/jobs/test_branch_origin_extended_conformance_install_in_tree/workspace/artifacts/gathered
+ ssh -F /var/lib/jenkins/jobs/test_branch_origin_extended_conformance_install_in_tree/workspace/.config/origin-ci-tool/inventory/.ssh_config openshiftdevel sudo stat /data/src/github.com/openshift/origin/_output/scripts
  File: ‘/data/src/github.com/openshift/origin/_output/scripts’
  Size: 84        	Blocks: 0          IO Block: 4096   directory
Device: ca02h/51714d	Inode: 117471411   Links: 6
Access: (2755/drwxr-sr-x)  Uid: ( 1001/  origin)   Gid: ( 1003/origin-git)
Context: unconfined_u:object_r:container_file_t:s0
Access: 2022-01-22 19:32:08.989284997 +0000
Modify: 2022-01-22 20:02:04.986563520 +0000
Change: 2022-01-22 20:02:04.986563520 +0000
 Birth: -
+ ssh -F /var/lib/jenkins/jobs/test_branch_origin_extended_conformance_install_in_tree/workspace/.config/origin-ci-tool/inventory/.ssh_config openshiftdevel sudo chmod -R o+rX /data/src/github.com/openshift/origin/_output/scripts
+ scp -r -F /var/lib/jenkins/jobs/test_branch_origin_extended_conformance_install_in_tree/workspace/.config/origin-ci-tool/inventory/.ssh_config openshiftdevel:/data/src/github.com/openshift/origin/_output/scripts /var/lib/jenkins/jobs/test_branch_origin_extended_conformance_install_in_tree/workspace/artifacts/gathered
+ tree /var/lib/jenkins/jobs/test_branch_origin_extended_conformance_install_in_tree/workspace/artifacts/gathered
/var/lib/jenkins/jobs/test_branch_origin_extended_conformance_install_in_tree/workspace/artifacts/gathered
└── scripts
    ├── build-base-images
    │   ├── artifacts
    │   ├── logs
    │   └── openshift.local.home
    ├── build-images
    │   ├── artifacts
    │   ├── logs
    │   │   └── scripts.log
    │   └── openshift.local.home
    ├── env
    │   ├── artifacts
    │   ├── logs
    │   │   └── scripts.log
    │   └── openshift.local.home
    └── tmp.ddNEk4yHui
        ├── artifacts
        ├── logs
        └── openshift.local.home

17 directories, 2 files
+ exit 0
[workspace] $ /bin/bash /tmp/jenkins8020768421328640803.sh
########## STARTING STAGE: GENERATE ARTIFACTS FROM THE REMOTE HOST ##########
+ [[ -s /var/lib/jenkins/jobs/test_branch_origin_extended_conformance_install_in_tree/workspace/activate ]]
+ source /var/lib/jenkins/jobs/test_branch_origin_extended_conformance_install_in_tree/workspace/activate
++ export VIRTUAL_ENV=/var/lib/jenkins/origin-ci-tool/95a472392910104fc805c4ab8af39791105c956d
++ VIRTUAL_ENV=/var/lib/jenkins/origin-ci-tool/95a472392910104fc805c4ab8af39791105c956d
++ export PATH=/var/lib/jenkins/origin-ci-tool/95a472392910104fc805c4ab8af39791105c956d/bin:/sbin:/usr/sbin:/bin:/usr/bin
++ PATH=/var/lib/jenkins/origin-ci-tool/95a472392910104fc805c4ab8af39791105c956d/bin:/sbin:/usr/sbin:/bin:/usr/bin
++ unset PYTHON_HOME
++ export OCT_CONFIG_HOME=/var/lib/jenkins/jobs/test_branch_origin_extended_conformance_install_in_tree/workspace/.config
++ OCT_CONFIG_HOME=/var/lib/jenkins/jobs/test_branch_origin_extended_conformance_install_in_tree/workspace/.config
+ trap 'exit 0' EXIT
++ pwd
+ ARTIFACT_DIR=/var/lib/jenkins/jobs/test_branch_origin_extended_conformance_install_in_tree/workspace/artifacts/generated
+ rm -rf /var/lib/jenkins/jobs/test_branch_origin_extended_conformance_install_in_tree/workspace/artifacts/generated
+ mkdir /var/lib/jenkins/jobs/test_branch_origin_extended_conformance_install_in_tree/workspace/artifacts/generated
+ ssh -F /var/lib/jenkins/jobs/test_branch_origin_extended_conformance_install_in_tree/workspace/.config/origin-ci-tool/inventory/.ssh_config openshiftdevel 'sudo docker version && sudo docker info && sudo docker images && sudo docker ps -a 2>&1'
  WARNING: You're not using the default seccomp profile
+ ssh -F /var/lib/jenkins/jobs/test_branch_origin_extended_conformance_install_in_tree/workspace/.config/origin-ci-tool/inventory/.ssh_config openshiftdevel 'sudo cat /etc/etcd/etcd.conf 2>&1'
+ true
+ ssh -F /var/lib/jenkins/jobs/test_branch_origin_extended_conformance_install_in_tree/workspace/.config/origin-ci-tool/inventory/.ssh_config openshiftdevel 'sudo cat /etc/sysconfig/docker /etc/sysconfig/docker-network /etc/sysconfig/docker-storage /etc/sysconfig/docker-storage-setup /etc/systemd/system/docker.service 2>&1'
+ true
+ ssh -F /var/lib/jenkins/jobs/test_branch_origin_extended_conformance_install_in_tree/workspace/.config/origin-ci-tool/inventory/.ssh_config openshiftdevel 'sudo find /var/lib/docker/containers -name *.log | sudo xargs tail -vn +1 2>&1'
+ ssh -F /var/lib/jenkins/jobs/test_branch_origin_extended_conformance_install_in_tree/workspace/.config/origin-ci-tool/inventory/.ssh_config openshiftdevel 'oc get --raw /metrics --server=https://$( uname --nodename ):10250 --config=/etc/origin/master/admin.kubeconfig 2>&1'
+ true
+ ssh -F /var/lib/jenkins/jobs/test_branch_origin_extended_conformance_install_in_tree/workspace/.config/origin-ci-tool/inventory/.ssh_config openshiftdevel 'sudo ausearch -m AVC -m SELINUX_ERR -m USER_AVC 2>&1'
+ true
+ ssh -F /var/lib/jenkins/jobs/test_branch_origin_extended_conformance_install_in_tree/workspace/.config/origin-ci-tool/inventory/.ssh_config openshiftdevel 'oc get --raw /metrics --config=/etc/origin/master/admin.kubeconfig 2>&1'
+ true
+ ssh -F /var/lib/jenkins/jobs/test_branch_origin_extended_conformance_install_in_tree/workspace/.config/origin-ci-tool/inventory/.ssh_config openshiftdevel 'sudo df -T -h && sudo pvs && sudo vgs && sudo lvs && sudo findmnt --all 2>&1'
+ ssh -F /var/lib/jenkins/jobs/test_branch_origin_extended_conformance_install_in_tree/workspace/.config/origin-ci-tool/inventory/.ssh_config openshiftdevel 'sudo yum list installed 2>&1'
+ ssh -F /var/lib/jenkins/jobs/test_branch_origin_extended_conformance_install_in_tree/workspace/.config/origin-ci-tool/inventory/.ssh_config openshiftdevel 'sudo journalctl --dmesg --no-pager --all --lines=all 2>&1'
+ ssh -F /var/lib/jenkins/jobs/test_branch_origin_extended_conformance_install_in_tree/workspace/.config/origin-ci-tool/inventory/.ssh_config openshiftdevel 'sudo journalctl _PID=1 --no-pager --all --lines=all 2>&1'
+ tree /var/lib/jenkins/jobs/test_branch_origin_extended_conformance_install_in_tree/workspace/artifacts/generated
/var/lib/jenkins/jobs/test_branch_origin_extended_conformance_install_in_tree/workspace/artifacts/generated
├── avc_denials.log
├── containers.log
├── dmesg.log
├── docker.config
├── docker.info
├── etcd.conf
├── filesystem.info
├── installed_packages.log
├── master-metrics.log
├── node-metrics.log
└── pid1.journal

0 directories, 11 files
+ exit 0
[workspace] $ /bin/bash /tmp/jenkins3316338907420985885.sh
########## STARTING STAGE: FETCH SYSTEMD JOURNALS FROM THE REMOTE HOST ##########
+ [[ -s /var/lib/jenkins/jobs/test_branch_origin_extended_conformance_install_in_tree/workspace/activate ]]
+ source /var/lib/jenkins/jobs/test_branch_origin_extended_conformance_install_in_tree/workspace/activate
++ export VIRTUAL_ENV=/var/lib/jenkins/origin-ci-tool/95a472392910104fc805c4ab8af39791105c956d
++ VIRTUAL_ENV=/var/lib/jenkins/origin-ci-tool/95a472392910104fc805c4ab8af39791105c956d
++ export PATH=/var/lib/jenkins/origin-ci-tool/95a472392910104fc805c4ab8af39791105c956d/bin:/sbin:/usr/sbin:/bin:/usr/bin
++ PATH=/var/lib/jenkins/origin-ci-tool/95a472392910104fc805c4ab8af39791105c956d/bin:/sbin:/usr/sbin:/bin:/usr/bin
++ unset PYTHON_HOME
++ export OCT_CONFIG_HOME=/var/lib/jenkins/jobs/test_branch_origin_extended_conformance_install_in_tree/workspace/.config
++ OCT_CONFIG_HOME=/var/lib/jenkins/jobs/test_branch_origin_extended_conformance_install_in_tree/workspace/.config
+ trap 'exit 0' EXIT
++ pwd
+ ARTIFACT_DIR=/var/lib/jenkins/jobs/test_branch_origin_extended_conformance_install_in_tree/workspace/artifacts/journals
+ rm -rf /var/lib/jenkins/jobs/test_branch_origin_extended_conformance_install_in_tree/workspace/artifacts/journals
+ mkdir /var/lib/jenkins/jobs/test_branch_origin_extended_conformance_install_in_tree/workspace/artifacts/journals
+ ssh -F /var/lib/jenkins/jobs/test_branch_origin_extended_conformance_install_in_tree/workspace/.config/origin-ci-tool/inventory/.ssh_config openshiftdevel sudo journalctl --unit docker.service --no-pager --all --lines=all
+ ssh -F /var/lib/jenkins/jobs/test_branch_origin_extended_conformance_install_in_tree/workspace/.config/origin-ci-tool/inventory/.ssh_config openshiftdevel sudo journalctl --unit dnsmasq.service --no-pager --all --lines=all
+ ssh -F /var/lib/jenkins/jobs/test_branch_origin_extended_conformance_install_in_tree/workspace/.config/origin-ci-tool/inventory/.ssh_config openshiftdevel sudo journalctl --unit systemd-journald.service --no-pager --all --lines=all
+ ssh -F /var/lib/jenkins/jobs/test_branch_origin_extended_conformance_install_in_tree/workspace/.config/origin-ci-tool/inventory/.ssh_config openshiftdevel sudo journalctl --unit origin-master.service --no-pager --all --lines=all
+ ssh -F /var/lib/jenkins/jobs/test_branch_origin_extended_conformance_install_in_tree/workspace/.config/origin-ci-tool/inventory/.ssh_config openshiftdevel sudo journalctl --unit origin-master-api.service --no-pager --all --lines=all
+ ssh -F /var/lib/jenkins/jobs/test_branch_origin_extended_conformance_install_in_tree/workspace/.config/origin-ci-tool/inventory/.ssh_config openshiftdevel sudo journalctl --unit origin-master-controllers.service --no-pager --all --lines=all
+ ssh -F /var/lib/jenkins/jobs/test_branch_origin_extended_conformance_install_in_tree/workspace/.config/origin-ci-tool/inventory/.ssh_config openshiftdevel sudo journalctl --unit origin-node.service --no-pager --all --lines=all
+ ssh -F /var/lib/jenkins/jobs/test_branch_origin_extended_conformance_install_in_tree/workspace/.config/origin-ci-tool/inventory/.ssh_config openshiftdevel sudo journalctl --unit openvswitch.service --no-pager --all --lines=all
+ ssh -F /var/lib/jenkins/jobs/test_branch_origin_extended_conformance_install_in_tree/workspace/.config/origin-ci-tool/inventory/.ssh_config openshiftdevel sudo journalctl --unit ovs-vswitchd.service --no-pager --all --lines=all
+ ssh -F /var/lib/jenkins/jobs/test_branch_origin_extended_conformance_install_in_tree/workspace/.config/origin-ci-tool/inventory/.ssh_config openshiftdevel sudo journalctl --unit ovsdb-server.service --no-pager --all --lines=all
+ ssh -F /var/lib/jenkins/jobs/test_branch_origin_extended_conformance_install_in_tree/workspace/.config/origin-ci-tool/inventory/.ssh_config openshiftdevel sudo journalctl --unit etcd.service --no-pager --all --lines=all
+ ssh -F /var/lib/jenkins/jobs/test_branch_origin_extended_conformance_install_in_tree/workspace/.config/origin-ci-tool/inventory/.ssh_config openshiftdevel sudo journalctl --unit systemd-journald.service --no-pager --all --lines=all
+ tree /var/lib/jenkins/jobs/test_branch_origin_extended_conformance_install_in_tree/workspace/artifacts/journals
/var/lib/jenkins/jobs/test_branch_origin_extended_conformance_install_in_tree/workspace/artifacts/journals
├── dnsmasq.service
├── docker.service
├── etcd.service
├── openvswitch.service
├── origin-master-api.service
├── origin-master-controllers.service
├── origin-master.service
├── origin-node.service
├── ovsdb-server.service
├── ovs-vswitchd.service
└── systemd-journald.service

0 directories, 11 files
+ exit 0
[workspace] $ /bin/bash /tmp/jenkins9129701246114690416.sh
########## STARTING STAGE: ASSEMBLE GCS OUTPUT ##########
+ [[ -s /var/lib/jenkins/jobs/test_branch_origin_extended_conformance_install_in_tree/workspace/activate ]]
+ source /var/lib/jenkins/jobs/test_branch_origin_extended_conformance_install_in_tree/workspace/activate
++ export VIRTUAL_ENV=/var/lib/jenkins/origin-ci-tool/95a472392910104fc805c4ab8af39791105c956d
++ VIRTUAL_ENV=/var/lib/jenkins/origin-ci-tool/95a472392910104fc805c4ab8af39791105c956d
++ export PATH=/var/lib/jenkins/origin-ci-tool/95a472392910104fc805c4ab8af39791105c956d/bin:/sbin:/usr/sbin:/bin:/usr/bin
++ PATH=/var/lib/jenkins/origin-ci-tool/95a472392910104fc805c4ab8af39791105c956d/bin:/sbin:/usr/sbin:/bin:/usr/bin
++ unset PYTHON_HOME
++ export OCT_CONFIG_HOME=/var/lib/jenkins/jobs/test_branch_origin_extended_conformance_install_in_tree/workspace/.config
++ OCT_CONFIG_HOME=/var/lib/jenkins/jobs/test_branch_origin_extended_conformance_install_in_tree/workspace/.config
+ trap 'exit 0' EXIT
+ mkdir -p gcs/artifacts gcs/artifacts/generated gcs/artifacts/journals gcs/artifacts/gathered
++ python -c 'import json; import urllib; print json.load(urllib.urlopen('\''https://ci.openshift.redhat.com/jenkins/job/test_branch_origin_extended_conformance_install_in_tree/2842/api/json'\''))['\''result'\'']'
+ result=FAILURE
+ cat
++ date +%s
+ cat /var/lib/jenkins/jobs/test_branch_origin_extended_conformance_install_in_tree/builds/2842/log
+ cp artifacts/generated/avc_denials.log artifacts/generated/containers.log artifacts/generated/dmesg.log artifacts/generated/docker.config artifacts/generated/docker.info artifacts/generated/etcd.conf artifacts/generated/filesystem.info artifacts/generated/installed_packages.log artifacts/generated/master-metrics.log artifacts/generated/node-metrics.log artifacts/generated/pid1.journal gcs/artifacts/generated/
+ cp artifacts/journals/dnsmasq.service artifacts/journals/docker.service artifacts/journals/etcd.service artifacts/journals/openvswitch.service artifacts/journals/origin-master-api.service artifacts/journals/origin-master-controllers.service artifacts/journals/origin-master.service artifacts/journals/origin-node.service artifacts/journals/ovsdb-server.service artifacts/journals/ovs-vswitchd.service artifacts/journals/systemd-journald.service gcs/artifacts/journals/
+ cp -r artifacts/gathered/scripts gcs/artifacts/
++ pwd
+ scp -F /var/lib/jenkins/jobs/test_branch_origin_extended_conformance_install_in_tree/workspace/.config/origin-ci-tool/inventory/.ssh_config -r /var/lib/jenkins/jobs/test_branch_origin_extended_conformance_install_in_tree/workspace/gcs openshiftdevel:/data
+ scp -F /var/lib/jenkins/jobs/test_branch_origin_extended_conformance_install_in_tree/workspace/.config/origin-ci-tool/inventory/.ssh_config /var/lib/jenkins/.config/gcloud/gcs-publisher-credentials.json openshiftdevel:/data/credentials.json
+ exit 0
[workspace] $ /bin/bash /tmp/jenkins5006817477911954634.sh
########## STARTING STAGE: PUSH THE ARTIFACTS AND METADATA ##########
+ [[ -s /var/lib/jenkins/jobs/test_branch_origin_extended_conformance_install_in_tree/workspace/activate ]]
+ source /var/lib/jenkins/jobs/test_branch_origin_extended_conformance_install_in_tree/workspace/activate
++ export VIRTUAL_ENV=/var/lib/jenkins/origin-ci-tool/95a472392910104fc805c4ab8af39791105c956d
++ VIRTUAL_ENV=/var/lib/jenkins/origin-ci-tool/95a472392910104fc805c4ab8af39791105c956d
++ export PATH=/var/lib/jenkins/origin-ci-tool/95a472392910104fc805c4ab8af39791105c956d/bin:/sbin:/usr/sbin:/bin:/usr/bin
++ PATH=/var/lib/jenkins/origin-ci-tool/95a472392910104fc805c4ab8af39791105c956d/bin:/sbin:/usr/sbin:/bin:/usr/bin
++ unset PYTHON_HOME
++ export OCT_CONFIG_HOME=/var/lib/jenkins/jobs/test_branch_origin_extended_conformance_install_in_tree/workspace/.config
++ OCT_CONFIG_HOME=/var/lib/jenkins/jobs/test_branch_origin_extended_conformance_install_in_tree/workspace/.config
++ mktemp
+ script=/tmp/tmp.m3Hbvvcisc
+ cat
+ chmod +x /tmp/tmp.m3Hbvvcisc
+ scp -F /var/lib/jenkins/jobs/test_branch_origin_extended_conformance_install_in_tree/workspace/.config/origin-ci-tool/inventory/.ssh_config /tmp/tmp.m3Hbvvcisc openshiftdevel:/tmp/tmp.m3Hbvvcisc
+ ssh -F /var/lib/jenkins/jobs/test_branch_origin_extended_conformance_install_in_tree/workspace/.config/origin-ci-tool/inventory/.ssh_config -t openshiftdevel 'bash -l -c "timeout 300 /tmp/tmp.m3Hbvvcisc"'
+ cd /home/origin
+ trap 'exit 0' EXIT
+ [[ -n {"type":"postsubmit","job":"test_branch_origin_extended_conformance_install_in_tree","buildid":"1484971019948003332","prowjobid":"496b9682-7bb9-11ec-af94-0a580a80183b","refs":{"org":"openshift","repo":"openshift-ansible","repo_link":"https://github.com/openshift/openshift-ansible","base_ref":"release-3.11","base_sha":"652997d70bb90958f09e02f391bddb2578fff57f","base_link":"https://github.com/openshift/openshift-ansible/compare/a69267d1d0ed...652997d70bb9"}} ]]
++ jq --compact-output '.buildid |= "2842"'
+ JOB_SPEC='{"type":"postsubmit","job":"test_branch_origin_extended_conformance_install_in_tree","buildid":"2842","prowjobid":"496b9682-7bb9-11ec-af94-0a580a80183b","refs":{"org":"openshift","repo":"openshift-ansible","repo_link":"https://github.com/openshift/openshift-ansible","base_ref":"release-3.11","base_sha":"652997d70bb90958f09e02f391bddb2578fff57f","base_link":"https://github.com/openshift/openshift-ansible/compare/a69267d1d0ed...652997d70bb9"}}'
+ docker run -e 'JOB_SPEC={"type":"postsubmit","job":"test_branch_origin_extended_conformance_install_in_tree","buildid":"2842","prowjobid":"496b9682-7bb9-11ec-af94-0a580a80183b","refs":{"org":"openshift","repo":"openshift-ansible","repo_link":"https://github.com/openshift/openshift-ansible","base_ref":"release-3.11","base_sha":"652997d70bb90958f09e02f391bddb2578fff57f","base_link":"https://github.com/openshift/openshift-ansible/compare/a69267d1d0ed...652997d70bb9"}}' -v /data:/data:z registry.ci.openshift.org/ci/gcsupload:latest --dry-run=false --gcs-path=gs://origin-ci-test --gcs-credentials-file=/data/credentials.json --path-strategy=single --default-org=openshift --default-repo=origin /data/gcs/artifacts /data/gcs/build-log.txt /data/gcs/finished.json
Unable to find image 'registry.ci.openshift.org/ci/gcsupload:latest' locally
Trying to pull repository registry.ci.openshift.org/ci/gcsupload ... 
latest: Pulling from registry.ci.openshift.org/ci/gcsupload
df20fa9351a1: Already exists
809b39f1848e: Already exists
561a2d1d09ef: Pulling fs layer
85cea451eec0: Pulling fs layer
85cea451eec0: Verifying Checksum
85cea451eec0: Download complete
561a2d1d09ef: Verifying Checksum
561a2d1d09ef: Download complete
561a2d1d09ef: Pull complete
85cea451eec0: Pull complete
Digest: sha256:89bd22349cdec848f54b0b81b4cab90fd46ee83358c3fc935add6722a8235d09
Status: Downloaded newer image for registry.ci.openshift.org/ci/gcsupload:latest
{"component":"gcsupload","file":"prow/gcsupload/run.go:194","func":"k8s.io/test-infra/prow/gcsupload.gatherArtifacts","level":"info","msg":"Gathering artifacts from artifact directory: /data/gcs/artifacts","severity":"info","time":"2022-01-22T20:02:37Z"}
{"component":"gcsupload","file":"prow/gcsupload/run.go:212","func":"k8s.io/test-infra/prow/gcsupload.gatherArtifacts.func1","level":"info","msg":"Found /data/gcs/artifacts/generated/avc_denials.log in artifact directory. Uploading as logs/test_branch_origin_extended_conformance_install_in_tree/2842/artifacts/generated/avc_denials.log\n","severity":"info","time":"2022-01-22T20:02:37Z"}
{"component":"gcsupload","file":"prow/gcsupload/run.go:212","func":"k8s.io/test-infra/prow/gcsupload.gatherArtifacts.func1","level":"info","msg":"Found /data/gcs/artifacts/generated/containers.log in artifact directory. Uploading as logs/test_branch_origin_extended_conformance_install_in_tree/2842/artifacts/generated/containers.log\n","severity":"info","time":"2022-01-22T20:02:37Z"}
{"component":"gcsupload","file":"prow/gcsupload/run.go:212","func":"k8s.io/test-infra/prow/gcsupload.gatherArtifacts.func1","level":"info","msg":"Found /data/gcs/artifacts/generated/dmesg.log in artifact directory. Uploading as logs/test_branch_origin_extended_conformance_install_in_tree/2842/artifacts/generated/dmesg.log\n","severity":"info","time":"2022-01-22T20:02:37Z"}
{"component":"gcsupload","file":"prow/gcsupload/run.go:212","func":"k8s.io/test-infra/prow/gcsupload.gatherArtifacts.func1","level":"info","msg":"Found /data/gcs/artifacts/generated/docker.config in artifact directory. Uploading as logs/test_branch_origin_extended_conformance_install_in_tree/2842/artifacts/generated/docker.config\n","severity":"info","time":"2022-01-22T20:02:37Z"}
{"component":"gcsupload","file":"prow/gcsupload/run.go:212","func":"k8s.io/test-infra/prow/gcsupload.gatherArtifacts.func1","level":"info","msg":"Found /data/gcs/artifacts/generated/docker.info in artifact directory. Uploading as logs/test_branch_origin_extended_conformance_install_in_tree/2842/artifacts/generated/docker.info\n","severity":"info","time":"2022-01-22T20:02:37Z"}
{"component":"gcsupload","file":"prow/gcsupload/run.go:212","func":"k8s.io/test-infra/prow/gcsupload.gatherArtifacts.func1","level":"info","msg":"Found /data/gcs/artifacts/generated/etcd.conf in artifact directory. Uploading as logs/test_branch_origin_extended_conformance_install_in_tree/2842/artifacts/generated/etcd.conf\n","severity":"info","time":"2022-01-22T20:02:37Z"}
{"component":"gcsupload","file":"prow/gcsupload/run.go:212","func":"k8s.io/test-infra/prow/gcsupload.gatherArtifacts.func1","level":"info","msg":"Found /data/gcs/artifacts/generated/filesystem.info in artifact directory. Uploading as logs/test_branch_origin_extended_conformance_install_in_tree/2842/artifacts/generated/filesystem.info\n","severity":"info","time":"2022-01-22T20:02:37Z"}
{"component":"gcsupload","file":"prow/gcsupload/run.go:212","func":"k8s.io/test-infra/prow/gcsupload.gatherArtifacts.func1","level":"info","msg":"Found /data/gcs/artifacts/generated/installed_packages.log in artifact directory. Uploading as logs/test_branch_origin_extended_conformance_install_in_tree/2842/artifacts/generated/installed_packages.log\n","severity":"info","time":"2022-01-22T20:02:37Z"}
{"component":"gcsupload","file":"prow/gcsupload/run.go:212","func":"k8s.io/test-infra/prow/gcsupload.gatherArtifacts.func1","level":"info","msg":"Found /data/gcs/artifacts/generated/master-metrics.log in artifact directory. Uploading as logs/test_branch_origin_extended_conformance_install_in_tree/2842/artifacts/generated/master-metrics.log\n","severity":"info","time":"2022-01-22T20:02:37Z"}
{"component":"gcsupload","file":"prow/gcsupload/run.go:212","func":"k8s.io/test-infra/prow/gcsupload.gatherArtifacts.func1","level":"info","msg":"Found /data/gcs/artifacts/generated/node-metrics.log in artifact directory. Uploading as logs/test_branch_origin_extended_conformance_install_in_tree/2842/artifacts/generated/node-metrics.log\n","severity":"info","time":"2022-01-22T20:02:37Z"}
{"component":"gcsupload","file":"prow/gcsupload/run.go:212","func":"k8s.io/test-infra/prow/gcsupload.gatherArtifacts.func1","level":"info","msg":"Found /data/gcs/artifacts/generated/pid1.journal in artifact directory. Uploading as logs/test_branch_origin_extended_conformance_install_in_tree/2842/artifacts/generated/pid1.journal\n","severity":"info","time":"2022-01-22T20:02:37Z"}
{"component":"gcsupload","file":"prow/gcsupload/run.go:212","func":"k8s.io/test-infra/prow/gcsupload.gatherArtifacts.func1","level":"info","msg":"Found /data/gcs/artifacts/journals/dnsmasq.service in artifact directory. Uploading as logs/test_branch_origin_extended_conformance_install_in_tree/2842/artifacts/journals/dnsmasq.service\n","severity":"info","time":"2022-01-22T20:02:37Z"}
{"component":"gcsupload","file":"prow/gcsupload/run.go:212","func":"k8s.io/test-infra/prow/gcsupload.gatherArtifacts.func1","level":"info","msg":"Found /data/gcs/artifacts/journals/docker.service in artifact directory. Uploading as logs/test_branch_origin_extended_conformance_install_in_tree/2842/artifacts/journals/docker.service\n","severity":"info","time":"2022-01-22T20:02:37Z"}
{"component":"gcsupload","file":"prow/gcsupload/run.go:212","func":"k8s.io/test-infra/prow/gcsupload.gatherArtifacts.func1","level":"info","msg":"Found /data/gcs/artifacts/journals/etcd.service in artifact directory. Uploading as logs/test_branch_origin_extended_conformance_install_in_tree/2842/artifacts/journals/etcd.service\n","severity":"info","time":"2022-01-22T20:02:37Z"}
{"component":"gcsupload","file":"prow/gcsupload/run.go:212","func":"k8s.io/test-infra/prow/gcsupload.gatherArtifacts.func1","level":"info","msg":"Found /data/gcs/artifacts/journals/openvswitch.service in artifact directory. Uploading as logs/test_branch_origin_extended_conformance_install_in_tree/2842/artifacts/journals/openvswitch.service\n","severity":"info","time":"2022-01-22T20:02:37Z"}
{"component":"gcsupload","file":"prow/gcsupload/run.go:212","func":"k8s.io/test-infra/prow/gcsupload.gatherArtifacts.func1","level":"info","msg":"Found /data/gcs/artifacts/journals/origin-master-api.service in artifact directory. Uploading as logs/test_branch_origin_extended_conformance_install_in_tree/2842/artifacts/journals/origin-master-api.service\n","severity":"info","time":"2022-01-22T20:02:37Z"}
{"component":"gcsupload","file":"prow/gcsupload/run.go:212","func":"k8s.io/test-infra/prow/gcsupload.gatherArtifacts.func1","level":"info","msg":"Found /data/gcs/artifacts/journals/origin-master-controllers.service in artifact directory. Uploading as logs/test_branch_origin_extended_conformance_install_in_tree/2842/artifacts/journals/origin-master-controllers.service\n","severity":"info","time":"2022-01-22T20:02:37Z"}
{"component":"gcsupload","file":"prow/gcsupload/run.go:212","func":"k8s.io/test-infra/prow/gcsupload.gatherArtifacts.func1","level":"info","msg":"Found /data/gcs/artifacts/journals/origin-master.service in artifact directory. Uploading as logs/test_branch_origin_extended_conformance_install_in_tree/2842/artifacts/journals/origin-master.service\n","severity":"info","time":"2022-01-22T20:02:37Z"}
{"component":"gcsupload","file":"prow/gcsupload/run.go:212","func":"k8s.io/test-infra/prow/gcsupload.gatherArtifacts.func1","level":"info","msg":"Found /data/gcs/artifacts/journals/origin-node.service in artifact directory. Uploading as logs/test_branch_origin_extended_conformance_install_in_tree/2842/artifacts/journals/origin-node.service\n","severity":"info","time":"2022-01-22T20:02:37Z"}
{"component":"gcsupload","file":"prow/gcsupload/run.go:212","func":"k8s.io/test-infra/prow/gcsupload.gatherArtifacts.func1","level":"info","msg":"Found /data/gcs/artifacts/journals/ovs-vswitchd.service in artifact directory. Uploading as logs/test_branch_origin_extended_conformance_install_in_tree/2842/artifacts/journals/ovs-vswitchd.service\n","severity":"info","time":"2022-01-22T20:02:37Z"}
{"component":"gcsupload","file":"prow/gcsupload/run.go:212","func":"k8s.io/test-infra/prow/gcsupload.gatherArtifacts.func1","level":"info","msg":"Found /data/gcs/artifacts/journals/ovsdb-server.service in artifact directory. Uploading as logs/test_branch_origin_extended_conformance_install_in_tree/2842/artifacts/journals/ovsdb-server.service\n","severity":"info","time":"2022-01-22T20:02:37Z"}
{"component":"gcsupload","file":"prow/gcsupload/run.go:212","func":"k8s.io/test-infra/prow/gcsupload.gatherArtifacts.func1","level":"info","msg":"Found /data/gcs/artifacts/journals/systemd-journald.service in artifact directory. Uploading as logs/test_branch_origin_extended_conformance_install_in_tree/2842/artifacts/journals/systemd-journald.service\n","severity":"info","time":"2022-01-22T20:02:37Z"}
{"component":"gcsupload","file":"prow/gcsupload/run.go:212","func":"k8s.io/test-infra/prow/gcsupload.gatherArtifacts.func1","level":"info","msg":"Found /data/gcs/artifacts/scripts/build-images/logs/scripts.log in artifact directory. Uploading as logs/test_branch_origin_extended_conformance_install_in_tree/2842/artifacts/scripts/build-images/logs/scripts.log\n","severity":"info","time":"2022-01-22T20:02:37Z"}
{"component":"gcsupload","file":"prow/gcsupload/run.go:212","func":"k8s.io/test-infra/prow/gcsupload.gatherArtifacts.func1","level":"info","msg":"Found /data/gcs/artifacts/scripts/env/logs/scripts.log in artifact directory. Uploading as logs/test_branch_origin_extended_conformance_install_in_tree/2842/artifacts/scripts/env/logs/scripts.log\n","severity":"info","time":"2022-01-22T20:02:37Z"}
{"component":"gcsupload","dest":"logs/test_branch_origin_extended_conformance_install_in_tree/2842/artifacts/journals/origin-master.service","file":"prow/pod-utils/gcs/upload.go:86","func":"k8s.io/test-infra/prow/pod-utils/gcs.upload","level":"info","msg":"Queued for upload","severity":"info","time":"2022-01-22T20:02:37Z"}
{"component":"gcsupload","dest":"logs/test_branch_origin_extended_conformance_install_in_tree/2842/artifacts/journals/ovsdb-server.service","file":"prow/pod-utils/gcs/upload.go:86","func":"k8s.io/test-infra/prow/pod-utils/gcs.upload","level":"info","msg":"Queued for upload","severity":"info","time":"2022-01-22T20:02:37Z"}
{"component":"gcsupload","dest":"logs/test_branch_origin_extended_conformance_install_in_tree/2842/artifacts/scripts/build-images/logs/scripts.log","file":"prow/pod-utils/gcs/upload.go:86","func":"k8s.io/test-infra/prow/pod-utils/gcs.upload","level":"info","msg":"Queued for upload","severity":"info","time":"2022-01-22T20:02:37Z"}
{"component":"gcsupload","dest":"logs/test_branch_origin_extended_conformance_install_in_tree/2842/artifacts/generated/containers.log","file":"prow/pod-utils/gcs/upload.go:86","func":"k8s.io/test-infra/prow/pod-utils/gcs.upload","level":"info","msg":"Queued for upload","severity":"info","time":"2022-01-22T20:02:37Z"}
{"component":"gcsupload","dest":"logs/test_branch_origin_extended_conformance_install_in_tree/2842/artifacts/generated/master-metrics.log","file":"prow/pod-utils/gcs/upload.go:86","func":"k8s.io/test-infra/prow/pod-utils/gcs.upload","level":"info","msg":"Queued for upload","severity":"info","time":"2022-01-22T20:02:37Z"}
{"component":"gcsupload","dest":"logs/test_branch_origin_extended_conformance_install_in_tree/2842/artifacts/journals/origin-master-api.service","file":"prow/pod-utils/gcs/upload.go:86","func":"k8s.io/test-infra/prow/pod-utils/gcs.upload","level":"info","msg":"Queued for upload","severity":"info","time":"2022-01-22T20:02:37Z"}
{"component":"gcsupload","dest":"logs/test_branch_origin_extended_conformance_install_in_tree/2842/artifacts/journals/origin-master-controllers.service","file":"prow/pod-utils/gcs/upload.go:86","func":"k8s.io/test-infra/prow/pod-utils/gcs.upload","level":"info","msg":"Queued for upload","severity":"info","time":"2022-01-22T20:02:37Z"}
{"component":"gcsupload","dest":"logs/test_branch_origin_extended_conformance_install_in_tree/2842/build-log.txt","file":"prow/pod-utils/gcs/upload.go:86","func":"k8s.io/test-infra/prow/pod-utils/gcs.upload","level":"info","msg":"Queued for upload","severity":"info","time":"2022-01-22T20:02:37Z"}
{"component":"gcsupload","dest":"logs/test_branch_origin_extended_conformance_install_in_tree/2842/artifacts/generated/node-metrics.log","file":"prow/pod-utils/gcs/upload.go:86","func":"k8s.io/test-infra/prow/pod-utils/gcs.upload","level":"info","msg":"Queued for upload","severity":"info","time":"2022-01-22T20:02:37Z"}
{"component":"gcsupload","dest":"logs/test_branch_origin_extended_conformance_install_in_tree/2842/artifacts/journals/dnsmasq.service","file":"prow/pod-utils/gcs/upload.go:86","func":"k8s.io/test-infra/prow/pod-utils/gcs.upload","level":"info","msg":"Queued for upload","severity":"info","time":"2022-01-22T20:02:37Z"}
{"component":"gcsupload","dest":"logs/test_branch_origin_extended_conformance_install_in_tree/2842/artifacts/journals/docker.service","file":"prow/pod-utils/gcs/upload.go:86","func":"k8s.io/test-infra/prow/pod-utils/gcs.upload","level":"info","msg":"Queued for upload","severity":"info","time":"2022-01-22T20:02:37Z"}
{"component":"gcsupload","dest":"logs/test_branch_origin_extended_conformance_install_in_tree/2842/artifacts/journals/systemd-journald.service","file":"prow/pod-utils/gcs/upload.go:86","func":"k8s.io/test-infra/prow/pod-utils/gcs.upload","level":"info","msg":"Queued for upload","severity":"info","time":"2022-01-22T20:02:37Z"}
{"component":"gcsupload","dest":"logs/test_branch_origin_extended_conformance_install_in_tree/2842/artifacts/scripts/env/logs/scripts.log","file":"prow/pod-utils/gcs/upload.go:86","func":"k8s.io/test-infra/prow/pod-utils/gcs.upload","level":"info","msg":"Queued for upload","severity":"info","time":"2022-01-22T20:02:37Z"}
{"component":"gcsupload","dest":"logs/test_branch_origin_extended_conformance_install_in_tree/2842/artifacts/generated/docker.config","file":"prow/pod-utils/gcs/upload.go:86","func":"k8s.io/test-infra/prow/pod-utils/gcs.upload","level":"info","msg":"Queued for upload","severity":"info","time":"2022-01-22T20:02:37Z"}
{"component":"gcsupload","dest":"logs/test_branch_origin_extended_conformance_install_in_tree/2842/artifacts/generated/pid1.journal","file":"prow/pod-utils/gcs/upload.go:86","func":"k8s.io/test-infra/prow/pod-utils/gcs.upload","level":"info","msg":"Queued for upload","severity":"info","time":"2022-01-22T20:02:37Z"}
{"component":"gcsupload","dest":"logs/test_branch_origin_extended_conformance_install_in_tree/2842/finished.json","file":"prow/pod-utils/gcs/upload.go:86","func":"k8s.io/test-infra/prow/pod-utils/gcs.upload","level":"info","msg":"Queued for upload","severity":"info","time":"2022-01-22T20:02:37Z"}
{"component":"gcsupload","dest":"logs/test_branch_origin_extended_conformance_install_in_tree/2842/artifacts/generated/dmesg.log","file":"prow/pod-utils/gcs/upload.go:86","func":"k8s.io/test-infra/prow/pod-utils/gcs.upload","level":"info","msg":"Queued for upload","severity":"info","time":"2022-01-22T20:02:37Z"}
{"component":"gcsupload","dest":"logs/test_branch_origin_extended_conformance_install_in_tree/2842/artifacts/generated/docker.info","file":"prow/pod-utils/gcs/upload.go:86","func":"k8s.io/test-infra/prow/pod-utils/gcs.upload","level":"info","msg":"Queued for upload","severity":"info","time":"2022-01-22T20:02:37Z"}
{"component":"gcsupload","dest":"logs/test_branch_origin_extended_conformance_install_in_tree/2842/artifacts/generated/installed_packages.log","file":"prow/pod-utils/gcs/upload.go:86","func":"k8s.io/test-infra/prow/pod-utils/gcs.upload","level":"info","msg":"Queued for upload","severity":"info","time":"2022-01-22T20:02:37Z"}
{"component":"gcsupload","dest":"logs/test_branch_origin_extended_conformance_install_in_tree/2842/artifacts/journals/etcd.service","file":"prow/pod-utils/gcs/upload.go:86","func":"k8s.io/test-infra/prow/pod-utils/gcs.upload","level":"info","msg":"Queued for upload","severity":"info","time":"2022-01-22T20:02:37Z"}
{"component":"gcsupload","dest":"logs/test_branch_origin_extended_conformance_install_in_tree/2842/artifacts/journals/openvswitch.service","file":"prow/pod-utils/gcs/upload.go:86","func":"k8s.io/test-infra/prow/pod-utils/gcs.upload","level":"info","msg":"Queued for upload","severity":"info","time":"2022-01-22T20:02:37Z"}
{"component":"gcsupload","dest":"logs/test_branch_origin_extended_conformance_install_in_tree/2842/artifacts/journals/origin-node.service","file":"prow/pod-utils/gcs/upload.go:86","func":"k8s.io/test-infra/prow/pod-utils/gcs.upload","level":"info","msg":"Queued for upload","severity":"info","time":"2022-01-22T20:02:37Z"}
{"component":"gcsupload","dest":"logs/test_branch_origin_extended_conformance_install_in_tree/latest-build.txt","file":"prow/pod-utils/gcs/upload.go:86","func":"k8s.io/test-infra/prow/pod-utils/gcs.upload","level":"info","msg":"Queued for upload","severity":"info","time":"2022-01-22T20:02:37Z"}
{"component":"gcsupload","dest":"logs/test_branch_origin_extended_conformance_install_in_tree/2842/artifacts/generated/etcd.conf","file":"prow/pod-utils/gcs/upload.go:86","func":"k8s.io/test-infra/prow/pod-utils/gcs.upload","level":"info","msg":"Queued for upload","severity":"info","time":"2022-01-22T20:02:37Z"}
{"component":"gcsupload","dest":"logs/test_branch_origin_extended_conformance_install_in_tree/2842/artifacts/journals/ovs-vswitchd.service","file":"prow/pod-utils/gcs/upload.go:86","func":"k8s.io/test-infra/prow/pod-utils/gcs.upload","level":"info","msg":"Queued for upload","severity":"info","time":"2022-01-22T20:02:37Z"}
{"component":"gcsupload","dest":"logs/test_branch_origin_extended_conformance_install_in_tree/2842/artifacts/generated/avc_denials.log","file":"prow/pod-utils/gcs/upload.go:86","func":"k8s.io/test-infra/prow/pod-utils/gcs.upload","level":"info","msg":"Queued for upload","severity":"info","time":"2022-01-22T20:02:37Z"}
{"component":"gcsupload","dest":"logs/test_branch_origin_extended_conformance_install_in_tree/2842/artifacts/generated/filesystem.info","file":"prow/pod-utils/gcs/upload.go:86","func":"k8s.io/test-infra/prow/pod-utils/gcs.upload","level":"info","msg":"Queued for upload","severity":"info","time":"2022-01-22T20:02:37Z"}
{"component":"gcsupload","dest":"logs/test_branch_origin_extended_conformance_install_in_tree/2842/artifacts/journals/ovsdb-server.service","file":"prow/pod-utils/gcs/upload.go:114","func":"k8s.io/test-infra/prow/pod-utils/gcs.upload.func1","level":"info","msg":"Finished upload","severity":"info","time":"2022-01-22T20:02:37Z"}
{"component":"gcsupload","dest":"logs/test_branch_origin_extended_conformance_install_in_tree/2842/artifacts/journals/origin-master.service","file":"prow/pod-utils/gcs/upload.go:114","func":"k8s.io/test-infra/prow/pod-utils/gcs.upload.func1","level":"info","msg":"Finished upload","severity":"info","time":"2022-01-22T20:02:37Z"}
{"component":"gcsupload","dest":"logs/test_branch_origin_extended_conformance_install_in_tree/2842/artifacts/generated/filesystem.info","file":"prow/pod-utils/gcs/upload.go:114","func":"k8s.io/test-infra/prow/pod-utils/gcs.upload.func1","level":"info","msg":"Finished upload","severity":"info","time":"2022-01-22T20:02:37Z"}
{"component":"gcsupload","dest":"logs/test_branch_origin_extended_conformance_install_in_tree/2842/artifacts/generated/node-metrics.log","file":"prow/pod-utils/gcs/upload.go:114","func":"k8s.io/test-infra/prow/pod-utils/gcs.upload.func1","level":"info","msg":"Finished upload","severity":"info","time":"2022-01-22T20:02:37Z"}
{"component":"gcsupload","dest":"logs/test_branch_origin_extended_conformance_install_in_tree/2842/artifacts/scripts/build-images/logs/scripts.log","file":"prow/pod-utils/gcs/upload.go:114","func":"k8s.io/test-infra/prow/pod-utils/gcs.upload.func1","level":"info","msg":"Finished upload","severity":"info","time":"2022-01-22T20:02:37Z"}
{"component":"gcsupload","dest":"logs/test_branch_origin_extended_conformance_install_in_tree/2842/artifacts/journals/origin-master-api.service","file":"prow/pod-utils/gcs/upload.go:114","func":"k8s.io/test-infra/prow/pod-utils/gcs.upload.func1","level":"info","msg":"Finished upload","severity":"info","time":"2022-01-22T20:02:37Z"}
{"component":"gcsupload","dest":"logs/test_branch_origin_extended_conformance_install_in_tree/2842/artifacts/generated/containers.log","file":"prow/pod-utils/gcs/upload.go:114","func":"k8s.io/test-infra/prow/pod-utils/gcs.upload.func1","level":"info","msg":"Finished upload","severity":"info","time":"2022-01-22T20:02:37Z"}
{"component":"gcsupload","dest":"logs/test_branch_origin_extended_conformance_install_in_tree/2842/artifacts/generated/master-metrics.log","file":"prow/pod-utils/gcs/upload.go:114","func":"k8s.io/test-infra/prow/pod-utils/gcs.upload.func1","level":"info","msg":"Finished upload","severity":"info","time":"2022-01-22T20:02:37Z"}
{"component":"gcsupload","dest":"logs/test_branch_origin_extended_conformance_install_in_tree/2842/artifacts/journals/origin-master-controllers.service","file":"prow/pod-utils/gcs/upload.go:114","func":"k8s.io/test-infra/prow/pod-utils/gcs.upload.func1","level":"info","msg":"Finished upload","severity":"info","time":"2022-01-22T20:02:37Z"}
{"component":"gcsupload","dest":"logs/test_branch_origin_extended_conformance_install_in_tree/2842/artifacts/generated/etcd.conf","file":"prow/pod-utils/gcs/upload.go:114","func":"k8s.io/test-infra/prow/pod-utils/gcs.upload.func1","level":"info","msg":"Finished upload","severity":"info","time":"2022-01-22T20:02:37Z"}
{"component":"gcsupload","dest":"logs/test_branch_origin_extended_conformance_install_in_tree/2842/build-log.txt","file":"prow/pod-utils/gcs/upload.go:114","func":"k8s.io/test-infra/prow/pod-utils/gcs.upload.func1","level":"info","msg":"Finished upload","severity":"info","time":"2022-01-22T20:02:37Z"}
{"component":"gcsupload","dest":"logs/test_branch_origin_extended_conformance_install_in_tree/latest-build.txt","file":"prow/pod-utils/gcs/upload.go:114","func":"k8s.io/test-infra/prow/pod-utils/gcs.upload.func1","level":"info","msg":"Finished upload","severity":"info","time":"2022-01-22T20:02:37Z"}
{"component":"gcsupload","dest":"logs/test_branch_origin_extended_conformance_install_in_tree/2842/artifacts/journals/ovs-vswitchd.service","file":"prow/pod-utils/gcs/upload.go:114","func":"k8s.io/test-infra/prow/pod-utils/gcs.upload.func1","level":"info","msg":"Finished upload","severity":"info","time":"2022-01-22T20:02:37Z"}
{"component":"gcsupload","dest":"logs/test_branch_origin_extended_conformance_install_in_tree/2842/artifacts/generated/avc_denials.log","file":"prow/pod-utils/gcs/upload.go:114","func":"k8s.io/test-infra/prow/pod-utils/gcs.upload.func1","level":"info","msg":"Finished upload","severity":"info","time":"2022-01-22T20:02:38Z"}
{"component":"gcsupload","dest":"logs/test_branch_origin_extended_conformance_install_in_tree/2842/artifacts/generated/pid1.journal","file":"prow/pod-utils/gcs/upload.go:114","func":"k8s.io/test-infra/prow/pod-utils/gcs.upload.func1","level":"info","msg":"Finished upload","severity":"info","time":"2022-01-22T20:02:38Z"}
{"component":"gcsupload","dest":"logs/test_branch_origin_extended_conformance_install_in_tree/2842/artifacts/journals/dnsmasq.service","file":"prow/pod-utils/gcs/upload.go:114","func":"k8s.io/test-infra/prow/pod-utils/gcs.upload.func1","level":"info","msg":"Finished upload","severity":"info","time":"2022-01-22T20:02:38Z"}
{"component":"gcsupload","dest":"logs/test_branch_origin_extended_conformance_install_in_tree/2842/artifacts/journals/docker.service","file":"prow/pod-utils/gcs/upload.go:114","func":"k8s.io/test-infra/prow/pod-utils/gcs.upload.func1","level":"info","msg":"Finished upload","severity":"info","time":"2022-01-22T20:02:38Z"}
{"component":"gcsupload","dest":"logs/test_branch_origin_extended_conformance_install_in_tree/2842/artifacts/journals/systemd-journald.service","file":"prow/pod-utils/gcs/upload.go:114","func":"k8s.io/test-infra/prow/pod-utils/gcs.upload.func1","level":"info","msg":"Finished upload","severity":"info","time":"2022-01-22T20:02:38Z"}
{"component":"gcsupload","dest":"logs/test_branch_origin_extended_conformance_install_in_tree/2842/artifacts/scripts/env/logs/scripts.log","file":"prow/pod-utils/gcs/upload.go:114","func":"k8s.io/test-infra/prow/pod-utils/gcs.upload.func1","level":"info","msg":"Finished upload","severity":"info","time":"2022-01-22T20:02:38Z"}
{"component":"gcsupload","dest":"logs/test_branch_origin_extended_conformance_install_in_tree/2842/artifacts/generated/docker.config","file":"prow/pod-utils/gcs/upload.go:114","func":"k8s.io/test-infra/prow/pod-utils/gcs.upload.func1","level":"info","msg":"Finished upload","severity":"info","time":"2022-01-22T20:02:38Z"}
{"component":"gcsupload","dest":"logs/test_branch_origin_extended_conformance_install_in_tree/2842/artifacts/generated/docker.info","file":"prow/pod-utils/gcs/upload.go:114","func":"k8s.io/test-infra/prow/pod-utils/gcs.upload.func1","level":"info","msg":"Finished upload","severity":"info","time":"2022-01-22T20:02:38Z"}
{"component":"gcsupload","dest":"logs/test_branch_origin_extended_conformance_install_in_tree/2842/finished.json","file":"prow/pod-utils/gcs/upload.go:114","func":"k8s.io/test-infra/prow/pod-utils/gcs.upload.func1","level":"info","msg":"Finished upload","severity":"info","time":"2022-01-22T20:02:38Z"}
{"component":"gcsupload","dest":"logs/test_branch_origin_extended_conformance_install_in_tree/2842/artifacts/generated/dmesg.log","file":"prow/pod-utils/gcs/upload.go:114","func":"k8s.io/test-infra/prow/pod-utils/gcs.upload.func1","level":"info","msg":"Finished upload","severity":"info","time":"2022-01-22T20:02:38Z"}
{"component":"gcsupload","dest":"logs/test_branch_origin_extended_conformance_install_in_tree/2842/artifacts/journals/origin-node.service","file":"prow/pod-utils/gcs/upload.go:114","func":"k8s.io/test-infra/prow/pod-utils/gcs.upload.func1","level":"info","msg":"Finished upload","severity":"info","time":"2022-01-22T20:02:38Z"}
{"component":"gcsupload","dest":"logs/test_branch_origin_extended_conformance_install_in_tree/2842/artifacts/generated/installed_packages.log","file":"prow/pod-utils/gcs/upload.go:114","func":"k8s.io/test-infra/prow/pod-utils/gcs.upload.func1","level":"info","msg":"Finished upload","severity":"info","time":"2022-01-22T20:02:39Z"}
{"component":"gcsupload","dest":"logs/test_branch_origin_extended_conformance_install_in_tree/2842/artifacts/journals/etcd.service","file":"prow/pod-utils/gcs/upload.go:114","func":"k8s.io/test-infra/prow/pod-utils/gcs.upload.func1","level":"info","msg":"Finished upload","severity":"info","time":"2022-01-22T20:02:39Z"}
{"component":"gcsupload","dest":"logs/test_branch_origin_extended_conformance_install_in_tree/2842/artifacts/journals/openvswitch.service","file":"prow/pod-utils/gcs/upload.go:114","func":"k8s.io/test-infra/prow/pod-utils/gcs.upload.func1","level":"info","msg":"Finished upload","severity":"info","time":"2022-01-22T20:02:39Z"}
{"component":"gcsupload","file":"prow/gcsupload/run.go:78","func":"k8s.io/test-infra/prow/gcsupload.completeUpload","level":"info","msg":"Finished upload to blob storage","severity":"info","time":"2022-01-22T20:02:39Z"}
{"component":"gcsupload","file":"prow/gcsupload/run.go:78","func":"k8s.io/test-infra/prow/gcsupload.completeUpload","level":"info","msg":"Finished upload to blob storage","severity":"info","time":"2022-01-22T20:02:39Z"}
+ exit 0
+ set +o xtrace
########## FINISHED STAGE: SUCCESS: PUSH THE ARTIFACTS AND METADATA [00h 00m 09s] ##########
[workspace] $ /bin/bash /tmp/jenkins1127544067869571720.sh
########## STARTING STAGE: DEPROVISION CLOUD RESOURCES ##########
+ [[ -s /var/lib/jenkins/jobs/test_branch_origin_extended_conformance_install_in_tree/workspace/activate ]]
+ source /var/lib/jenkins/jobs/test_branch_origin_extended_conformance_install_in_tree/workspace/activate
++ export VIRTUAL_ENV=/var/lib/jenkins/origin-ci-tool/95a472392910104fc805c4ab8af39791105c956d
++ VIRTUAL_ENV=/var/lib/jenkins/origin-ci-tool/95a472392910104fc805c4ab8af39791105c956d
++ export PATH=/var/lib/jenkins/origin-ci-tool/95a472392910104fc805c4ab8af39791105c956d/bin:/sbin:/usr/sbin:/bin:/usr/bin
++ PATH=/var/lib/jenkins/origin-ci-tool/95a472392910104fc805c4ab8af39791105c956d/bin:/sbin:/usr/sbin:/bin:/usr/bin
++ unset PYTHON_HOME
++ export OCT_CONFIG_HOME=/var/lib/jenkins/jobs/test_branch_origin_extended_conformance_install_in_tree/workspace/.config
++ OCT_CONFIG_HOME=/var/lib/jenkins/jobs/test_branch_origin_extended_conformance_install_in_tree/workspace/.config
+ oct deprovision

PLAYBOOK: main.yml *************************************************************
4 plays in /var/lib/jenkins/origin-ci-tool/95a472392910104fc805c4ab8af39791105c956d/lib/python2.7/site-packages/oct/ansible/oct/playbooks/deprovision/main.yml

PLAY [ensure we have the parameters necessary to deprovision virtual hosts] ****

TASK [ensure all required variables are set] ***********************************
task path: /var/lib/jenkins/origin-ci-tool/95a472392910104fc805c4ab8af39791105c956d/lib/python2.7/site-packages/oct/ansible/oct/playbooks/deprovision/main.yml:9
skipping: [localhost] => (item=origin_ci_inventory_dir)  => {
    "changed": false, 
    "generated_timestamp": "2022-01-22 15:02:40.982087", 
    "item": "origin_ci_inventory_dir", 
    "skip_reason": "Conditional check failed", 
    "skipped": true
}
skipping: [localhost] => (item=origin_ci_aws_region)  => {
    "changed": false, 
    "generated_timestamp": "2022-01-22 15:02:40.986633", 
    "item": "origin_ci_aws_region", 
    "skip_reason": "Conditional check failed", 
    "skipped": true
}

PLAY [deprovision virtual hosts in EC2] ****************************************

TASK [Gathering Facts] *********************************************************
ok: [localhost]

TASK [deprovision a virtual EC2 host] ******************************************
task path: /var/lib/jenkins/origin-ci-tool/95a472392910104fc805c4ab8af39791105c956d/lib/python2.7/site-packages/oct/ansible/oct/playbooks/deprovision/main.yml:28
included: /var/lib/jenkins/origin-ci-tool/95a472392910104fc805c4ab8af39791105c956d/lib/python2.7/site-packages/oct/ansible/oct/playbooks/deprovision/roles/aws-down/tasks/main.yml for localhost

TASK [update the SSH configuration to remove AWS EC2 specifics] ****************
task path: /var/lib/jenkins/origin-ci-tool/95a472392910104fc805c4ab8af39791105c956d/lib/python2.7/site-packages/oct/ansible/oct/playbooks/deprovision/roles/aws-down/tasks/main.yml:2
ok: [localhost] => {
    "changed": false, 
    "generated_timestamp": "2022-01-22 15:02:41.856119", 
    "msg": ""
}

TASK [rename EC2 instance for termination reaper] ******************************
task path: /var/lib/jenkins/origin-ci-tool/95a472392910104fc805c4ab8af39791105c956d/lib/python2.7/site-packages/oct/ansible/oct/playbooks/deprovision/roles/aws-down/tasks/main.yml:8
changed: [localhost] => {
    "changed": true, 
    "generated_timestamp": "2022-01-22 15:02:42.755870", 
    "msg": "Tags {'Name': 'oct-terminate'} created for resource i-0eae42582f8b1e874."
}

TASK [tear down the EC2 instance] **********************************************
task path: /var/lib/jenkins/origin-ci-tool/95a472392910104fc805c4ab8af39791105c956d/lib/python2.7/site-packages/oct/ansible/oct/playbooks/deprovision/roles/aws-down/tasks/main.yml:15
changed: [localhost] => {
    "changed": true, 
    "generated_timestamp": "2022-01-22 15:02:43.952501", 
    "instance_ids": [
        "i-0eae42582f8b1e874"
    ], 
    "instances": [
        {
            "ami_launch_index": "0", 
            "architecture": "x86_64", 
            "block_device_mapping": {
                "/dev/sda1": {
                    "delete_on_termination": true, 
                    "status": "attached", 
                    "volume_id": "vol-0ab7f4323d2e66060"
                }, 
                "/dev/sdb": {
                    "delete_on_termination": true, 
                    "status": "attached", 
                    "volume_id": "vol-0fb721921e830acfa"
                }
            }, 
            "dns_name": "ec2-3-85-45-95.compute-1.amazonaws.com", 
            "ebs_optimized": false, 
            "groups": {
                "sg-7e73221a": "default"
            }, 
            "hypervisor": "xen", 
            "id": "i-0eae42582f8b1e874", 
            "image_id": "ami-0be3a2afbcd35d3f1", 
            "instance_type": "m4.xlarge", 
            "kernel": null, 
            "key_name": "openshift-dev", 
            "launch_time": "2022-01-22T19:28:20.000Z", 
            "placement": "us-east-1d", 
            "private_dns_name": "ip-172-18-4-160.ec2.internal", 
            "private_ip": "172.18.4.160", 
            "public_dns_name": "ec2-3-85-45-95.compute-1.amazonaws.com", 
            "public_ip": "3.85.45.95", 
            "ramdisk": null, 
            "region": "us-east-1", 
            "root_device_name": "/dev/sda1", 
            "root_device_type": "ebs", 
            "state": "running", 
            "state_code": 16, 
            "tags": {
                "Name": "oct-terminate", 
                "openshift_etcd": "", 
                "openshift_master": "", 
                "openshift_node": ""
            }, 
            "tenancy": "default", 
            "virtualization_type": "hvm"
        }
    ], 
    "tagged_instances": []
}

TASK [remove the serialized host variables] ************************************
task path: /var/lib/jenkins/origin-ci-tool/95a472392910104fc805c4ab8af39791105c956d/lib/python2.7/site-packages/oct/ansible/oct/playbooks/deprovision/roles/aws-down/tasks/main.yml:22
changed: [localhost] => {
    "changed": true, 
    "generated_timestamp": "2022-01-22 15:02:44.219660", 
    "path": "/var/lib/jenkins/jobs/test_branch_origin_extended_conformance_install_in_tree/workspace/.config/origin-ci-tool/inventory/host_vars/172.18.4.160.yml", 
    "state": "absent"
}

PLAY [deprovision virtual hosts locally manged by Vagrant] *********************

TASK [Gathering Facts] *********************************************************
ok: [localhost]

PLAY [clean up local configuration for deprovisioned instances] ****************

TASK [remove inventory configuration directory] ********************************
task path: /var/lib/jenkins/origin-ci-tool/95a472392910104fc805c4ab8af39791105c956d/lib/python2.7/site-packages/oct/ansible/oct/playbooks/deprovision/main.yml:61
changed: [localhost] => {
    "changed": true, 
    "generated_timestamp": "2022-01-22 15:02:44.744116", 
    "path": "/var/lib/jenkins/jobs/test_branch_origin_extended_conformance_install_in_tree/workspace/.config/origin-ci-tool/inventory", 
    "state": "absent"
}

PLAY RECAP *********************************************************************
localhost                  : ok=8    changed=4    unreachable=0    failed=0   

+ set +o xtrace
########## FINISHED STAGE: SUCCESS: DEPROVISION CLOUD RESOURCES [00h 00m 05s] ##########
Archiving artifacts
sent [/var/lib/jenkins/jobs/test_branch_origin_extended_conformance_install_in_tree/workspace/artifacts/gathered/scripts/build-images/logs/scripts.log, /var/lib/jenkins/jobs/test_branch_origin_extended_conformance_install_in_tree/workspace/artifacts/gathered/scripts/env/logs/scripts.log, /var/lib/jenkins/jobs/test_branch_origin_extended_conformance_install_in_tree/workspace/artifacts/generated/avc_denials.log, /var/lib/jenkins/jobs/test_branch_origin_extended_conformance_install_in_tree/workspace/artifacts/generated/containers.log, /var/lib/jenkins/jobs/test_branch_origin_extended_conformance_install_in_tree/workspace/artifacts/generated/dmesg.log, /var/lib/jenkins/jobs/test_branch_origin_extended_conformance_install_in_tree/workspace/artifacts/generated/installed_packages.log, /var/lib/jenkins/jobs/test_branch_origin_extended_conformance_install_in_tree/workspace/artifacts/generated/master-metrics.log, /var/lib/jenkins/jobs/test_branch_origin_extended_conformance_install_in_tree/workspace/artifacts/generated/node-metrics.log, /var/lib/jenkins/jobs/test_branch_origin_extended_conformance_install_in_tree/workspace/gcs/artifacts/generated/avc_denials.log, /var/lib/jenkins/jobs/test_branch_origin_extended_conformance_install_in_tree/workspace/gcs/artifacts/generated/containers.log, /var/lib/jenkins/jobs/test_branch_origin_extended_conformance_install_in_tree/workspace/gcs/artifacts/generated/dmesg.log, /var/lib/jenkins/jobs/test_branch_origin_extended_conformance_install_in_tree/workspace/gcs/artifacts/generated/installed_packages.log, /var/lib/jenkins/jobs/test_branch_origin_extended_conformance_install_in_tree/workspace/gcs/artifacts/generated/master-metrics.log, /var/lib/jenkins/jobs/test_branch_origin_extended_conformance_install_in_tree/workspace/gcs/artifacts/generated/node-metrics.log, /var/lib/jenkins/jobs/test_branch_origin_extended_conformance_install_in_tree/workspace/gcs/artifacts/scripts/build-images/logs/scripts.log, /var/lib/jenkins/jobs/test_branch_origin_extended_conformance_install_in_tree/workspace/gcs/artifacts/scripts/env/logs/scripts.log] to splunk in 16 events
[WS-CLEANUP] Deleting project workspace...
[WS-CLEANUP] Deferred wipeout is used...
[WS-CLEANUP] done
Finished: FAILURE