Console Output

Skipping 375 KB.. Full Log
[openshift/origin-control-plane] ---> Package python-cephfs.x86_64 2:12.2.11-0.el7 will be installed
[openshift/origin-control-plane] ---> Package python-prettytable.noarch 0:0.7.2-3.el7 will be installed
[openshift/origin-control-plane] ---> Package python-rados.x86_64 2:12.2.11-0.el7 will be installed
[openshift/origin-control-plane] ---> Package python-rbd.x86_64 2:12.2.11-0.el7 will be installed
[openshift/origin-control-plane] ---> Package python-requests.noarch 0:2.6.0-10.el7 will be installed
[openshift/origin-control-plane] --> Processing Dependency: python-urllib3 >= 1.10.2-1 for package: python-requests-2.6.0-10.el7.noarch
[openshift/origin-control-plane] ---> Package python-rgw.x86_64 2:12.2.11-0.el7 will be installed
[openshift/origin-control-plane] --> Processing Dependency: librgw2 = 2:12.2.11-0.el7 for package: 2:python-rgw-12.2.11-0.el7.x86_64
[openshift/origin-control-plane] --> Processing Dependency: librgw.so.2()(64bit) for package: 2:python-rgw-12.2.11-0.el7.x86_64
[openshift/origin-control-plane] ---> Package snappy.x86_64 0:1.1.0-3.el7 will be installed
[openshift/origin-control-plane] --> Running transaction check
[openshift/origin-control-plane] ---> Package libnetfilter_conntrack.x86_64 0:1.0.6-1.el7_3 will be installed
[openshift/origin-control-plane] --> Processing Dependency: libmnl.so.0(LIBMNL_1.1)(64bit) for package: libnetfilter_conntrack-1.0.6-1.el7_3.x86_64
[openshift/origin-control-plane] --> Processing Dependency: libmnl.so.0(LIBMNL_1.0)(64bit) for package: libnetfilter_conntrack-1.0.6-1.el7_3.x86_64
[openshift/origin-control-plane] --> Processing Dependency: libmnl.so.0()(64bit) for package: libnetfilter_conntrack-1.0.6-1.el7_3.x86_64
[openshift/origin-control-plane] ---> Package libnfnetlink.x86_64 0:1.0.1-4.el7 will be installed
[openshift/origin-control-plane] ---> Package libnl3.x86_64 0:3.2.28-4.el7 will be installed
[openshift/origin-control-plane] ---> Package librgw2.x86_64 2:12.2.11-0.el7 will be installed
[openshift/origin-control-plane] ---> Package lttng-ust.x86_64 0:2.10.0-1.el7 will be installed
[openshift/origin-control-plane] --> Processing Dependency: liburcu-bp.so.6()(64bit) for package: lttng-ust-2.10.0-1.el7.x86_64
[openshift/origin-control-plane] --> Processing Dependency: liburcu-cds.so.6()(64bit) for package: lttng-ust-2.10.0-1.el7.x86_64
[openshift/origin-control-plane] ---> Package perl.x86_64 4:5.16.3-299.el7_9 will be installed
[openshift/origin-control-plane] --> Processing Dependency: perl-libs = 4:5.16.3-299.el7_9 for package: 4:perl-5.16.3-299.el7_9.x86_64
[openshift/origin-control-plane] --> Processing Dependency: perl(Socket) >= 1.3 for package: 4:perl-5.16.3-299.el7_9.x86_64
[openshift/origin-control-plane] --> Processing Dependency: perl(Scalar::Util) >= 1.10 for package: 4:perl-5.16.3-299.el7_9.x86_64
[openshift/origin-control-plane] --> Processing Dependency: perl-macros for package: 4:perl-5.16.3-299.el7_9.x86_64
[openshift/origin-control-plane] --> Processing Dependency: perl-libs for package: 4:perl-5.16.3-299.el7_9.x86_64
[openshift/origin-control-plane] --> Processing Dependency: perl(threads::shared) for package: 4:perl-5.16.3-299.el7_9.x86_64
[openshift/origin-control-plane] --> Processing Dependency: perl(threads) for package: 4:perl-5.16.3-299.el7_9.x86_64
[openshift/origin-control-plane] --> Processing Dependency: perl(constant) for package: 4:perl-5.16.3-299.el7_9.x86_64
[openshift/origin-control-plane] --> Processing Dependency: perl(Time::Local) for package: 4:perl-5.16.3-299.el7_9.x86_64
[openshift/origin-control-plane] --> Processing Dependency: perl(Time::HiRes) for package: 4:perl-5.16.3-299.el7_9.x86_64
[openshift/origin-control-plane] --> Processing Dependency: perl(Storable) for package: 4:perl-5.16.3-299.el7_9.x86_64
[openshift/origin-control-plane] --> Processing Dependency: perl(Socket) for package: 4:perl-5.16.3-299.el7_9.x86_64
[openshift/origin-control-plane] --> Processing Dependency: perl(Scalar::Util) for package: 4:perl-5.16.3-299.el7_9.x86_64
[openshift/origin-control-plane] --> Processing Dependency: perl(Pod::Simple::XHTML) for package: 4:perl-5.16.3-299.el7_9.x86_64
[openshift/origin-control-plane] --> Processing Dependency: perl(Pod::Simple::Search) for package: 4:perl-5.16.3-299.el7_9.x86_64
[openshift/origin-control-plane] --> Processing Dependency: perl(Filter::Util::Call) for package: 4:perl-5.16.3-299.el7_9.x86_64
[openshift/origin-control-plane] --> Processing Dependency: perl(File::Temp) for package: 4:perl-5.16.3-299.el7_9.x86_64
[openshift/origin-control-plane] --> Processing Dependency: perl(File::Spec::Unix) for package: 4:perl-5.16.3-299.el7_9.x86_64
[openshift/origin-control-plane] --> Processing Dependency: perl(File::Spec::Functions) for package: 4:perl-5.16.3-299.el7_9.x86_64
[openshift/origin-control-plane] --> Processing Dependency: perl(File::Spec) for package: 4:perl-5.16.3-299.el7_9.x86_64
[openshift/origin-control-plane] --> Processing Dependency: perl(Exporter) for package: 4:perl-5.16.3-299.el7_9.x86_64
[openshift/origin-control-plane] --> Processing Dependency: perl(Cwd) for package: 4:perl-5.16.3-299.el7_9.x86_64
[openshift/origin-control-plane] --> Processing Dependency: perl(Carp) for package: 4:perl-5.16.3-299.el7_9.x86_64
[openshift/origin-control-plane] --> Processing Dependency: libperl.so()(64bit) for package: 4:perl-5.16.3-299.el7_9.x86_64
[openshift/origin-control-plane] ---> Package perl-File-Path.noarch 0:2.09-2.el7 will be installed
[openshift/origin-control-plane] ---> Package perl-Getopt-Long.noarch 0:2.40-3.el7 will be installed
[openshift/origin-control-plane] --> Processing Dependency: perl(Pod::Usage) >= 1.14 for package: perl-Getopt-Long-2.40-3.el7.noarch
[openshift/origin-control-plane] --> Processing Dependency: perl(Text::ParseWords) for package: perl-Getopt-Long-2.40-3.el7.noarch
[openshift/origin-control-plane] ---> Package python-urllib3.noarch 0:1.10.2-7.el7 will be installed
[openshift/origin-control-plane] --> Processing Dependency: python-six for package: python-urllib3-1.10.2-7.el7.noarch
[openshift/origin-control-plane] --> Processing Dependency: python-ipaddress for package: python-urllib3-1.10.2-7.el7.noarch
[openshift/origin-control-plane] --> Processing Dependency: python-backports-ssl_match_hostname for package: python-urllib3-1.10.2-7.el7.noarch
[openshift/origin-control-plane] ---> Package rdma-core.x86_64 0:22.4-6.el7_9 will be installed
[openshift/origin-control-plane] --> Processing Dependency: pciutils for package: rdma-core-22.4-6.el7_9.x86_64
[openshift/origin-control-plane] --> Processing Dependency: initscripts for package: rdma-core-22.4-6.el7_9.x86_64
[openshift/origin-control-plane] --> Running transaction check
[openshift/origin-control-plane] ---> Package initscripts.x86_64 0:9.49.53-1.el7_9.1 will be installed
[openshift/origin-control-plane] --> Processing Dependency: iproute for package: initscripts-9.49.53-1.el7_9.1.x86_64
[openshift/origin-control-plane] ---> Package libmnl.x86_64 0:1.0.3-7.el7 will be installed
[openshift/origin-control-plane] ---> Package pciutils.x86_64 0:3.5.1-3.el7 will be installed
[openshift/origin-control-plane] --> Processing Dependency: pciutils-libs = 3.5.1-3.el7 for package: pciutils-3.5.1-3.el7.x86_64
[openshift/origin-control-plane] --> Processing Dependency: libpci.so.3(LIBPCI_3.5)(64bit) for package: pciutils-3.5.1-3.el7.x86_64
[openshift/origin-control-plane] --> Processing Dependency: libpci.so.3(LIBPCI_3.3)(64bit) for package: pciutils-3.5.1-3.el7.x86_64
[openshift/origin-control-plane] --> Processing Dependency: libpci.so.3(LIBPCI_3.1)(64bit) for package: pciutils-3.5.1-3.el7.x86_64
[openshift/origin-control-plane] --> Processing Dependency: libpci.so.3(LIBPCI_3.0)(64bit) for package: pciutils-3.5.1-3.el7.x86_64
[openshift/origin-control-plane] --> Processing Dependency: hwdata for package: pciutils-3.5.1-3.el7.x86_64
[openshift/origin-control-plane] --> Processing Dependency: libpci.so.3()(64bit) for package: pciutils-3.5.1-3.el7.x86_64
[openshift/origin-control-plane] ---> Package perl-Carp.noarch 0:1.26-244.el7 will be installed
[openshift/origin-control-plane] ---> Package perl-Exporter.noarch 0:5.68-3.el7 will be installed
[openshift/origin-control-plane] ---> Package perl-File-Temp.noarch 0:0.23.01-3.el7 will be installed
[openshift/origin-control-plane] ---> Package perl-Filter.x86_64 0:1.49-3.el7 will be installed
[openshift/origin-control-plane] ---> Package perl-PathTools.x86_64 0:3.40-5.el7 will be installed
[openshift/origin-control-plane] ---> Package perl-Pod-Simple.noarch 1:3.28-4.el7 will be installed
[openshift/origin-control-plane] --> Processing Dependency: perl(Pod::Escapes) >= 1.04 for package: 1:perl-Pod-Simple-3.28-4.el7.noarch
[openshift/origin-control-plane] --> Processing Dependency: perl(Encode) for package: 1:perl-Pod-Simple-3.28-4.el7.noarch
[openshift/origin-control-plane] ---> Package perl-Pod-Usage.noarch 0:1.63-3.el7 will be installed
[openshift/origin-control-plane] --> Processing Dependency: perl(Pod::Text) >= 3.15 for package: perl-Pod-Usage-1.63-3.el7.noarch
[openshift/origin-control-plane] --> Processing Dependency: perl-Pod-Perldoc for package: perl-Pod-Usage-1.63-3.el7.noarch
[openshift/origin-control-plane] ---> Package perl-Scalar-List-Utils.x86_64 0:1.27-248.el7 will be installed
[openshift/origin-control-plane] ---> Package perl-Socket.x86_64 0:2.010-5.el7 will be installed
[openshift/origin-control-plane] ---> Package perl-Storable.x86_64 0:2.45-3.el7 will be installed
[openshift/origin-control-plane] ---> Package perl-Text-ParseWords.noarch 0:3.29-4.el7 will be installed
[openshift/origin-control-plane] ---> Package perl-Time-HiRes.x86_64 4:1.9725-3.el7 will be installed
[openshift/origin-control-plane] ---> Package perl-Time-Local.noarch 0:1.2300-2.el7 will be installed
[openshift/origin-control-plane] ---> Package perl-constant.noarch 0:1.27-2.el7 will be installed
[openshift/origin-control-plane] ---> Package perl-libs.x86_64 4:5.16.3-299.el7_9 will be installed
[openshift/origin-control-plane] ---> Package perl-macros.x86_64 4:5.16.3-299.el7_9 will be installed
[openshift/origin-control-plane] ---> Package perl-threads.x86_64 0:1.87-4.el7 will be installed
[openshift/origin-control-plane] ---> Package perl-threads-shared.x86_64 0:1.43-6.el7 will be installed
[openshift/origin-control-plane] ---> Package python-backports-ssl_match_hostname.noarch 0:3.5.0.1-1.el7 will be installed
[openshift/origin-control-plane] --> Processing Dependency: python-backports for package: python-backports-ssl_match_hostname-3.5.0.1-1.el7.noarch
[openshift/origin-control-plane] ---> Package python-ipaddress.noarch 0:1.0.16-2.el7 will be installed
[openshift/origin-control-plane] ---> Package python-six.noarch 0:1.9.0-2.el7 will be installed
[openshift/origin-control-plane] ---> Package userspace-rcu.x86_64 0:0.10.0-3.el7 will be installed
[openshift/origin-control-plane] --> Running transaction check
[openshift/origin-control-plane] ---> Package hwdata.x86_64 0:0.252-9.7.el7 will be installed
[openshift/origin-control-plane] ---> Package iproute.x86_64 0:4.11.0-30.el7 will be installed
[openshift/origin-control-plane] ---> Package pciutils-libs.x86_64 0:3.5.1-3.el7 will be installed
[openshift/origin-control-plane] ---> Package perl-Encode.x86_64 0:2.51-7.el7 will be installed
[openshift/origin-control-plane] ---> Package perl-Pod-Escapes.noarch 1:1.04-299.el7_9 will be installed
[openshift/origin-control-plane] ---> Package perl-Pod-Perldoc.noarch 0:3.20-4.el7 will be installed
[openshift/origin-control-plane] --> Processing Dependency: perl(parent) for package: perl-Pod-Perldoc-3.20-4.el7.noarch
[openshift/origin-control-plane] --> Processing Dependency: perl(HTTP::Tiny) for package: perl-Pod-Perldoc-3.20-4.el7.noarch
[openshift/origin-control-plane] --> Processing Dependency: groff-base for package: perl-Pod-Perldoc-3.20-4.el7.noarch
[openshift/origin-control-plane] ---> Package perl-podlators.noarch 0:2.5.1-3.el7 will be installed
[openshift/origin-control-plane] ---> Package python-backports.x86_64 0:1.0-8.el7 will be installed
[openshift/origin-control-plane] --> Running transaction check
[openshift/origin-control-plane] ---> Package groff-base.x86_64 0:1.22.2-8.el7 will be installed
[openshift/origin-control-plane] ---> Package perl-HTTP-Tiny.noarch 0:0.033-3.el7 will be installed
[openshift/origin-control-plane] ---> Package perl-parent.noarch 1:0.225-244.el7 will be installed
[openshift/origin-control-plane] --> Finished Dependency Resolution
[openshift/origin-control-plane] Dependencies Resolved
[openshift/origin-control-plane] ================================================================================
[openshift/origin-control-plane]  Package                 Arch   Version              Repository            Size
[openshift/origin-control-plane] ================================================================================
[openshift/origin-control-plane] Installing:
[openshift/origin-control-plane]  ceph-common             x86_64 2:12.2.11-0.el7      centos-ceph-luminous  15 M
[openshift/origin-control-plane]  origin                  x86_64 3.11.0-1.522.9cb9d16 origin-local-release  36 M
[openshift/origin-control-plane] Installing for dependencies:
[openshift/origin-control-plane]  fuse-libs               x86_64 2.9.2-11.el7         base                  93 k
[openshift/origin-control-plane]  gperftools-libs         x86_64 2.6.1-1.el7          base                 272 k
[openshift/origin-control-plane]  groff-base              x86_64 1.22.2-8.el7         base                 942 k
[openshift/origin-control-plane]  hwdata                  x86_64 0.252-9.7.el7        base                 2.5 M
[openshift/origin-control-plane]  initscripts             x86_64 9.49.53-1.el7_9.1    updates              440 k
[openshift/origin-control-plane]  iproute                 x86_64 4.11.0-30.el7        base                 805 k
[openshift/origin-control-plane]  iptables                x86_64 1.4.21-35.el7        base                 432 k
[openshift/origin-control-plane]  leveldb                 x86_64 1.12.0-5.el7.1       centos-ceph-luminous 160 k
[openshift/origin-control-plane]  libaio                  x86_64 0.3.109-13.el7       base                  24 k
[openshift/origin-control-plane]  libbabeltrace           x86_64 1.2.4-3.1.el7        centos-ceph-luminous 146 k
[openshift/origin-control-plane]  libcephfs2              x86_64 2:12.2.11-0.el7      centos-ceph-luminous 436 k
[openshift/origin-control-plane]  libibverbs              x86_64 22.4-6.el7_9         updates              269 k
[openshift/origin-control-plane]  libmnl                  x86_64 1.0.3-7.el7          base                  23 k
[openshift/origin-control-plane]  libnetfilter_conntrack  x86_64 1.0.6-1.el7_3        base                  55 k
[openshift/origin-control-plane]  libnfnetlink            x86_64 1.0.1-4.el7          base                  26 k
[openshift/origin-control-plane]  libnl3                  x86_64 3.2.28-4.el7         base                 278 k
[openshift/origin-control-plane]  librados2               x86_64 2:12.2.11-0.el7      centos-ceph-luminous 2.9 M
[openshift/origin-control-plane]  libradosstriper1        x86_64 2:12.2.11-0.el7      centos-ceph-luminous 331 k
[openshift/origin-control-plane]  librbd1                 x86_64 2:12.2.11-0.el7      centos-ceph-luminous 1.1 M
[openshift/origin-control-plane]  librgw2                 x86_64 2:12.2.11-0.el7      centos-ceph-luminous 1.7 M
[openshift/origin-control-plane]  lttng-ust               x86_64 2.10.0-1.el7         centos-ceph-luminous 245 k
[openshift/origin-control-plane]  pciutils                x86_64 3.5.1-3.el7          base                  93 k
[openshift/origin-control-plane]  pciutils-libs           x86_64 3.5.1-3.el7          base                  46 k
[openshift/origin-control-plane]  perl                    x86_64 4:5.16.3-299.el7_9   updates              8.0 M
[openshift/origin-control-plane]  perl-Carp               noarch 1.26-244.el7         base                  19 k
[openshift/origin-control-plane]  perl-Encode             x86_64 2.51-7.el7           base                 1.5 M
[openshift/origin-control-plane]  perl-Exporter           noarch 5.68-3.el7           base                  28 k
[openshift/origin-control-plane]  perl-File-Path          noarch 2.09-2.el7           base                  26 k
[openshift/origin-control-plane]  perl-File-Temp          noarch 0.23.01-3.el7        base                  56 k
[openshift/origin-control-plane]  perl-Filter             x86_64 1.49-3.el7           base                  76 k
[openshift/origin-control-plane]  perl-Getopt-Long        noarch 2.40-3.el7           base                  56 k
[openshift/origin-control-plane]  perl-HTTP-Tiny          noarch 0.033-3.el7          base                  38 k
[openshift/origin-control-plane]  perl-PathTools          x86_64 3.40-5.el7           base                  82 k
[openshift/origin-control-plane]  perl-Pod-Escapes        noarch 1:1.04-299.el7_9     updates               52 k
[openshift/origin-control-plane]  perl-Pod-Perldoc        noarch 3.20-4.el7           base                  87 k
[openshift/origin-control-plane]  perl-Pod-Simple         noarch 1:3.28-4.el7         base                 216 k
[openshift/origin-control-plane]  perl-Pod-Usage          noarch 1.63-3.el7           base                  27 k
[openshift/origin-control-plane]  perl-Scalar-List-Utils  x86_64 1.27-248.el7         base                  36 k
[openshift/origin-control-plane]  perl-Socket             x86_64 2.010-5.el7          base                  49 k
[openshift/origin-control-plane]  perl-Storable           x86_64 2.45-3.el7           base                  77 k
[openshift/origin-control-plane]  perl-Text-ParseWords    noarch 3.29-4.el7           base                  14 k
[openshift/origin-control-plane]  perl-Time-HiRes         x86_64 4:1.9725-3.el7       base                  45 k
[openshift/origin-control-plane]  perl-Time-Local         noarch 1.2300-2.el7         base                  24 k
[openshift/origin-control-plane]  perl-constant           noarch 1.27-2.el7           base                  19 k
[openshift/origin-control-plane]  perl-libs               x86_64 4:5.16.3-299.el7_9   updates              690 k
[openshift/origin-control-plane]  perl-macros             x86_64 4:5.16.3-299.el7_9   updates               44 k
[openshift/origin-control-plane]  perl-parent             noarch 1:0.225-244.el7      base                  12 k
[openshift/origin-control-plane]  perl-podlators          noarch 2.5.1-3.el7          base                 112 k
[openshift/origin-control-plane]  perl-threads            x86_64 1.87-4.el7           base                  49 k
[openshift/origin-control-plane]  perl-threads-shared     x86_64 1.43-6.el7           base                  39 k
[openshift/origin-control-plane]  python-backports        x86_64 1.0-8.el7            base                 5.8 k
[openshift/origin-control-plane]  python-backports-ssl_match_hostname
[openshift/origin-control-plane]                          noarch 3.5.0.1-1.el7        base                  13 k
[openshift/origin-control-plane]  python-cephfs           x86_64 2:12.2.11-0.el7      centos-ceph-luminous  83 k
[openshift/origin-control-plane]  python-ipaddress        noarch 1.0.16-2.el7         base                  34 k
[openshift/origin-control-plane]  python-prettytable      noarch 0.7.2-3.el7          base                  37 k
[openshift/origin-control-plane]  python-rados            x86_64 2:12.2.11-0.el7      centos-ceph-luminous 175 k
[openshift/origin-control-plane]  python-rbd              x86_64 2:12.2.11-0.el7      centos-ceph-luminous 106 k
[openshift/origin-control-plane]  python-requests         noarch 2.6.0-10.el7         base                  95 k
[openshift/origin-control-plane]  python-rgw              x86_64 2:12.2.11-0.el7      centos-ceph-luminous  72 k
[openshift/origin-control-plane]  python-six              noarch 1.9.0-2.el7          base                  29 k
[openshift/origin-control-plane]  python-urllib3          noarch 1.10.2-7.el7         base                 103 k
[openshift/origin-control-plane]  rdma-core               x86_64 22.4-6.el7_9         updates               51 k
[openshift/origin-control-plane]  snappy                  x86_64 1.1.0-3.el7          base                  40 k
[openshift/origin-control-plane]  userspace-rcu           x86_64 0.10.0-3.el7         centos-ceph-luminous  93 k
[openshift/origin-control-plane] Transaction Summary
[openshift/origin-control-plane] ================================================================================
[openshift/origin-control-plane] Install  2 Packages (+64 Dependent packages)
[openshift/origin-control-plane] Total download size: 77 M
[openshift/origin-control-plane] Installed size: 404 M
[openshift/origin-control-plane] Downloading packages:
[openshift/origin-control-plane] Public key for ceph-common-12.2.11-0.el7.x86_64.rpm is not installed
[openshift/origin-control-plane] warning: /var/cache/yum/x86_64/7/centos-ceph-luminous/packages/ceph-common-12.2.11-0.el7.x86_64.rpm: Header V4 RSA/SHA1 Signature, key ID e451e5b5: NOKEY
[openshift/origin-control-plane] --------------------------------------------------------------------------------
[openshift/origin-control-plane] Total                                               20 MB/s |  77 MB  00:03     
[openshift/origin-control-plane] Retrieving key from file:///etc/pki/rpm-gpg/RPM-GPG-KEY-CentOS-SIG-Storage
[openshift/origin-control-plane] Importing GPG key 0xE451E5B5:
[openshift/origin-control-plane]  Userid     : "CentOS Storage SIG (http://wiki.centos.org/SpecialInterestGroup/Storage) <security@centos.org>"
[openshift/origin-control-plane]  Fingerprint: 7412 9c0b 173b 071a 3775 951a d4a2 e50b e451 e5b5
[openshift/origin-control-plane]  Package    : centos-release-storage-common-2-2.el7.centos.noarch (@extras)
[openshift/origin-control-plane]  From       : /etc/pki/rpm-gpg/RPM-GPG-KEY-CentOS-SIG-Storage
[openshift/origin-control-plane] Running transaction check
[openshift/origin-control-plane] Running transaction test
[openshift/origin-control-plane] Transaction test succeeded
[openshift/origin-control-plane] Running transaction
[openshift/origin-control-plane]   Installing : python-ipaddress-1.0.16-2.el7.noarch                        1/66 
[openshift/origin-control-plane]   Installing : libnfnetlink-1.0.1-4.el7.x86_64                             2/66 
[openshift/origin-control-plane]   Installing : snappy-1.1.0-3.el7.x86_64                                   3/66 
[openshift/origin-control-plane]   Installing : libmnl-1.0.3-7.el7.x86_64                                   4/66 
[openshift/origin-control-plane]   Installing : libnetfilter_conntrack-1.0.6-1.el7_3.x86_64                 5/66 
[openshift/origin-control-plane]   Installing : iptables-1.4.21-35.el7.x86_64                               6/66 
[openshift/origin-control-plane]   Installing : iproute-4.11.0-30.el7.x86_64                                7/66 
[openshift/origin-control-plane]   Installing : initscripts-9.49.53-1.el7_9.1.x86_64                        8/66 
[openshift/origin-control-plane]   Installing : leveldb-1.12.0-5.el7.1.x86_64                               9/66 
[openshift/origin-control-plane]   Installing : libnl3-3.2.28-4.el7.x86_64                                 10/66 
[openshift/origin-control-plane]   Installing : gperftools-libs-2.6.1-1.el7.x86_64                         11/66 
[openshift/origin-control-plane]   Installing : python-prettytable-0.7.2-3.el7.noarch                      12/66 
[openshift/origin-control-plane]   Installing : userspace-rcu-0.10.0-3.el7.x86_64                          13/66 
[openshift/origin-control-plane]   Installing : lttng-ust-2.10.0-1.el7.x86_64                              14/66 
[openshift/origin-control-plane]   Installing : python-backports-1.0-8.el7.x86_64                          15/66 
[openshift/origin-control-plane]   Installing : python-backports-ssl_match_hostname-3.5.0.1-1.el7.noarch   16/66 
[openshift/origin-control-plane]   Installing : libaio-0.3.109-13.el7.x86_64                               17/66 
[openshift/origin-control-plane]   Installing : python-six-1.9.0-2.el7.noarch                              18/66 
[openshift/origin-control-plane]   Installing : python-urllib3-1.10.2-7.el7.noarch                         19/66 
[openshift/origin-control-plane]   Installing : python-requests-2.6.0-10.el7.noarch                        20/66 
[openshift/origin-control-plane]   Installing : groff-base-1.22.2-8.el7.x86_64                             21/66 
[openshift/origin-control-plane]   Installing : 1:perl-parent-0.225-244.el7.noarch                         22/66 
[openshift/origin-control-plane]   Installing : perl-HTTP-Tiny-0.033-3.el7.noarch                          23/66 
[openshift/origin-control-plane]   Installing : perl-podlators-2.5.1-3.el7.noarch                          24/66 
[openshift/origin-control-plane]   Installing : perl-Pod-Perldoc-3.20-4.el7.noarch                         25/66 
[openshift/origin-control-plane]   Installing : 1:perl-Pod-Escapes-1.04-299.el7_9.noarch                   26/66 
[openshift/origin-control-plane]   Installing : perl-Encode-2.51-7.el7.x86_64                              27/66 
[openshift/origin-control-plane]   Installing : perl-Text-ParseWords-3.29-4.el7.noarch                     28/66 
[openshift/origin-control-plane]   Installing : perl-Pod-Usage-1.63-3.el7.noarch                           29/66 
[openshift/origin-control-plane]   Installing : 4:perl-macros-5.16.3-299.el7_9.x86_64                      30/66 
[openshift/origin-control-plane]   Installing : perl-threads-1.87-4.el7.x86_64                             31/66 
[openshift/origin-control-plane]   Installing : 4:perl-Time-HiRes-1.9725-3.el7.x86_64                      32/66 
[openshift/origin-control-plane]   Installing : perl-Exporter-5.68-3.el7.noarch                            33/66 
[openshift/origin-control-plane]   Installing : perl-Socket-2.010-5.el7.x86_64                             34/66 
[openshift/origin-control-plane]   Installing : perl-Carp-1.26-244.el7.noarch                              35/66 
[openshift/origin-control-plane]   Installing : perl-threads-shared-1.43-6.el7.x86_64                      36/66 
[openshift/origin-control-plane]   Installing : perl-PathTools-3.40-5.el7.x86_64                           37/66 
[openshift/origin-control-plane]   Installing : perl-Scalar-List-Utils-1.27-248.el7.x86_64                 38/66 
[openshift/origin-control-plane]   Installing : perl-Storable-2.45-3.el7.x86_64                            39/66 
[openshift/origin-control-plane]   Installing : perl-Time-Local-1.2300-2.el7.noarch                        40/66 
[openshift/origin-control-plane]   Installing : 1:perl-Pod-Simple-3.28-4.el7.noarch                        41/66 
[openshift/origin-control-plane]   Installing : perl-constant-1.27-2.el7.noarch                            42/66 
[openshift/origin-control-plane]   Installing : perl-File-Temp-0.23.01-3.el7.noarch                        43/66 
[openshift/origin-control-plane]   Installing : perl-File-Path-2.09-2.el7.noarch                           44/66 
[openshift/origin-control-plane]   Installing : perl-Filter-1.49-3.el7.x86_64                              45/66 
[openshift/origin-control-plane]   Installing : 4:perl-libs-5.16.3-299.el7_9.x86_64                        46/66 
[openshift/origin-control-plane]   Installing : perl-Getopt-Long-2.40-3.el7.noarch                         47/66 
[openshift/origin-control-plane]   Installing : 4:perl-5.16.3-299.el7_9.x86_64                             48/66 
[openshift/origin-control-plane]   Installing : pciutils-libs-3.5.1-3.el7.x86_64                           49/66 
[openshift/origin-control-plane]   Installing : libbabeltrace-1.2.4-3.1.el7.x86_64                         50/66 
[openshift/origin-control-plane]   Installing : hwdata-0.252-9.7.el7.x86_64                                51/66 
[openshift/origin-control-plane]   Installing : pciutils-3.5.1-3.el7.x86_64                                52/66 
[openshift/origin-control-plane]   Installing : rdma-core-22.4-6.el7_9.x86_64                              53/66 
[openshift/origin-control-plane]   Installing : libibverbs-22.4-6.el7_9.x86_64                             54/66 
[openshift/origin-control-plane]   Installing : 2:librados2-12.2.11-0.el7.x86_64                           55/66 
[openshift/origin-control-plane]   Installing : 2:python-rados-12.2.11-0.el7.x86_64                        56/66 
[openshift/origin-control-plane]   Installing : 2:librbd1-12.2.11-0.el7.x86_64                             57/66 
[openshift/origin-control-plane]   Installing : 2:libcephfs2-12.2.11-0.el7.x86_64                          58/66 
[openshift/origin-control-plane]   Installing : 2:python-cephfs-12.2.11-0.el7.x86_64                       59/66 
[openshift/origin-control-plane]   Installing : 2:python-rbd-12.2.11-0.el7.x86_64                          60/66 
[openshift/origin-control-plane]   Installing : 2:librgw2-12.2.11-0.el7.x86_64                             61/66 
[openshift/origin-control-plane]   Installing : 2:python-rgw-12.2.11-0.el7.x86_64                          62/66 
[openshift/origin-control-plane]   Installing : 2:libradosstriper1-12.2.11-0.el7.x86_64                    63/66 
[openshift/origin-control-plane]   Installing : fuse-libs-2.9.2-11.el7.x86_64                              64/66 
[openshift/origin-control-plane]   Installing : 2:ceph-common-12.2.11-0.el7.x86_64                         65/66 
[openshift/origin-control-plane]   Installing : origin-3.11.0-1.522.9cb9d16.x86_64                         66/66 
[openshift/origin-control-plane]   Verifying  : perl-HTTP-Tiny-0.033-3.el7.noarch                           1/66 
[openshift/origin-control-plane]   Verifying  : fuse-libs-2.9.2-11.el7.x86_64                               2/66 
[openshift/origin-control-plane]   Verifying  : python-backports-ssl_match_hostname-3.5.0.1-1.el7.noarch    3/66 
[openshift/origin-control-plane]   Verifying  : libmnl-1.0.3-7.el7.x86_64                                   4/66 
[openshift/origin-control-plane]   Verifying  : leveldb-1.12.0-5.el7.1.x86_64                               5/66 
[openshift/origin-control-plane]   Verifying  : hwdata-0.252-9.7.el7.x86_64                                 6/66 
[openshift/origin-control-plane]   Verifying  : perl-threads-shared-1.43-6.el7.x86_64                       7/66 
[openshift/origin-control-plane]   Verifying  : 4:perl-Time-HiRes-1.9725-3.el7.x86_64                       8/66 
[openshift/origin-control-plane]   Verifying  : perl-threads-1.87-4.el7.x86_64                              9/66 
[openshift/origin-control-plane]   Verifying  : perl-Exporter-5.68-3.el7.noarch                            10/66 
[openshift/origin-control-plane]   Verifying  : lttng-ust-2.10.0-1.el7.x86_64                              11/66 
[openshift/origin-control-plane]   Verifying  : perl-PathTools-3.40-5.el7.x86_64                           12/66 
[openshift/origin-control-plane]   Verifying  : libbabeltrace-1.2.4-3.1.el7.x86_64                         13/66 
[openshift/origin-control-plane]   Verifying  : libibverbs-22.4-6.el7_9.x86_64                             14/66 
[openshift/origin-control-plane]   Verifying  : rdma-core-22.4-6.el7_9.x86_64                              15/66 
[openshift/origin-control-plane]   Verifying  : pciutils-libs-3.5.1-3.el7.x86_64                           16/66 
[openshift/origin-control-plane]   Verifying  : 2:librgw2-12.2.11-0.el7.x86_64                             17/66 
[openshift/origin-control-plane]   Verifying  : perl-Socket-2.010-5.el7.x86_64                             18/66 
[openshift/origin-control-plane]   Verifying  : python-urllib3-1.10.2-7.el7.noarch                         19/66 
[openshift/origin-control-plane]   Verifying  : 1:perl-parent-0.225-244.el7.noarch                         20/66 
[openshift/origin-control-plane]   Verifying  : 4:perl-macros-5.16.3-299.el7_9.x86_64                      21/66 
[openshift/origin-control-plane]   Verifying  : snappy-1.1.0-3.el7.x86_64                                  22/66 
[openshift/origin-control-plane]   Verifying  : initscripts-9.49.53-1.el7_9.1.x86_64                       23/66 
[openshift/origin-control-plane]   Verifying  : 1:perl-Pod-Simple-3.28-4.el7.noarch                        24/66 
[openshift/origin-control-plane]   Verifying  : 2:ceph-common-12.2.11-0.el7.x86_64                         25/66 
[openshift/origin-control-plane]   Verifying  : groff-base-1.22.2-8.el7.x86_64                             26/66 
[openshift/origin-control-plane]   Verifying  : perl-File-Temp-0.23.01-3.el7.noarch                        27/66 
[openshift/origin-control-plane]   Verifying  : pciutils-3.5.1-3.el7.x86_64                                28/66 
[openshift/origin-control-plane]   Verifying  : 2:python-cephfs-12.2.11-0.el7.x86_64                       29/66 
[openshift/origin-control-plane]   Verifying  : perl-Getopt-Long-2.40-3.el7.noarch                         30/66 
[openshift/origin-control-plane]   Verifying  : perl-Time-Local-1.2300-2.el7.noarch                        31/66 
[openshift/origin-control-plane]   Verifying  : iproute-4.11.0-30.el7.x86_64                               32/66 
[openshift/origin-control-plane]   Verifying  : 1:perl-Pod-Escapes-1.04-299.el7_9.noarch                   33/66 
[openshift/origin-control-plane]   Verifying  : perl-Pod-Perldoc-3.20-4.el7.noarch                         34/66 
[openshift/origin-control-plane]   Verifying  : python-six-1.9.0-2.el7.noarch                              35/66 
[openshift/origin-control-plane]   Verifying  : libaio-0.3.109-13.el7.x86_64                               36/66 
[openshift/origin-control-plane]   Verifying  : 2:librados2-12.2.11-0.el7.x86_64                           37/66 
[openshift/origin-control-plane]   Verifying  : perl-Carp-1.26-244.el7.noarch                              38/66 
[openshift/origin-control-plane]   Verifying  : 2:libradosstriper1-12.2.11-0.el7.x86_64                    39/66 
[openshift/origin-control-plane]   Verifying  : 2:python-rbd-12.2.11-0.el7.x86_64                          40/66 
[openshift/origin-control-plane]   Verifying  : python-backports-1.0-8.el7.x86_64                          41/66 
[openshift/origin-control-plane]   Verifying  : userspace-rcu-0.10.0-3.el7.x86_64                          42/66 
[openshift/origin-control-plane]   Verifying  : 2:librbd1-12.2.11-0.el7.x86_64                             43/66 
[openshift/origin-control-plane]   Verifying  : perl-Scalar-List-Utils-1.27-248.el7.x86_64                 44/66 
[openshift/origin-control-plane]   Verifying  : 2:python-rados-12.2.11-0.el7.x86_64                        45/66 
[openshift/origin-control-plane]   Verifying  : perl-Pod-Usage-1.63-3.el7.noarch                           46/66 
[openshift/origin-control-plane]   Verifying  : iptables-1.4.21-35.el7.x86_64                              47/66 
[openshift/origin-control-plane]   Verifying  : perl-Encode-2.51-7.el7.x86_64                              48/66 
[openshift/origin-control-plane]   Verifying  : python-prettytable-0.7.2-3.el7.noarch                      49/66 
[openshift/origin-control-plane]   Verifying  : libnfnetlink-1.0.1-4.el7.x86_64                            50/66 
[openshift/origin-control-plane]   Verifying  : perl-Storable-2.45-3.el7.x86_64                            51/66 
[openshift/origin-control-plane]   Verifying  : python-requests-2.6.0-10.el7.noarch                        52/66 
[openshift/origin-control-plane]   Verifying  : perl-podlators-2.5.1-3.el7.noarch                          53/66 
[openshift/origin-control-plane]   Verifying  : perl-constant-1.27-2.el7.noarch                            54/66 
[openshift/origin-control-plane]   Verifying  : 4:perl-5.16.3-299.el7_9.x86_64                             55/66 
[openshift/origin-control-plane]   Verifying  : perl-File-Path-2.09-2.el7.noarch                           56/66 
[openshift/origin-control-plane]   Verifying  : 2:python-rgw-12.2.11-0.el7.x86_64                          57/66 
[openshift/origin-control-plane]   Verifying  : gperftools-libs-2.6.1-1.el7.x86_64                         58/66 
[openshift/origin-control-plane]   Verifying  : libnl3-3.2.28-4.el7.x86_64                                 59/66 
[openshift/origin-control-plane]   Verifying  : python-ipaddress-1.0.16-2.el7.noarch                       60/66 
[openshift/origin-control-plane]   Verifying  : origin-3.11.0-1.522.9cb9d16.x86_64                         61/66 
[openshift/origin-control-plane]   Verifying  : perl-Filter-1.49-3.el7.x86_64                              62/66 
[openshift/origin-control-plane]   Verifying  : libnetfilter_conntrack-1.0.6-1.el7_3.x86_64                63/66 
[openshift/origin-control-plane]   Verifying  : perl-Text-ParseWords-3.29-4.el7.noarch                     64/66 
[openshift/origin-control-plane]   Verifying  : 4:perl-libs-5.16.3-299.el7_9.x86_64                        65/66 
[openshift/origin-control-plane]   Verifying  : 2:libcephfs2-12.2.11-0.el7.x86_64                          66/66 
[openshift/origin-control-plane] Installed:
[openshift/origin-control-plane]   ceph-common.x86_64 2:12.2.11-0.el7    origin.x86_64 0:3.11.0-1.522.9cb9d16   
[openshift/origin-control-plane] Dependency Installed:
[openshift/origin-control-plane]   fuse-libs.x86_64 0:2.9.2-11.el7                                               
[openshift/origin-control-plane]   gperftools-libs.x86_64 0:2.6.1-1.el7                                          
[openshift/origin-control-plane]   groff-base.x86_64 0:1.22.2-8.el7                                              
[openshift/origin-control-plane]   hwdata.x86_64 0:0.252-9.7.el7                                                 
[openshift/origin-control-plane]   initscripts.x86_64 0:9.49.53-1.el7_9.1                                        
[openshift/origin-control-plane]   iproute.x86_64 0:4.11.0-30.el7                                                
[openshift/origin-control-plane]   iptables.x86_64 0:1.4.21-35.el7                                               
[openshift/origin-control-plane]   leveldb.x86_64 0:1.12.0-5.el7.1                                               
[openshift/origin-control-plane]   libaio.x86_64 0:0.3.109-13.el7                                                
[openshift/origin-control-plane]   libbabeltrace.x86_64 0:1.2.4-3.1.el7                                          
[openshift/origin-control-plane]   libcephfs2.x86_64 2:12.2.11-0.el7                                             
[openshift/origin-control-plane]   libibverbs.x86_64 0:22.4-6.el7_9                                              
[openshift/origin-control-plane]   libmnl.x86_64 0:1.0.3-7.el7                                                   
[openshift/origin-control-plane]   libnetfilter_conntrack.x86_64 0:1.0.6-1.el7_3                                 
[openshift/origin-control-plane]   libnfnetlink.x86_64 0:1.0.1-4.el7                                             
[openshift/origin-control-plane]   libnl3.x86_64 0:3.2.28-4.el7                                                  
[openshift/origin-control-plane]   librados2.x86_64 2:12.2.11-0.el7                                              
[openshift/origin-control-plane]   libradosstriper1.x86_64 2:12.2.11-0.el7                                       
[openshift/origin-control-plane]   librbd1.x86_64 2:12.2.11-0.el7                                                
[openshift/origin-control-plane]   librgw2.x86_64 2:12.2.11-0.el7                                                
[openshift/origin-control-plane]   lttng-ust.x86_64 0:2.10.0-1.el7                                               
[openshift/origin-control-plane]   pciutils.x86_64 0:3.5.1-3.el7                                                 
[openshift/origin-control-plane]   pciutils-libs.x86_64 0:3.5.1-3.el7                                            
[openshift/origin-control-plane]   perl.x86_64 4:5.16.3-299.el7_9                                                
[openshift/origin-control-plane]   perl-Carp.noarch 0:1.26-244.el7                                               
[openshift/origin-control-plane]   perl-Encode.x86_64 0:2.51-7.el7                                               
[openshift/origin-control-plane]   perl-Exporter.noarch 0:5.68-3.el7                                             
[openshift/origin-control-plane]   perl-File-Path.noarch 0:2.09-2.el7                                            
[openshift/origin-control-plane]   perl-File-Temp.noarch 0:0.23.01-3.el7                                         
[openshift/origin-control-plane]   perl-Filter.x86_64 0:1.49-3.el7                                               
[openshift/origin-control-plane]   perl-Getopt-Long.noarch 0:2.40-3.el7                                          
[openshift/origin-control-plane]   perl-HTTP-Tiny.noarch 0:0.033-3.el7                                           
[openshift/origin-control-plane]   perl-PathTools.x86_64 0:3.40-5.el7                                            
[openshift/origin-control-plane]   perl-Pod-Escapes.noarch 1:1.04-299.el7_9                                      
[openshift/origin-control-plane]   perl-Pod-Perldoc.noarch 0:3.20-4.el7                                          
[openshift/origin-control-plane]   perl-Pod-Simple.noarch 1:3.28-4.el7                                           
[openshift/origin-control-plane]   perl-Pod-Usage.noarch 0:1.63-3.el7                                            
[openshift/origin-control-plane]   perl-Scalar-List-Utils.x86_64 0:1.27-248.el7                                  
[openshift/origin-control-plane]   perl-Socket.x86_64 0:2.010-5.el7                                              
[openshift/origin-control-plane]   perl-Storable.x86_64 0:2.45-3.el7                                             
[openshift/origin-control-plane]   perl-Text-ParseWords.noarch 0:3.29-4.el7                                      
[openshift/origin-control-plane]   perl-Time-HiRes.x86_64 4:1.9725-3.el7                                         
[openshift/origin-control-plane]   perl-Time-Local.noarch 0:1.2300-2.el7                                         
[openshift/origin-control-plane]   perl-constant.noarch 0:1.27-2.el7                                             
[openshift/origin-control-plane]   perl-libs.x86_64 4:5.16.3-299.el7_9                                           
[openshift/origin-control-plane]   perl-macros.x86_64 4:5.16.3-299.el7_9                                         
[openshift/origin-control-plane]   perl-parent.noarch 1:0.225-244.el7                                            
[openshift/origin-control-plane]   perl-podlators.noarch 0:2.5.1-3.el7                                           
[openshift/origin-control-plane]   perl-threads.x86_64 0:1.87-4.el7                                              
[openshift/origin-control-plane]   perl-threads-shared.x86_64 0:1.43-6.el7                                       
[openshift/origin-control-plane]   python-backports.x86_64 0:1.0-8.el7                                           
[openshift/origin-control-plane]   python-backports-ssl_match_hostname.noarch 0:3.5.0.1-1.el7                    
[openshift/origin-control-plane]   python-cephfs.x86_64 2:12.2.11-0.el7                                          
[openshift/origin-control-plane]   python-ipaddress.noarch 0:1.0.16-2.el7                                        
[openshift/origin-control-plane]   python-prettytable.noarch 0:0.7.2-3.el7                                       
[openshift/origin-control-plane]   python-rados.x86_64 2:12.2.11-0.el7                                           
[openshift/origin-control-plane]   python-rbd.x86_64 2:12.2.11-0.el7                                             
[openshift/origin-control-plane]   python-requests.noarch 0:2.6.0-10.el7                                         
[openshift/origin-control-plane]   python-rgw.x86_64 2:12.2.11-0.el7                                             
[openshift/origin-control-plane]   python-six.noarch 0:1.9.0-2.el7                                               
[openshift/origin-control-plane]   python-urllib3.noarch 0:1.10.2-7.el7                                          
[openshift/origin-control-plane]   rdma-core.x86_64 0:22.4-6.el7_9                                               
[openshift/origin-control-plane]   snappy.x86_64 0:1.1.0-3.el7                                                   
[openshift/origin-control-plane]   userspace-rcu.x86_64 0:0.10.0-3.el7                                           
[openshift/origin-control-plane] Complete!
[openshift/origin-control-plane] Loaded plugins: fastestmirror, ovl
[openshift/origin-control-plane] Cleaning repos: base cbs-paas7-openshift-multiarch-el7-build
[openshift/origin-control-plane]               : centos-ceph-luminous extras updates
[openshift/origin-control-plane] Cleaning up list of fastest mirrors
[openshift/origin-control-plane] --> LABEL io.k8s.display-name="OpenShift Application Platform"       io.k8s.description="OpenShift is a platform for developing, building, and deploying containerized applications."       io.openshift.tags="openshift,core"
[openshift/origin-control-plane] --> ENV HOME=/root     KUBECONFIG=/var/lib/origin/openshift.local.config/master/admin.kubeconfig
[openshift/origin-control-plane] --> WORKDIR /var/lib/origin
[openshift/origin-control-plane] --> EXPOSE 8443 53
[openshift/origin-control-plane] --> ENTRYPOINT ["/usr/bin/openshift"]
[openshift/origin-control-plane] --> Committing changes to openshift/origin-control-plane:v3.11.0 ...
[openshift/origin-control-plane] --> Tagged as openshift/origin-control-plane:latest
[openshift/origin-control-plane] --> Done
[openshift/origin-node] --> FROM openshift/origin-control-plane as 0
[openshift/origin-node] --> COPY scripts/* /usr/local/bin/
[openshift/origin-node] --> COPY system-container/system-container-wrapper.sh /usr/local/bin/
[openshift/origin-node] --> COPY system-container/manifest.json system-container/config.json.template system-container/service.template system-container/tmpfiles.template /exports/
[openshift/origin-node] --> RUN INSTALL_PKGS="       origin-hyperkube origin-node origin-sdn-ovs       socat ethtool device-mapper iptables nmap-ncat e2fsprogs       xfsprogs device-mapper-persistent-data ceph-common       libmnl libnetfilter_conntrack conntrack-tools       libnfnetlink iproute bridge-utils procps-ng openssl       binutils xz kmod-libs kmod sysvinit-tools device-mapper-libs dbus       iscsi-initiator-utils       " &&     yum install -y centos-release-ceph-luminous &&     rpm -V centos-release-ceph-luminous &&     yum --enablerepo=origin-local-release install -y $INSTALL_PKGS &&     rpm -V $INSTALL_PKGS &&     yum clean all
[openshift/origin-node] Loaded plugins: fastestmirror, ovl
[openshift/origin-node] Determining fastest mirrors
[openshift/origin-node]  * base: download.cf.centos.org
[openshift/origin-node]  * extras: download.cf.centos.org
[openshift/origin-node]  * updates: download.cf.centos.org
[openshift/origin-node] Package centos-release-ceph-luminous-1.1-2.el7.centos.noarch already installed and latest version
[openshift/origin-node] Nothing to do
[openshift/origin-node] Loaded plugins: fastestmirror, ovl
[openshift/origin-node] Loading mirror speeds from cached hostfile
[openshift/origin-node]  * base: download.cf.centos.org
[openshift/origin-node]  * extras: download.cf.centos.org
[openshift/origin-node]  * updates: download.cf.centos.org
[openshift/origin-node] Package socat-1.7.3.2-2.el7.x86_64 already installed and latest version
[openshift/origin-node] Package iptables-1.4.21-35.el7.x86_64 already installed and latest version
[openshift/origin-node] Package 2:ceph-common-12.2.11-0.el7.x86_64 already installed and latest version
[openshift/origin-node] Package libmnl-1.0.3-7.el7.x86_64 already installed and latest version
[openshift/origin-node] Package libnetfilter_conntrack-1.0.6-1.el7_3.x86_64 already installed and latest version
[openshift/origin-node] Package libnfnetlink-1.0.1-4.el7.x86_64 already installed and latest version
[openshift/origin-node] Package iproute-4.11.0-30.el7.x86_64 already installed and latest version
[openshift/origin-node] Package procps-ng-3.3.10-28.el7.x86_64 already installed and latest version
[openshift/origin-node] Package xz-5.2.2-1.el7.x86_64 already installed and latest version
[openshift/origin-node] Package kmod-libs-20-28.el7.x86_64 already installed and latest version
[openshift/origin-node] Package kmod-20-28.el7.x86_64 already installed and latest version
[openshift/origin-node] Package sysvinit-tools-2.88-14.dsf.el7.x86_64 already installed and latest version
[openshift/origin-node] Package 1:dbus-1.10.24-15.el7.x86_64 already installed and latest version
[openshift/origin-node] Resolving Dependencies
[openshift/origin-node] --> Running transaction check
[openshift/origin-node] ---> Package binutils.x86_64 0:2.27-44.base.el7 will be updated
[openshift/origin-node] ---> Package binutils.x86_64 0:2.27-44.base.el7_9.1 will be an update
[openshift/origin-node] ---> Package bridge-utils.x86_64 0:1.5-9.el7 will be installed
[openshift/origin-node] ---> Package conntrack-tools.x86_64 0:1.4.4-7.el7 will be installed
[openshift/origin-node] --> Processing Dependency: libnetfilter_cttimeout.so.1(LIBNETFILTER_CTTIMEOUT_1.1)(64bit) for package: conntrack-tools-1.4.4-7.el7.x86_64
[openshift/origin-node] --> Processing Dependency: libnetfilter_cttimeout.so.1(LIBNETFILTER_CTTIMEOUT_1.0)(64bit) for package: conntrack-tools-1.4.4-7.el7.x86_64
[openshift/origin-node] --> Processing Dependency: libnetfilter_cthelper.so.0(LIBNETFILTER_CTHELPER_1.0)(64bit) for package: conntrack-tools-1.4.4-7.el7.x86_64
[openshift/origin-node] --> Processing Dependency: libnetfilter_queue.so.1()(64bit) for package: conntrack-tools-1.4.4-7.el7.x86_64
[openshift/origin-node] --> Processing Dependency: libnetfilter_cttimeout.so.1()(64bit) for package: conntrack-tools-1.4.4-7.el7.x86_64
[openshift/origin-node] --> Processing Dependency: libnetfilter_cthelper.so.0()(64bit) for package: conntrack-tools-1.4.4-7.el7.x86_64
[openshift/origin-node] ---> Package device-mapper.x86_64 7:1.02.170-6.el7 will be updated
[openshift/origin-node] ---> Package device-mapper.x86_64 7:1.02.170-6.el7_9.5 will be an update
[openshift/origin-node] ---> Package device-mapper-libs.x86_64 7:1.02.170-6.el7 will be updated
[openshift/origin-node] ---> Package device-mapper-libs.x86_64 7:1.02.170-6.el7_9.5 will be an update
[openshift/origin-node] ---> Package device-mapper-persistent-data.x86_64 0:0.8.5-3.el7_9.2 will be installed
[openshift/origin-node] ---> Package e2fsprogs.x86_64 0:1.42.9-19.el7 will be installed
[openshift/origin-node] --> Processing Dependency: libss = 1.42.9-19.el7 for package: e2fsprogs-1.42.9-19.el7.x86_64
[openshift/origin-node] --> Processing Dependency: e2fsprogs-libs(x86-64) = 1.42.9-19.el7 for package: e2fsprogs-1.42.9-19.el7.x86_64
[openshift/origin-node] --> Processing Dependency: libss.so.2()(64bit) for package: e2fsprogs-1.42.9-19.el7.x86_64
[openshift/origin-node] --> Processing Dependency: libext2fs.so.2()(64bit) for package: e2fsprogs-1.42.9-19.el7.x86_64
[openshift/origin-node] --> Processing Dependency: libe2p.so.2()(64bit) for package: e2fsprogs-1.42.9-19.el7.x86_64
[openshift/origin-node] ---> Package ethtool.x86_64 2:4.8-10.el7 will be installed
[openshift/origin-node] ---> Package iscsi-initiator-utils.x86_64 0:6.2.0.874-22.el7_9 will be installed
[openshift/origin-node] --> Processing Dependency: iscsi-initiator-utils-iscsiuio >= 6.2.0.874-22.el7_9 for package: iscsi-initiator-utils-6.2.0.874-22.el7_9.x86_64
[openshift/origin-node] ---> Package nmap-ncat.x86_64 2:6.40-19.el7 will be installed
[openshift/origin-node] --> Processing Dependency: libpcap.so.1()(64bit) for package: 2:nmap-ncat-6.40-19.el7.x86_64
[openshift/origin-node] ---> Package openssl.x86_64 1:1.0.2k-24.el7_9 will be installed
[openshift/origin-node] --> Processing Dependency: openssl-libs(x86-64) = 1:1.0.2k-24.el7_9 for package: 1:openssl-1.0.2k-24.el7_9.x86_64
[openshift/origin-node] --> Processing Dependency: make for package: 1:openssl-1.0.2k-24.el7_9.x86_64
[openshift/origin-node] ---> Package origin-hyperkube.x86_64 0:3.11.0-1.522.9cb9d16 will be installed
[openshift/origin-node] ---> Package origin-node.x86_64 0:3.11.0-1.522.9cb9d16 will be installed
[openshift/origin-node] ---> Package origin-sdn-ovs.x86_64 0:3.11.0-1.522.9cb9d16 will be installed
[openshift/origin-node] --> Processing Dependency: openvswitch >= 2.6.1 for package: origin-sdn-ovs-3.11.0-1.522.9cb9d16.x86_64
[openshift/origin-node] --> Processing Dependency: selinux-policy for package: origin-sdn-ovs-3.11.0-1.522.9cb9d16.x86_64
[openshift/origin-node] ---> Package xfsprogs.x86_64 0:4.5.0-22.el7 will be installed
[openshift/origin-node] --> Running transaction check
[openshift/origin-node] ---> Package e2fsprogs-libs.x86_64 0:1.42.9-19.el7 will be installed
[openshift/origin-node] ---> Package iscsi-initiator-utils-iscsiuio.x86_64 0:6.2.0.874-22.el7_9 will be installed
[openshift/origin-node] ---> Package libnetfilter_cthelper.x86_64 0:1.0.0-11.el7 will be installed
[openshift/origin-node] ---> Package libnetfilter_cttimeout.x86_64 0:1.0.0-7.el7 will be installed
[openshift/origin-node] ---> Package libnetfilter_queue.x86_64 0:1.0.2-2.el7_2 will be installed
[openshift/origin-node] ---> Package libpcap.x86_64 14:1.5.3-12.el7 will be installed
[openshift/origin-node] ---> Package libss.x86_64 0:1.42.9-19.el7 will be installed
[openshift/origin-node] ---> Package make.x86_64 1:3.82-24.el7 will be installed
[openshift/origin-node] ---> Package openssl-libs.x86_64 1:1.0.2k-19.el7 will be updated
[openshift/origin-node] ---> Package openssl-libs.x86_64 1:1.0.2k-24.el7_9 will be an update
[openshift/origin-node] ---> Package openvswitch.x86_64 0:2.7.0-1.el7 will be installed
[openshift/origin-node] ---> Package selinux-policy.noarch 0:3.13.1-268.el7_9.2 will be installed
[openshift/origin-node] --> Processing Dependency: policycoreutils >= 2.5-24 for package: selinux-policy-3.13.1-268.el7_9.2.noarch
[openshift/origin-node] --> Running transaction check
[openshift/origin-node] ---> Package policycoreutils.x86_64 0:2.5-34.el7 will be installed
[openshift/origin-node] --> Processing Dependency: libselinux-utils >= 2.5-14 for package: policycoreutils-2.5-34.el7.x86_64
[openshift/origin-node] --> Running transaction check
[openshift/origin-node] ---> Package libselinux-utils.x86_64 0:2.5-15.el7 will be installed
[openshift/origin-node] --> Finished Dependency Resolution
[openshift/origin-node] Dependencies Resolved
[openshift/origin-node] ================================================================================
[openshift/origin-node]  Package                Arch   Version               Repository            Size
[openshift/origin-node] ================================================================================
[openshift/origin-node] Installing:
[openshift/origin-node]  bridge-utils           x86_64 1.5-9.el7             base                  32 k
[openshift/origin-node]  conntrack-tools        x86_64 1.4.4-7.el7           base                 187 k
[openshift/origin-node]  device-mapper-persistent-data
[openshift/origin-node]                         x86_64 0.8.5-3.el7_9.2       updates              423 k
[openshift/origin-node]  e2fsprogs              x86_64 1.42.9-19.el7         base                 701 k
[openshift/origin-node]  ethtool                x86_64 2:4.8-10.el7          base                 127 k
[openshift/origin-node]  iscsi-initiator-utils  x86_64 6.2.0.874-22.el7_9    updates              423 k
[openshift/origin-node]  nmap-ncat              x86_64 2:6.40-19.el7         base                 206 k
[openshift/origin-node]  openssl                x86_64 1:1.0.2k-24.el7_9     updates              494 k
[openshift/origin-node]  origin-hyperkube       x86_64 3.11.0-1.522.9cb9d16  origin-local-release  34 M
[openshift/origin-node]  origin-node            x86_64 3.11.0-1.522.9cb9d16  origin-local-release 6.2 M
[openshift/origin-node]  origin-sdn-ovs         x86_64 3.11.0-1.522.9cb9d16  origin-local-release 4.1 M
[openshift/origin-node]  xfsprogs               x86_64 4.5.0-22.el7          base                 897 k
[openshift/origin-node] Updating:
[openshift/origin-node]  binutils               x86_64 2.27-44.base.el7_9.1  updates              5.9 M
[openshift/origin-node]  device-mapper          x86_64 7:1.02.170-6.el7_9.5  updates              297 k
[openshift/origin-node]  device-mapper-libs     x86_64 7:1.02.170-6.el7_9.5  updates              325 k
[openshift/origin-node] Installing for dependencies:
[openshift/origin-node]  e2fsprogs-libs         x86_64 1.42.9-19.el7         base                 168 k
[openshift/origin-node]  iscsi-initiator-utils-iscsiuio
[openshift/origin-node]                         x86_64 6.2.0.874-22.el7_9    updates               94 k
[openshift/origin-node]  libnetfilter_cthelper  x86_64 1.0.0-11.el7          base                  18 k
[openshift/origin-node]  libnetfilter_cttimeout x86_64 1.0.0-7.el7           base                  18 k
[openshift/origin-node]  libnetfilter_queue     x86_64 1.0.2-2.el7_2         base                  23 k
[openshift/origin-node]  libpcap                x86_64 14:1.5.3-12.el7       base                 139 k
[openshift/origin-node]  libselinux-utils       x86_64 2.5-15.el7            base                 151 k
[openshift/origin-node]  libss                  x86_64 1.42.9-19.el7         base                  47 k
[openshift/origin-node]  make                   x86_64 1:3.82-24.el7         base                 421 k
[openshift/origin-node]  openvswitch            x86_64 2.7.0-1.el7           cbs-paas7-openshift-multiarch-el7-build
[openshift/origin-node]                                                                           2.5 M
[openshift/origin-node]  policycoreutils        x86_64 2.5-34.el7            base                 917 k
[openshift/origin-node]  selinux-policy         noarch 3.13.1-268.el7_9.2    updates              498 k
[openshift/origin-node] Updating for dependencies:
[openshift/origin-node]  openssl-libs           x86_64 1:1.0.2k-24.el7_9     updates              1.2 M
[openshift/origin-node] Transaction Summary
[openshift/origin-node] ================================================================================
[openshift/origin-node] Install  12 Packages (+12 Dependent packages)
[openshift/origin-node] Upgrade   3 Packages (+ 1 Dependent package)
[openshift/origin-node] Total download size: 61 M
[openshift/origin-node] Downloading packages:
[openshift/origin-node] Delta RPMs disabled because /usr/bin/applydeltarpm not installed.
[openshift/origin-node] --------------------------------------------------------------------------------
[openshift/origin-node] Total                                               49 MB/s |  61 MB  00:01     
[openshift/origin-node] Running transaction check
[openshift/origin-node] Running transaction test
[openshift/origin-node] Transaction test succeeded
[openshift/origin-node] Running transaction
[openshift/origin-node]   Updating   : 1:openssl-libs-1.0.2k-24.el7_9.x86_64                       1/32 
[openshift/origin-node]   Installing : iscsi-initiator-utils-6.2.0.874-22.el7_9.x86_64             2/32 
[openshift/origin-node]   Installing : iscsi-initiator-utils-iscsiuio-6.2.0.874-22.el7_9.x86_64    3/32 
[openshift/origin-node]   Updating   : 7:device-mapper-1.02.170-6.el7_9.5.x86_64                   4/32 
[openshift/origin-node]   Updating   : 7:device-mapper-libs-1.02.170-6.el7_9.5.x86_64              5/32 
[openshift/origin-node]   Installing : libss-1.42.9-19.el7.x86_64                                  6/32 
[openshift/origin-node]   Installing : libnetfilter_cthelper-1.0.0-11.el7.x86_64                   7/32 
[openshift/origin-node]   Installing : bridge-utils-1.5-9.el7.x86_64                               8/32 
[openshift/origin-node]   Installing : e2fsprogs-libs-1.42.9-19.el7.x86_64                         9/32 
[openshift/origin-node]   Installing : libnetfilter_cttimeout-1.0.0-7.el7.x86_64                  10/32 
[openshift/origin-node]   Installing : 1:make-3.82-24.el7.x86_64                                  11/32 
[openshift/origin-node]   Installing : 1:openssl-1.0.2k-24.el7_9.x86_64                           12/32 
[openshift/origin-node]   Installing : openvswitch-2.7.0-1.el7.x86_64                             13/32 
[openshift/origin-node]   Installing : libselinux-utils-2.5-15.el7.x86_64                         14/32 
[openshift/origin-node]   Installing : policycoreutils-2.5-34.el7.x86_64                          15/32 
[openshift/origin-node]   Installing : selinux-policy-3.13.1-268.el7_9.2.noarch                   16/32 
[openshift/origin-node]   Installing : origin-hyperkube-3.11.0-1.522.9cb9d16.x86_64               17/32 
[openshift/origin-node]   Installing : origin-node-3.11.0-1.522.9cb9d16.x86_64                    18/32 
[openshift/origin-node]   Installing : libnetfilter_queue-1.0.2-2.el7_2.x86_64                    19/32 
[openshift/origin-node]   Installing : conntrack-tools-1.4.4-7.el7.x86_64                         20/32 
[openshift/origin-node]   Installing : 14:libpcap-1.5.3-12.el7.x86_64                             21/32 
[openshift/origin-node]   Installing : 2:ethtool-4.8-10.el7.x86_64                                22/32 
[openshift/origin-node]   Installing : origin-sdn-ovs-3.11.0-1.522.9cb9d16.x86_64                 23/32 
[openshift/origin-node]   Installing : 2:nmap-ncat-6.40-19.el7.x86_64                             24/32 
[openshift/origin-node]   Installing : e2fsprogs-1.42.9-19.el7.x86_64                             25/32 
[openshift/origin-node]   Updating   : binutils-2.27-44.base.el7_9.1.x86_64                       26/32 
[openshift/origin-node] install-info: No such file or directory for /usr/share/info/as.info.gz
[openshift/origin-node] install-info: No such file or directory for /usr/share/info/binutils.info.gz
[openshift/origin-node] install-info: No such file or directory for /usr/share/info/gprof.info.gz
[openshift/origin-node] install-info: No such file or directory for /usr/share/info/ld.info.gz
[openshift/origin-node] install-info: No such file or directory for /usr/share/info/standards.info.gz
[openshift/origin-node]   Installing : xfsprogs-4.5.0-22.el7.x86_64                               27/32 
[openshift/origin-node]   Installing : device-mapper-persistent-data-0.8.5-3.el7_9.2.x86_64       28/32 
[openshift/origin-node]   Cleanup    : 7:device-mapper-1.02.170-6.el7.x86_64                      29/32 
[openshift/origin-node]   Cleanup    : 7:device-mapper-libs-1.02.170-6.el7.x86_64                 30/32 
[openshift/origin-node]   Cleanup    : binutils-2.27-44.base.el7.x86_64                           31/32 
[openshift/origin-node]   Cleanup    : 1:openssl-libs-1.0.2k-19.el7.x86_64                        32/32 
[openshift/origin-node]   Verifying  : iscsi-initiator-utils-iscsiuio-6.2.0.874-22.el7_9.x86_64    1/32 
[openshift/origin-node]   Verifying  : 2:ethtool-4.8-10.el7.x86_64                                 2/32 
[openshift/origin-node]   Verifying  : 1:openssl-libs-1.0.2k-24.el7_9.x86_64                       3/32 
[openshift/origin-node]   Verifying  : e2fsprogs-1.42.9-19.el7.x86_64                              4/32 
[openshift/origin-node]   Verifying  : 14:libpcap-1.5.3-12.el7.x86_64                              5/32 
[openshift/origin-node]   Verifying  : 7:device-mapper-libs-1.02.170-6.el7_9.5.x86_64              6/32 
[openshift/origin-node]   Verifying  : conntrack-tools-1.4.4-7.el7.x86_64                          7/32 
[openshift/origin-node]   Verifying  : device-mapper-persistent-data-0.8.5-3.el7_9.2.x86_64        8/32 
[openshift/origin-node]   Verifying  : policycoreutils-2.5-34.el7.x86_64                           9/32 
[openshift/origin-node]   Verifying  : libnetfilter_queue-1.0.2-2.el7_2.x86_64                    10/32 
[openshift/origin-node]   Verifying  : iscsi-initiator-utils-6.2.0.874-22.el7_9.x86_64            11/32 
[openshift/origin-node]   Verifying  : origin-hyperkube-3.11.0-1.522.9cb9d16.x86_64               12/32 
[openshift/origin-node]   Verifying  : xfsprogs-4.5.0-22.el7.x86_64                               13/32 
[openshift/origin-node]   Verifying  : libselinux-utils-2.5-15.el7.x86_64                         14/32 
[openshift/origin-node]   Verifying  : 1:make-3.82-24.el7.x86_64                                  15/32 
[openshift/origin-node]   Verifying  : libnetfilter_cttimeout-1.0.0-7.el7.x86_64                  16/32 
[openshift/origin-node]   Verifying  : 1:openssl-1.0.2k-24.el7_9.x86_64                           17/32 
[openshift/origin-node]   Verifying  : binutils-2.27-44.base.el7_9.1.x86_64                       18/32 
[openshift/origin-node]   Verifying  : e2fsprogs-libs-1.42.9-19.el7.x86_64                        19/32 
[openshift/origin-node]   Verifying  : openvswitch-2.7.0-1.el7.x86_64                             20/32 
[openshift/origin-node]   Verifying  : bridge-utils-1.5-9.el7.x86_64                              21/32 
[openshift/origin-node]   Verifying  : selinux-policy-3.13.1-268.el7_9.2.noarch                   22/32 
[openshift/origin-node]   Verifying  : libnetfilter_cthelper-1.0.0-11.el7.x86_64                  23/32 
[openshift/origin-node]   Verifying  : libss-1.42.9-19.el7.x86_64                                 24/32 
[openshift/origin-node]   Verifying  : origin-sdn-ovs-3.11.0-1.522.9cb9d16.x86_64                 25/32 
[openshift/origin-node]   Verifying  : origin-node-3.11.0-1.522.9cb9d16.x86_64                    26/32 
[openshift/origin-node]   Verifying  : 2:nmap-ncat-6.40-19.el7.x86_64                             27/32 
[openshift/origin-node]   Verifying  : 7:device-mapper-1.02.170-6.el7_9.5.x86_64                  28/32 
[openshift/origin-node]   Verifying  : binutils-2.27-44.base.el7.x86_64                           29/32 
[openshift/origin-node]   Verifying  : 7:device-mapper-1.02.170-6.el7.x86_64                      30/32 
[openshift/origin-node]   Verifying  : 7:device-mapper-libs-1.02.170-6.el7.x86_64                 31/32 
[openshift/origin-node]   Verifying  : 1:openssl-libs-1.0.2k-19.el7.x86_64                        32/32 
[openshift/origin-node] Installed:
[openshift/origin-node]   bridge-utils.x86_64 0:1.5-9.el7                                               
[openshift/origin-node]   conntrack-tools.x86_64 0:1.4.4-7.el7                                          
[openshift/origin-node]   device-mapper-persistent-data.x86_64 0:0.8.5-3.el7_9.2                        
[openshift/origin-node]   e2fsprogs.x86_64 0:1.42.9-19.el7                                              
[openshift/origin-node]   ethtool.x86_64 2:4.8-10.el7                                                   
[openshift/origin-node]   iscsi-initiator-utils.x86_64 0:6.2.0.874-22.el7_9                             
[openshift/origin-node]   nmap-ncat.x86_64 2:6.40-19.el7                                                
[openshift/origin-node]   openssl.x86_64 1:1.0.2k-24.el7_9                                              
[openshift/origin-node]   origin-hyperkube.x86_64 0:3.11.0-1.522.9cb9d16                                
[openshift/origin-node]   origin-node.x86_64 0:3.11.0-1.522.9cb9d16                                     
[openshift/origin-node]   origin-sdn-ovs.x86_64 0:3.11.0-1.522.9cb9d16                                  
[openshift/origin-node]   xfsprogs.x86_64 0:4.5.0-22.el7                                                
[openshift/origin-node] Dependency Installed:
[openshift/origin-node]   e2fsprogs-libs.x86_64 0:1.42.9-19.el7                                         
[openshift/origin-node]   iscsi-initiator-utils-iscsiuio.x86_64 0:6.2.0.874-22.el7_9                    
[openshift/origin-node]   libnetfilter_cthelper.x86_64 0:1.0.0-11.el7                                   
[openshift/origin-node]   libnetfilter_cttimeout.x86_64 0:1.0.0-7.el7                                   
[openshift/origin-node]   libnetfilter_queue.x86_64 0:1.0.2-2.el7_2                                     
[openshift/origin-node]   libpcap.x86_64 14:1.5.3-12.el7                                                
[openshift/origin-node]   libselinux-utils.x86_64 0:2.5-15.el7                                          
[openshift/origin-node]   libss.x86_64 0:1.42.9-19.el7                                                  
[openshift/origin-node]   make.x86_64 1:3.82-24.el7                                                     
[openshift/origin-node]   openvswitch.x86_64 0:2.7.0-1.el7                                              
[openshift/origin-node]   policycoreutils.x86_64 0:2.5-34.el7                                           
[openshift/origin-node]   selinux-policy.noarch 0:3.13.1-268.el7_9.2                                    
[openshift/origin-node] Updated:
[openshift/origin-node]   binutils.x86_64 0:2.27-44.base.el7_9.1                                        
[openshift/origin-node]   device-mapper.x86_64 7:1.02.170-6.el7_9.5                                     
[openshift/origin-node]   device-mapper-libs.x86_64 7:1.02.170-6.el7_9.5                                
[openshift/origin-node] Dependency Updated:
[openshift/origin-node]   openssl-libs.x86_64 1:1.0.2k-24.el7_9                                         
[openshift/origin-node] Complete!
[openshift/origin-node] Loaded plugins: fastestmirror, ovl
[openshift/origin-node] Cleaning repos: base cbs-paas7-openshift-multiarch-el7-build
[openshift/origin-node]               : centos-ceph-luminous extras updates
[openshift/origin-node] Cleaning up list of fastest mirrors
[openshift/origin-node] --> LABEL io.k8s.display-name="OpenShift Node"       io.k8s.description="This is a component of OpenShift and contains the software for individual nodes when using SDN."       io.openshift.tags="openshift,node"
[openshift/origin-node] --> ENV OPENSHIFT_CONTAINERIZED=true     KUBECONFIG=/etc/origin/node/node.kubeconfig
[openshift/origin-node] --> ENTRYPOINT [ "/usr/local/bin/origin-node-run.sh" ]
[openshift/origin-node] --> Committing changes to openshift/origin-node:v3.11.0 ...
[openshift/origin-node] --> Tagged as openshift/origin-node:latest
[openshift/origin-node] --> Done
[INFO] hack/build-images.sh exited with code 0 after 00h 05m 17s
+ sed -i 's|go/src|data/src|' _output/local/releases/rpms/origin-local-release.repo
+ sudo cp _output/local/releases/rpms/origin-local-release.repo /etc/yum.repos.d/
+ set +o xtrace
########## FINISHED STAGE: SUCCESS: BUILD AN ORIGIN RELEASE [00h 19m 29s] ##########
[workspace] $ /bin/bash /tmp/jenkins7757890574093167343.sh
########## STARTING STAGE: BUILD AN OPENSHIFT-ANSIBLE RELEASE ##########
+ [[ -s /var/lib/jenkins/jobs/test_branch_origin_extended_conformance_install_update_containerized/workspace/activate ]]
+ source /var/lib/jenkins/jobs/test_branch_origin_extended_conformance_install_update_containerized/workspace/activate
++ export VIRTUAL_ENV=/var/lib/jenkins/origin-ci-tool/95a472392910104fc805c4ab8af39791105c956d
++ VIRTUAL_ENV=/var/lib/jenkins/origin-ci-tool/95a472392910104fc805c4ab8af39791105c956d
++ export PATH=/var/lib/jenkins/origin-ci-tool/95a472392910104fc805c4ab8af39791105c956d/bin:/sbin:/usr/sbin:/bin:/usr/bin
++ PATH=/var/lib/jenkins/origin-ci-tool/95a472392910104fc805c4ab8af39791105c956d/bin:/sbin:/usr/sbin:/bin:/usr/bin
++ unset PYTHON_HOME
++ export OCT_CONFIG_HOME=/var/lib/jenkins/jobs/test_branch_origin_extended_conformance_install_update_containerized/workspace/.config
++ OCT_CONFIG_HOME=/var/lib/jenkins/jobs/test_branch_origin_extended_conformance_install_update_containerized/workspace/.config
++ mktemp
+ script=/tmp/tmp.NIYUpAlyOu
+ cat
+ chmod +x /tmp/tmp.NIYUpAlyOu
+ scp -F /var/lib/jenkins/jobs/test_branch_origin_extended_conformance_install_update_containerized/workspace/.config/origin-ci-tool/inventory/.ssh_config /tmp/tmp.NIYUpAlyOu openshiftdevel:/tmp/tmp.NIYUpAlyOu
+ ssh -F /var/lib/jenkins/jobs/test_branch_origin_extended_conformance_install_update_containerized/workspace/.config/origin-ci-tool/inventory/.ssh_config -t openshiftdevel 'bash -l -c "timeout 14400 /tmp/tmp.NIYUpAlyOu"'
+ cd /data/src/github.com/openshift/openshift-ansible
+ tito_tmp_dir=tito
+ mkdir -p tito
+ tito tag --offline --accept-auto-changelog
Creating output directory: /tmp/tito
Tagging new version of openshift-ansible: 3.11.617-1 -> 3.11.618-1

Created tag: openshift-ansible-3.11.618-1
   View: git show HEAD
   Undo: tito tag -u
   Push: git push --follow-tags origin
+ tito build --output=tito --rpm --test --offline --quiet
Creating output directory: /data/src/github.com/openshift/openshift-ansible/tito
Building package [openshift-ansible-3.11.618-1]
Wrote: /data/src/github.com/openshift/openshift-ansible/tito/openshift-ansible-git-0.bece0b3.tar.gz

Successfully built: /data/src/github.com/openshift/openshift-ansible/tito/openshift-ansible-3.11.618-1.git.0.bece0b3.el7_9.src.rpm
	- /data/src/github.com/openshift/openshift-ansible/tito/noarch/openshift-ansible-3.11.618-1.git.0.bece0b3.el7_9.noarch.rpm
	- /data/src/github.com/openshift/openshift-ansible/tito/noarch/openshift-ansible-docs-3.11.618-1.git.0.bece0b3.el7_9.noarch.rpm
	- /data/src/github.com/openshift/openshift-ansible/tito/noarch/openshift-ansible-playbooks-3.11.618-1.git.0.bece0b3.el7_9.noarch.rpm
	- /data/src/github.com/openshift/openshift-ansible/tito/noarch/openshift-ansible-roles-3.11.618-1.git.0.bece0b3.el7_9.noarch.rpm
	- /data/src/github.com/openshift/openshift-ansible/tito/noarch/openshift-ansible-test-3.11.618-1.git.0.bece0b3.el7_9.noarch.rpm
+ createrepo tito/noarch
Spawning worker 0 with 2 pkgs
Spawning worker 1 with 1 pkgs
Spawning worker 2 with 1 pkgs
Spawning worker 3 with 1 pkgs
Workers Finished
Saving Primary metadata
Saving file lists metadata
Saving other metadata
Generating sqlite DBs
Sqlite DBs complete
+ cat
++ pwd
+ sudo cp ./openshift-ansible-local-release.repo /etc/yum.repos.d
+ set +o xtrace
########## FINISHED STAGE: SUCCESS: BUILD AN OPENSHIFT-ANSIBLE RELEASE [00h 00m 38s] ##########
[workspace] $ /bin/bash /tmp/jenkins2180312877280952102.sh
########## STARTING STAGE: INSTALL THE OPENSHIFT-ANSIBLE RELEASE ##########
+ [[ -s /var/lib/jenkins/jobs/test_branch_origin_extended_conformance_install_update_containerized/workspace/activate ]]
+ source /var/lib/jenkins/jobs/test_branch_origin_extended_conformance_install_update_containerized/workspace/activate
++ export VIRTUAL_ENV=/var/lib/jenkins/origin-ci-tool/95a472392910104fc805c4ab8af39791105c956d
++ VIRTUAL_ENV=/var/lib/jenkins/origin-ci-tool/95a472392910104fc805c4ab8af39791105c956d
++ export PATH=/var/lib/jenkins/origin-ci-tool/95a472392910104fc805c4ab8af39791105c956d/bin:/sbin:/usr/sbin:/bin:/usr/bin
++ PATH=/var/lib/jenkins/origin-ci-tool/95a472392910104fc805c4ab8af39791105c956d/bin:/sbin:/usr/sbin:/bin:/usr/bin
++ unset PYTHON_HOME
++ export OCT_CONFIG_HOME=/var/lib/jenkins/jobs/test_branch_origin_extended_conformance_install_update_containerized/workspace/.config
++ OCT_CONFIG_HOME=/var/lib/jenkins/jobs/test_branch_origin_extended_conformance_install_update_containerized/workspace/.config
++ mktemp
+ script=/tmp/tmp.CYN7Edp9r7
+ cat
+ chmod +x /tmp/tmp.CYN7Edp9r7
+ scp -F /var/lib/jenkins/jobs/test_branch_origin_extended_conformance_install_update_containerized/workspace/.config/origin-ci-tool/inventory/.ssh_config /tmp/tmp.CYN7Edp9r7 openshiftdevel:/tmp/tmp.CYN7Edp9r7
+ ssh -F /var/lib/jenkins/jobs/test_branch_origin_extended_conformance_install_update_containerized/workspace/.config/origin-ci-tool/inventory/.ssh_config -t openshiftdevel 'bash -l -c "timeout 3600 /tmp/tmp.CYN7Edp9r7"'
+ cd /data/src/github.com/openshift/openshift-ansible
++ git describe --tags --abbrev=0 --exact-match HEAD
+ last_tag=openshift-ansible-3.11.618-1
++ git log -n 1 --pretty=%h
+ last_commit=bece0b3
+ [[ release-3.11 == \r\e\l\e\a\s\e\-\3\.\7 ]]
+ [[ release-3.11 == \r\e\l\e\a\s\e\-\3\.\6 ]]
+ [[ release-3.11 == \r\e\l\e\a\s\e\-\3\.\5 ]]
+ sudo yum install -y openshift-ansible-3.11.618-1.git.0.bece0b3.el7_9
Loaded plugins: amazon-id, search-disabled-repos
https://mirror.openshift.com/enterprise/rhel/aos-cd/tools/charlie/repodata/repomd.xml: [Errno 14] HTTPS Error 401 - Unauthorized
Trying other mirror.
https://use-mirror2.ops.rhcloud.com/libra/rhui-rhel-server-7-extras/repodata/repomd.xml: [Errno 14] curl#58 - "SSL peer rejected your certificate as expired."
Trying other mirror.
https://mirror.ops.rhcloud.com/libra/rhui-rhel-server-7-extras/repodata/repomd.xml: [Errno 14] curl#58 - "SSL peer rejected your certificate as expired."
Trying other mirror.
https://use-mirror1.ops.rhcloud.com/libra/rhui-rhel-server-7-extras/repodata/repomd.xml: [Errno 14] curl#58 - "SSL peer rejected your certificate as expired."
Trying other mirror.
https://euw-mirror1.ops.rhcloud.com/libra/rhui-rhel-server-7-extras/repodata/repomd.xml: [Errno 12] Timeout on https://euw-mirror1.ops.rhcloud.com/libra/rhui-rhel-server-7-extras/repodata/repomd.xml: (28, 'Connection timed out after 120001 milliseconds')
Trying other mirror.
https://gce-mirror1.ops.rhcloud.com/libra/rhui-rhel-server-7-extras/repodata/repomd.xml: [Errno 12] Timeout on https://gce-mirror1.ops.rhcloud.com/libra/rhui-rhel-server-7-extras/repodata/repomd.xml: (28, 'Connection timed out after 120001 milliseconds')
Trying other mirror.
https://gce-mirror2.ops.rhcloud.com/libra/rhui-rhel-server-7-extras/repodata/repomd.xml: [Errno 12] Timeout on https://gce-mirror2.ops.rhcloud.com/libra/rhui-rhel-server-7-extras/repodata/repomd.xml: (28, 'Connection timed out after 120001 milliseconds')
Trying other mirror.
https://euw-mirror1.ops.rhcloud.com/libra/rhui-rhel-server-7-extras/repodata/repomd.xml: [Errno 12] Timeout on https://euw-mirror1.ops.rhcloud.com/libra/rhui-rhel-server-7-extras/repodata/repomd.xml: (28, 'Connection timed out after 120001 milliseconds')
Trying other mirror.
https://use-mirror2.ops.rhcloud.com/libra/rhui-rhel-server-7-releases/repodata/repomd.xml: [Errno 14] curl#58 - "SSL peer rejected your certificate as expired."
Trying other mirror.
https://mirror.ops.rhcloud.com/libra/rhui-rhel-server-7-releases/repodata/repomd.xml: [Errno 14] curl#58 - "SSL peer rejected your certificate as expired."
Trying other mirror.
https://use-mirror1.ops.rhcloud.com/libra/rhui-rhel-server-7-releases/repodata/repomd.xml: [Errno 14] curl#58 - "SSL peer rejected your certificate as expired."
Trying other mirror.
https://euw-mirror1.ops.rhcloud.com/libra/rhui-rhel-server-7-releases/repodata/repomd.xml: [Errno 12] Timeout on https://euw-mirror1.ops.rhcloud.com/libra/rhui-rhel-server-7-releases/repodata/repomd.xml: (28, 'Connection timed out after 120001 milliseconds')
Trying other mirror.
https://euw-mirror1.ops.rhcloud.com/libra/rhui-rhel-server-7-releases/repodata/repomd.xml: [Errno 12] Timeout on https://euw-mirror1.ops.rhcloud.com/libra/rhui-rhel-server-7-releases/repodata/repomd.xml: (28, 'Connection timed out after 120001 milliseconds')
Trying other mirror.
https://euw-mirror1.ops.rhcloud.com/libra/rhui-rhel-server-7-releases/repodata/repomd.xml: [Errno 12] Timeout on https://euw-mirror1.ops.rhcloud.com/libra/rhui-rhel-server-7-releases/repodata/repomd.xml: (28, 'Connection timed out after 120001 milliseconds')
Trying other mirror.
https://euw-mirror1.ops.rhcloud.com/libra/rhui-rhel-server-7-releases/repodata/repomd.xml: [Errno 12] Timeout on https://euw-mirror1.ops.rhcloud.com/libra/rhui-rhel-server-7-releases/repodata/repomd.xml: (28, 'Connection timed out after 120001 milliseconds')
Trying other mirror.
https://use-mirror2.ops.rhcloud.com/libra/rhui-rhel-server-7-releases-optional/repodata/repomd.xml: [Errno 14] curl#58 - "SSL peer rejected your certificate as expired."
Trying other mirror.
https://mirror.ops.rhcloud.com/libra/rhui-rhel-server-7-releases-optional/repodata/repomd.xml: [Errno 14] curl#58 - "SSL peer rejected your certificate as expired."
Trying other mirror.
https://use-mirror1.ops.rhcloud.com/libra/rhui-rhel-server-7-releases-optional/repodata/repomd.xml: [Errno 14] curl#58 - "SSL peer rejected your certificate as expired."
Trying other mirror.
https://euw-mirror1.ops.rhcloud.com/libra/rhui-rhel-server-7-releases-optional/repodata/repomd.xml: [Errno 12] Timeout on https://euw-mirror1.ops.rhcloud.com/libra/rhui-rhel-server-7-releases-optional/repodata/repomd.xml: (28, 'Connection timed out after 120001 milliseconds')
Trying other mirror.
https://euw-mirror1.ops.rhcloud.com/libra/rhui-rhel-server-7-releases-optional/repodata/repomd.xml: [Errno 12] Timeout on https://euw-mirror1.ops.rhcloud.com/libra/rhui-rhel-server-7-releases-optional/repodata/repomd.xml: (28, 'Connection timed out after 120001 milliseconds')
Trying other mirror.
https://euw-mirror1.ops.rhcloud.com/libra/rhui-rhel-server-7-releases-optional/repodata/repomd.xml: [Errno 12] Timeout on https://euw-mirror1.ops.rhcloud.com/libra/rhui-rhel-server-7-releases-optional/repodata/repomd.xml: (28, 'Connection timed out after 120001 milliseconds')
Trying other mirror.
https://euw-mirror1.ops.rhcloud.com/libra/rhui-rhel-server-7-releases-optional/repodata/repomd.xml: [Errno 12] Timeout on https://euw-mirror1.ops.rhcloud.com/libra/rhui-rhel-server-7-releases-optional/repodata/repomd.xml: (28, 'Connection timed out after 120001 milliseconds')
Trying other mirror.
https://use-mirror2.ops.rhcloud.com/libra/rhui-rhel-server-7-rhscl/repodata/repomd.xml: [Errno 14] curl#58 - "SSL peer rejected your certificate as expired."
Trying other mirror.
https://mirror.ops.rhcloud.com/libra/rhui-rhel-server-7-rhscl/repodata/repomd.xml: [Errno 14] curl#58 - "SSL peer rejected your certificate as expired."
Trying other mirror.
https://use-mirror1.ops.rhcloud.com/libra/rhui-rhel-server-7-rhscl/repodata/repomd.xml: [Errno 14] curl#58 - "SSL peer rejected your certificate as expired."
Trying other mirror.
https://euw-mirror1.ops.rhcloud.com/libra/rhui-rhel-server-7-rhscl/repodata/repomd.xml: [Errno 12] Timeout on https://euw-mirror1.ops.rhcloud.com/libra/rhui-rhel-server-7-rhscl/repodata/repomd.xml: (28, 'Connection timed out after 120001 milliseconds')
Trying other mirror.
https://euw-mirror1.ops.rhcloud.com/libra/rhui-rhel-server-7-rhscl/repodata/repomd.xml: [Errno 12] Timeout on https://euw-mirror1.ops.rhcloud.com/libra/rhui-rhel-server-7-rhscl/repodata/repomd.xml: (28, 'Connection timed out after 120001 milliseconds')
Trying other mirror.
https://euw-mirror1.ops.rhcloud.com/libra/rhui-rhel-server-7-rhscl/repodata/repomd.xml: [Errno 12] Timeout on https://euw-mirror1.ops.rhcloud.com/libra/rhui-rhel-server-7-rhscl/repodata/repomd.xml: (28, 'Connection timed out after 120001 milliseconds')
Trying other mirror.
https://euw-mirror1.ops.rhcloud.com/libra/rhui-rhel-server-7-rhscl/repodata/repomd.xml: [Errno 12] Timeout on https://euw-mirror1.ops.rhcloud.com/libra/rhui-rhel-server-7-rhscl/repodata/repomd.xml: (28, 'Connection timed out after 120001 milliseconds')
Trying other mirror.
https://mirror.openshift.com/enterprise/rhel/rhel-7-server-ansible-2.4-rpms/repodata/repomd.xml: [Errno 14] HTTPS Error 401 - Unauthorized
Trying other mirror.
Resolving Dependencies
--> Running transaction check
---> Package openshift-ansible.noarch 0:3.11.618-1.git.0.bece0b3.el7_9 will be installed
--> Processing Dependency: openshift-ansible-roles = 3.11.618-1.git.0.bece0b3.el7_9 for package: openshift-ansible-3.11.618-1.git.0.bece0b3.el7_9.noarch
--> Processing Dependency: openshift-ansible-playbooks = 3.11.618-1.git.0.bece0b3.el7_9 for package: openshift-ansible-3.11.618-1.git.0.bece0b3.el7_9.noarch
--> Processing Dependency: openshift-ansible-docs = 3.11.618-1.git.0.bece0b3.el7_9 for package: openshift-ansible-3.11.618-1.git.0.bece0b3.el7_9.noarch
--> Processing Dependency: python2-crypto for package: openshift-ansible-3.11.618-1.git.0.bece0b3.el7_9.noarch
--> Processing Dependency: httpd-tools for package: openshift-ansible-3.11.618-1.git.0.bece0b3.el7_9.noarch
--> Running transaction check
---> Package httpd-tools.x86_64 0:2.4.6-97.el7_9.4 will be installed
--> Processing Dependency: libaprutil-1.so.0()(64bit) for package: httpd-tools-2.4.6-97.el7_9.4.x86_64
--> Processing Dependency: libapr-1.so.0()(64bit) for package: httpd-tools-2.4.6-97.el7_9.4.x86_64
---> Package openshift-ansible-docs.noarch 0:3.11.618-1.git.0.bece0b3.el7_9 will be installed
---> Package openshift-ansible-playbooks.noarch 0:3.11.618-1.git.0.bece0b3.el7_9 will be installed
---> Package openshift-ansible-roles.noarch 0:3.11.618-1.git.0.bece0b3.el7_9 will be installed
---> Package python2-crypto.x86_64 0:2.6.1-15.el7 will be installed
--> Processing Dependency: libtomcrypt.so.0()(64bit) for package: python2-crypto-2.6.1-15.el7.x86_64
--> Running transaction check
---> Package apr.x86_64 0:1.4.8-7.el7 will be installed
---> Package apr-util.x86_64 0:1.5.2-6.el7 will be installed
---> Package libtomcrypt.x86_64 0:1.17-26.el7 will be installed
--> Processing Dependency: libtommath >= 0.42.0 for package: libtomcrypt-1.17-26.el7.x86_64
--> Processing Dependency: libtommath.so.0()(64bit) for package: libtomcrypt-1.17-26.el7.x86_64
--> Running transaction check
---> Package libtommath.x86_64 0:0.42.0-6.el7 will be installed
--> Finished Dependency Resolution

Dependencies Resolved

================================================================================
 Package         Arch   Version           Repository                       Size
================================================================================
Installing:
 openshift-ansible
                 noarch 3.11.618-1.git.0.bece0b3.el7_9
                                          openshift-ansible-local-release 606 k
Installing for dependencies:
 apr             x86_64 1.4.8-7.el7       rhel-7-server-rhui-rpms         104 k
 apr-util        x86_64 1.5.2-6.el7       oso-rhui-rhel-server-releases    92 k
 httpd-tools     x86_64 2.4.6-97.el7_9.4  rhel-7-server-rhui-rpms          94 k
 libtomcrypt     x86_64 1.17-26.el7       oso-rhui-rhel-server-extras     224 k
 libtommath      x86_64 0.42.0-6.el7      oso-rhui-rhel-server-extras      36 k
 openshift-ansible-docs
                 noarch 3.11.618-1.git.0.bece0b3.el7_9
                                          openshift-ansible-local-release 619 k
 openshift-ansible-playbooks
                 noarch 3.11.618-1.git.0.bece0b3.el7_9
                                          openshift-ansible-local-release 765 k
 openshift-ansible-roles
                 noarch 3.11.618-1.git.0.bece0b3.el7_9
                                          openshift-ansible-local-release 2.3 M
 python2-crypto  x86_64 2.6.1-15.el7      oso-rhui-rhel-server-extras     477 k

Transaction Summary
================================================================================
Install  1 Package (+9 Dependent packages)

Total download size: 5.2 M
Installed size: 25 M
Downloading packages:
https://use-mirror2.ops.rhcloud.com/libra/rhui-rhel-server-7-extras/Packages/l/libtomcrypt-1.17-26.el7.x86_64.rpm: [Errno 14] curl#58 - "SSL peer rejected your certificate as expired."
Trying other mirror.
https://mirror.ops.rhcloud.com/libra/rhui-rhel-server-7-extras/Packages/l/libtommath-0.42.0-6.el7.x86_64.rpm: [Errno 14] curl#58 - "SSL peer rejected your certificate as expired."
Trying other mirror.
https://use-mirror2.ops.rhcloud.com/libra/rhui-rhel-server-7-releases/Packages/a/apr-util-1.5.2-6.el7.x86_64.rpm: [Errno 14] curl#58 - "SSL peer rejected your certificate as expired."
Trying other mirror.
https://use-mirror2.ops.rhcloud.com/libra/rhui-rhel-server-7-extras/Packages/p/python2-crypto-2.6.1-15.el7.x86_64.rpm: [Errno 14] curl#58 - "SSL peer rejected your certificate as expired."
Trying other mirror.
https://use-mirror2.ops.rhcloud.com/libra/rhui-rhel-server-7-extras/Packages/l/libtommath-0.42.0-6.el7.x86_64.rpm: [Errno 14] curl#58 - "SSL peer rejected your certificate as expired."
Trying other mirror.
https://mirror.ops.rhcloud.com/libra/rhui-rhel-server-7-extras/Packages/p/python2-crypto-2.6.1-15.el7.x86_64.rpm: [Errno 14] curl#58 - "SSL peer rejected your certificate as expired."
Trying other mirror.
https://use-mirror1.ops.rhcloud.com/libra/rhui-rhel-server-7-extras/Packages/l/libtomcrypt-1.17-26.el7.x86_64.rpm: [Errno 14] curl#58 - "SSL peer rejected your certificate as expired."
Trying other mirror.
https://use-mirror1.ops.rhcloud.com/libra/rhui-rhel-server-7-releases/Packages/a/apr-util-1.5.2-6.el7.x86_64.rpm: [Errno 14] curl#58 - "SSL peer rejected your certificate as expired."
Trying other mirror.
https://use-mirror1.ops.rhcloud.com/libra/rhui-rhel-server-7-extras/Packages/l/libtommath-0.42.0-6.el7.x86_64.rpm: [Errno 14] curl#58 - "SSL peer rejected your certificate as expired."
Trying other mirror.
https://use-mirror1.ops.rhcloud.com/libra/rhui-rhel-server-7-extras/Packages/p/python2-crypto-2.6.1-15.el7.x86_64.rpm: [Errno 14] curl#58 - "SSL peer rejected your certificate as expired."
Trying other mirror.
https://mirror.ops.rhcloud.com/libra/rhui-rhel-server-7-extras/Packages/l/libtomcrypt-1.17-26.el7.x86_64.rpm: [Errno 14] curl#58 - "SSL peer rejected your certificate as expired."
Trying other mirror.
https://mirror.ops.rhcloud.com/libra/rhui-rhel-server-7-releases/Packages/a/apr-util-1.5.2-6.el7.x86_64.rpm: [Errno 14] curl#58 - "SSL peer rejected your certificate as expired."
Trying other mirror.
https://gce-mirror1.ops.rhcloud.com/libra/rhui-rhel-server-7-extras/Packages/l/libtommath-0.42.0-6.el7.x86_64.rpm: [Errno 12] Timeout on https://gce-mirror1.ops.rhcloud.com/libra/rhui-rhel-server-7-extras/Packages/l/libtommath-0.42.0-6.el7.x86_64.rpm: (28, 'Connection timed out after 120000 milliseconds')
Trying other mirror.
https://gce-mirror2.ops.rhcloud.com/libra/rhui-rhel-server-7-extras/Packages/p/python2-crypto-2.6.1-15.el7.x86_64.rpm: [Errno 12] Timeout on https://gce-mirror2.ops.rhcloud.com/libra/rhui-rhel-server-7-extras/Packages/p/python2-crypto-2.6.1-15.el7.x86_64.rpm: (28, 'Connection timed out after 120000 milliseconds')
Trying other mirror.
https://gce-mirror1.ops.rhcloud.com/libra/rhui-rhel-server-7-extras/Packages/l/libtomcrypt-1.17-26.el7.x86_64.rpm: [Errno 12] Timeout on https://gce-mirror1.ops.rhcloud.com/libra/rhui-rhel-server-7-extras/Packages/l/libtomcrypt-1.17-26.el7.x86_64.rpm: (28, 'Connection timed out after 120001 milliseconds')
Trying other mirror.
https://euw-mirror1.ops.rhcloud.com/libra/rhui-rhel-server-7-releases/Packages/a/apr-util-1.5.2-6.el7.x86_64.rpm: [Errno 12] Timeout on https://euw-mirror1.ops.rhcloud.com/libra/rhui-rhel-server-7-releases/Packages/a/apr-util-1.5.2-6.el7.x86_64.rpm: (28, 'Connection timed out after 120001 milliseconds')
Trying other mirror.
https://gce-mirror2.ops.rhcloud.com/libra/rhui-rhel-server-7-extras/Packages/l/libtommath-0.42.0-6.el7.x86_64.rpm: [Errno 12] Timeout on https://gce-mirror2.ops.rhcloud.com/libra/rhui-rhel-server-7-extras/Packages/l/libtommath-0.42.0-6.el7.x86_64.rpm: (28, 'Connection timed out after 120001 milliseconds')
Trying other mirror.
https://euw-mirror1.ops.rhcloud.com/libra/rhui-rhel-server-7-extras/Packages/p/python2-crypto-2.6.1-15.el7.x86_64.rpm: [Errno 12] Timeout on https://euw-mirror1.ops.rhcloud.com/libra/rhui-rhel-server-7-extras/Packages/p/python2-crypto-2.6.1-15.el7.x86_64.rpm: (28, 'Connection timed out after 120001 milliseconds')
Trying other mirror.
https://euw-mirror1.ops.rhcloud.com/libra/rhui-rhel-server-7-extras/Packages/l/libtomcrypt-1.17-26.el7.x86_64.rpm: [Errno 12] Timeout on https://euw-mirror1.ops.rhcloud.com/libra/rhui-rhel-server-7-extras/Packages/l/libtomcrypt-1.17-26.el7.x86_64.rpm: (28, 'Connection timed out after 120001 milliseconds')
Trying other mirror.
https://euw-mirror1.ops.rhcloud.com/libra/rhui-rhel-server-7-releases/Packages/a/apr-util-1.5.2-6.el7.x86_64.rpm: [Errno 12] Timeout on https://euw-mirror1.ops.rhcloud.com/libra/rhui-rhel-server-7-releases/Packages/a/apr-util-1.5.2-6.el7.x86_64.rpm: (28, 'Connection timed out after 120001 milliseconds')
Trying other mirror.
https://euw-mirror1.ops.rhcloud.com/libra/rhui-rhel-server-7-extras/Packages/l/libtommath-0.42.0-6.el7.x86_64.rpm: [Errno 12] Timeout on https://euw-mirror1.ops.rhcloud.com/libra/rhui-rhel-server-7-extras/Packages/l/libtommath-0.42.0-6.el7.x86_64.rpm: (28, 'Connection timed out after 120001 milliseconds')
Trying other mirror.
https://gce-mirror1.ops.rhcloud.com/libra/rhui-rhel-server-7-extras/Packages/p/python2-crypto-2.6.1-15.el7.x86_64.rpm: [Errno 12] Timeout on https://gce-mirror1.ops.rhcloud.com/libra/rhui-rhel-server-7-extras/Packages/p/python2-crypto-2.6.1-15.el7.x86_64.rpm: (28, 'Connection timed out after 120001 milliseconds')
Trying other mirror.
https://gce-mirror2.ops.rhcloud.com/libra/rhui-rhel-server-7-extras/Packages/l/libtomcrypt-1.17-26.el7.x86_64.rpm: [Errno 12] Timeout on https://gce-mirror2.ops.rhcloud.com/libra/rhui-rhel-server-7-extras/Packages/l/libtomcrypt-1.17-26.el7.x86_64.rpm: (28, 'Connection timed out after 120001 milliseconds')
Trying other mirror.
https://euw-mirror1.ops.rhcloud.com/libra/rhui-rhel-server-7-releases/Packages/a/apr-util-1.5.2-6.el7.x86_64.rpm: [Errno 12] Timeout on https://euw-mirror1.ops.rhcloud.com/libra/rhui-rhel-server-7-releases/Packages/a/apr-util-1.5.2-6.el7.x86_64.rpm: (28, 'Connection timed out after 120001 milliseconds')
Trying other mirror.
https://gce-mirror1.ops.rhcloud.com/libra/rhui-rhel-server-7-extras/Packages/l/libtommath-0.42.0-6.el7.x86_64.rpm: [Errno 12] Timeout on https://gce-mirror1.ops.rhcloud.com/libra/rhui-rhel-server-7-extras/Packages/l/libtommath-0.42.0-6.el7.x86_64.rpm: (28, 'Connection timed out after 120001 milliseconds')
Trying other mirror.
https://gce-mirror2.ops.rhcloud.com/libra/rhui-rhel-server-7-extras/Packages/p/python2-crypto-2.6.1-15.el7.x86_64.rpm: [Errno 12] Timeout on https://gce-mirror2.ops.rhcloud.com/libra/rhui-rhel-server-7-extras/Packages/p/python2-crypto-2.6.1-15.el7.x86_64.rpm: (28, 'Connection timed out after 120001 milliseconds')
Trying other mirror.
https://gce-mirror1.ops.rhcloud.com/libra/rhui-rhel-server-7-extras/Packages/l/libtomcrypt-1.17-26.el7.x86_64.rpm: [Errno 12] Timeout on https://gce-mirror1.ops.rhcloud.com/libra/rhui-rhel-server-7-extras/Packages/l/libtomcrypt-1.17-26.el7.x86_64.rpm: (28, 'Connection timed out after 120001 milliseconds')
Trying other mirror.
https://euw-mirror1.ops.rhcloud.com/libra/rhui-rhel-server-7-releases/Packages/a/apr-util-1.5.2-6.el7.x86_64.rpm: [Errno 12] Timeout on https://euw-mirror1.ops.rhcloud.com/libra/rhui-rhel-server-7-releases/Packages/a/apr-util-1.5.2-6.el7.x86_64.rpm: (28, 'Connection timed out after 120001 milliseconds')
Trying other mirror.


Error downloading packages:
  libtomcrypt-1.17-26.el7.x86_64: [Errno 256] No more mirrors to try.
  apr-util-1.5.2-6.el7.x86_64: [Errno 256] No more mirrors to try.
  libtommath-0.42.0-6.el7.x86_64: [Errno 256] No more mirrors to try.
  python2-crypto-2.6.1-15.el7.x86_64: [Errno 256] No more mirrors to try.

++ export status=FAILURE
++ status=FAILURE
+ set +o xtrace
########## FINISHED STAGE: FAILURE: INSTALL THE OPENSHIFT-ANSIBLE RELEASE [00h 44m 03s] ##########
Build step 'Execute shell' marked build as failure
[PostBuildScript] - [INFO] Executing post build scripts.
[workspace] $ /bin/bash /tmp/jenkins2649359555277047344.sh
########## STARTING STAGE: DOWNLOAD ARTIFACTS FROM THE REMOTE HOST ##########
+ [[ -s /var/lib/jenkins/jobs/test_branch_origin_extended_conformance_install_update_containerized/workspace/activate ]]
+ source /var/lib/jenkins/jobs/test_branch_origin_extended_conformance_install_update_containerized/workspace/activate
++ export VIRTUAL_ENV=/var/lib/jenkins/origin-ci-tool/95a472392910104fc805c4ab8af39791105c956d
++ VIRTUAL_ENV=/var/lib/jenkins/origin-ci-tool/95a472392910104fc805c4ab8af39791105c956d
++ export PATH=/var/lib/jenkins/origin-ci-tool/95a472392910104fc805c4ab8af39791105c956d/bin:/sbin:/usr/sbin:/bin:/usr/bin
++ PATH=/var/lib/jenkins/origin-ci-tool/95a472392910104fc805c4ab8af39791105c956d/bin:/sbin:/usr/sbin:/bin:/usr/bin
++ unset PYTHON_HOME
++ export OCT_CONFIG_HOME=/var/lib/jenkins/jobs/test_branch_origin_extended_conformance_install_update_containerized/workspace/.config
++ OCT_CONFIG_HOME=/var/lib/jenkins/jobs/test_branch_origin_extended_conformance_install_update_containerized/workspace/.config
+ trap 'exit 0' EXIT
++ pwd
+ ARTIFACT_DIR=/var/lib/jenkins/jobs/test_branch_origin_extended_conformance_install_update_containerized/workspace/artifacts/gathered
+ rm -rf /var/lib/jenkins/jobs/test_branch_origin_extended_conformance_install_update_containerized/workspace/artifacts/gathered
+ mkdir -p /var/lib/jenkins/jobs/test_branch_origin_extended_conformance_install_update_containerized/workspace/artifacts/gathered
+ ssh -F /var/lib/jenkins/jobs/test_branch_origin_extended_conformance_install_update_containerized/workspace/.config/origin-ci-tool/inventory/.ssh_config openshiftdevel sudo stat /data/src/github.com/openshift/origin/_output/scripts
  File: ‘/data/src/github.com/openshift/origin/_output/scripts’
  Size: 62        	Blocks: 0          IO Block: 4096   directory
Device: ca02h/51714d	Inode: 121667301   Links: 5
Access: (2755/drwxr-sr-x)  Uid: ( 1001/  origin)   Gid: ( 1003/origin-git)
Context: unconfined_u:object_r:container_file_t:s0
Access: 2022-01-26 19:32:29.127466715 +0000
Modify: 2022-01-26 19:46:29.894340360 +0000
Change: 2022-01-26 19:46:29.894340360 +0000
 Birth: -
+ ssh -F /var/lib/jenkins/jobs/test_branch_origin_extended_conformance_install_update_containerized/workspace/.config/origin-ci-tool/inventory/.ssh_config openshiftdevel sudo chmod -R o+rX /data/src/github.com/openshift/origin/_output/scripts
+ scp -r -F /var/lib/jenkins/jobs/test_branch_origin_extended_conformance_install_update_containerized/workspace/.config/origin-ci-tool/inventory/.ssh_config openshiftdevel:/data/src/github.com/openshift/origin/_output/scripts /var/lib/jenkins/jobs/test_branch_origin_extended_conformance_install_update_containerized/workspace/artifacts/gathered
+ tree /var/lib/jenkins/jobs/test_branch_origin_extended_conformance_install_update_containerized/workspace/artifacts/gathered
/var/lib/jenkins/jobs/test_branch_origin_extended_conformance_install_update_containerized/workspace/artifacts/gathered
└── scripts
    ├── build-base-images
    │   ├── artifacts
    │   ├── logs
    │   └── openshift.local.home
    ├── build-images
    │   ├── artifacts
    │   ├── logs
    │   │   └── scripts.log
    │   └── openshift.local.home
    └── env
        ├── artifacts
        ├── logs
        │   └── scripts.log
        └── openshift.local.home

13 directories, 2 files
+ exit 0
[workspace] $ /bin/bash /tmp/jenkins8872097929063765008.sh
########## STARTING STAGE: GENERATE ARTIFACTS FROM THE REMOTE HOST ##########
+ [[ -s /var/lib/jenkins/jobs/test_branch_origin_extended_conformance_install_update_containerized/workspace/activate ]]
+ source /var/lib/jenkins/jobs/test_branch_origin_extended_conformance_install_update_containerized/workspace/activate
++ export VIRTUAL_ENV=/var/lib/jenkins/origin-ci-tool/95a472392910104fc805c4ab8af39791105c956d
++ VIRTUAL_ENV=/var/lib/jenkins/origin-ci-tool/95a472392910104fc805c4ab8af39791105c956d
++ export PATH=/var/lib/jenkins/origin-ci-tool/95a472392910104fc805c4ab8af39791105c956d/bin:/sbin:/usr/sbin:/bin:/usr/bin
++ PATH=/var/lib/jenkins/origin-ci-tool/95a472392910104fc805c4ab8af39791105c956d/bin:/sbin:/usr/sbin:/bin:/usr/bin
++ unset PYTHON_HOME
++ export OCT_CONFIG_HOME=/var/lib/jenkins/jobs/test_branch_origin_extended_conformance_install_update_containerized/workspace/.config
++ OCT_CONFIG_HOME=/var/lib/jenkins/jobs/test_branch_origin_extended_conformance_install_update_containerized/workspace/.config
+ trap 'exit 0' EXIT
++ pwd
+ ARTIFACT_DIR=/var/lib/jenkins/jobs/test_branch_origin_extended_conformance_install_update_containerized/workspace/artifacts/generated
+ rm -rf /var/lib/jenkins/jobs/test_branch_origin_extended_conformance_install_update_containerized/workspace/artifacts/generated
+ mkdir /var/lib/jenkins/jobs/test_branch_origin_extended_conformance_install_update_containerized/workspace/artifacts/generated
+ ssh -F /var/lib/jenkins/jobs/test_branch_origin_extended_conformance_install_update_containerized/workspace/.config/origin-ci-tool/inventory/.ssh_config openshiftdevel 'sudo docker version && sudo docker info && sudo docker images && sudo docker ps -a 2>&1'
  WARNING: You're not using the default seccomp profile
+ ssh -F /var/lib/jenkins/jobs/test_branch_origin_extended_conformance_install_update_containerized/workspace/.config/origin-ci-tool/inventory/.ssh_config openshiftdevel 'sudo cat /etc/sysconfig/docker /etc/sysconfig/docker-network /etc/sysconfig/docker-storage /etc/sysconfig/docker-storage-setup /etc/systemd/system/docker.service 2>&1'
+ true
+ ssh -F /var/lib/jenkins/jobs/test_branch_origin_extended_conformance_install_update_containerized/workspace/.config/origin-ci-tool/inventory/.ssh_config openshiftdevel 'sudo find /var/lib/docker/containers -name *.log | sudo xargs tail -vn +1 2>&1'
+ ssh -F /var/lib/jenkins/jobs/test_branch_origin_extended_conformance_install_update_containerized/workspace/.config/origin-ci-tool/inventory/.ssh_config openshiftdevel 'oc get --raw /metrics --server=https://$( uname --nodename ):10250 --config=/etc/origin/master/admin.kubeconfig 2>&1'
+ true
+ ssh -F /var/lib/jenkins/jobs/test_branch_origin_extended_conformance_install_update_containerized/workspace/.config/origin-ci-tool/inventory/.ssh_config openshiftdevel 'sudo ausearch -m AVC -m SELINUX_ERR -m USER_AVC 2>&1'
+ true
+ ssh -F /var/lib/jenkins/jobs/test_branch_origin_extended_conformance_install_update_containerized/workspace/.config/origin-ci-tool/inventory/.ssh_config openshiftdevel 'oc get --raw /metrics --config=/etc/origin/master/admin.kubeconfig 2>&1'
+ true
+ ssh -F /var/lib/jenkins/jobs/test_branch_origin_extended_conformance_install_update_containerized/workspace/.config/origin-ci-tool/inventory/.ssh_config openshiftdevel 'sudo df -T -h && sudo pvs && sudo vgs && sudo lvs && sudo findmnt --all 2>&1'
+ ssh -F /var/lib/jenkins/jobs/test_branch_origin_extended_conformance_install_update_containerized/workspace/.config/origin-ci-tool/inventory/.ssh_config openshiftdevel 'sudo yum list installed 2>&1'
+ ssh -F /var/lib/jenkins/jobs/test_branch_origin_extended_conformance_install_update_containerized/workspace/.config/origin-ci-tool/inventory/.ssh_config openshiftdevel 'sudo journalctl --dmesg --no-pager --all --lines=all 2>&1'
+ ssh -F /var/lib/jenkins/jobs/test_branch_origin_extended_conformance_install_update_containerized/workspace/.config/origin-ci-tool/inventory/.ssh_config openshiftdevel 'sudo journalctl _PID=1 --no-pager --all --lines=all 2>&1'
+ tree /var/lib/jenkins/jobs/test_branch_origin_extended_conformance_install_update_containerized/workspace/artifacts/generated
/var/lib/jenkins/jobs/test_branch_origin_extended_conformance_install_update_containerized/workspace/artifacts/generated
├── avc_denials.log
├── containers.log
├── dmesg.log
├── docker.config
├── docker.info
├── filesystem.info
├── installed_packages.log
├── master-metrics.log
├── node-metrics.log
└── pid1.journal

0 directories, 10 files
+ exit 0
[workspace] $ /bin/bash /tmp/jenkins1182205424645007932.sh
########## STARTING STAGE: FETCH SYSTEMD JOURNALS FROM THE REMOTE HOST ##########
+ [[ -s /var/lib/jenkins/jobs/test_branch_origin_extended_conformance_install_update_containerized/workspace/activate ]]
+ source /var/lib/jenkins/jobs/test_branch_origin_extended_conformance_install_update_containerized/workspace/activate
++ export VIRTUAL_ENV=/var/lib/jenkins/origin-ci-tool/95a472392910104fc805c4ab8af39791105c956d
++ VIRTUAL_ENV=/var/lib/jenkins/origin-ci-tool/95a472392910104fc805c4ab8af39791105c956d
++ export PATH=/var/lib/jenkins/origin-ci-tool/95a472392910104fc805c4ab8af39791105c956d/bin:/sbin:/usr/sbin:/bin:/usr/bin
++ PATH=/var/lib/jenkins/origin-ci-tool/95a472392910104fc805c4ab8af39791105c956d/bin:/sbin:/usr/sbin:/bin:/usr/bin
++ unset PYTHON_HOME
++ export OCT_CONFIG_HOME=/var/lib/jenkins/jobs/test_branch_origin_extended_conformance_install_update_containerized/workspace/.config
++ OCT_CONFIG_HOME=/var/lib/jenkins/jobs/test_branch_origin_extended_conformance_install_update_containerized/workspace/.config
+ trap 'exit 0' EXIT
++ pwd
+ ARTIFACT_DIR=/var/lib/jenkins/jobs/test_branch_origin_extended_conformance_install_update_containerized/workspace/artifacts/journals
+ rm -rf /var/lib/jenkins/jobs/test_branch_origin_extended_conformance_install_update_containerized/workspace/artifacts/journals
+ mkdir /var/lib/jenkins/jobs/test_branch_origin_extended_conformance_install_update_containerized/workspace/artifacts/journals
+ ssh -F /var/lib/jenkins/jobs/test_branch_origin_extended_conformance_install_update_containerized/workspace/.config/origin-ci-tool/inventory/.ssh_config openshiftdevel sudo journalctl --unit docker.service --no-pager --all --lines=all
+ ssh -F /var/lib/jenkins/jobs/test_branch_origin_extended_conformance_install_update_containerized/workspace/.config/origin-ci-tool/inventory/.ssh_config openshiftdevel sudo journalctl --unit dnsmasq.service --no-pager --all --lines=all
+ ssh -F /var/lib/jenkins/jobs/test_branch_origin_extended_conformance_install_update_containerized/workspace/.config/origin-ci-tool/inventory/.ssh_config openshiftdevel sudo journalctl --unit systemd-journald.service --no-pager --all --lines=all
+ ssh -F /var/lib/jenkins/jobs/test_branch_origin_extended_conformance_install_update_containerized/workspace/.config/origin-ci-tool/inventory/.ssh_config openshiftdevel sudo journalctl --unit origin-master.service --no-pager --all --lines=all
+ ssh -F /var/lib/jenkins/jobs/test_branch_origin_extended_conformance_install_update_containerized/workspace/.config/origin-ci-tool/inventory/.ssh_config openshiftdevel sudo journalctl --unit origin-master-api.service --no-pager --all --lines=all
+ ssh -F /var/lib/jenkins/jobs/test_branch_origin_extended_conformance_install_update_containerized/workspace/.config/origin-ci-tool/inventory/.ssh_config openshiftdevel sudo journalctl --unit origin-master-controllers.service --no-pager --all --lines=all
+ ssh -F /var/lib/jenkins/jobs/test_branch_origin_extended_conformance_install_update_containerized/workspace/.config/origin-ci-tool/inventory/.ssh_config openshiftdevel sudo journalctl --unit origin-node.service --no-pager --all --lines=all
+ ssh -F /var/lib/jenkins/jobs/test_branch_origin_extended_conformance_install_update_containerized/workspace/.config/origin-ci-tool/inventory/.ssh_config openshiftdevel sudo journalctl --unit openvswitch.service --no-pager --all --lines=all
+ ssh -F /var/lib/jenkins/jobs/test_branch_origin_extended_conformance_install_update_containerized/workspace/.config/origin-ci-tool/inventory/.ssh_config openshiftdevel sudo journalctl --unit ovs-vswitchd.service --no-pager --all --lines=all
+ ssh -F /var/lib/jenkins/jobs/test_branch_origin_extended_conformance_install_update_containerized/workspace/.config/origin-ci-tool/inventory/.ssh_config openshiftdevel sudo journalctl --unit ovsdb-server.service --no-pager --all --lines=all
+ ssh -F /var/lib/jenkins/jobs/test_branch_origin_extended_conformance_install_update_containerized/workspace/.config/origin-ci-tool/inventory/.ssh_config openshiftdevel sudo journalctl --unit etcd.service --no-pager --all --lines=all
+ ssh -F /var/lib/jenkins/jobs/test_branch_origin_extended_conformance_install_update_containerized/workspace/.config/origin-ci-tool/inventory/.ssh_config openshiftdevel sudo journalctl --unit systemd-journald.service --no-pager --all --lines=all
+ tree /var/lib/jenkins/jobs/test_branch_origin_extended_conformance_install_update_containerized/workspace/artifacts/journals
/var/lib/jenkins/jobs/test_branch_origin_extended_conformance_install_update_containerized/workspace/artifacts/journals
├── dnsmasq.service
├── docker.service
├── etcd.service
├── openvswitch.service
├── origin-master-api.service
├── origin-master-controllers.service
├── origin-master.service
├── origin-node.service
├── ovsdb-server.service
├── ovs-vswitchd.service
└── systemd-journald.service

0 directories, 11 files
+ exit 0
[workspace] $ /bin/bash /tmp/jenkins1283102879564604272.sh
########## STARTING STAGE: ASSEMBLE GCS OUTPUT ##########
+ [[ -s /var/lib/jenkins/jobs/test_branch_origin_extended_conformance_install_update_containerized/workspace/activate ]]
+ source /var/lib/jenkins/jobs/test_branch_origin_extended_conformance_install_update_containerized/workspace/activate
++ export VIRTUAL_ENV=/var/lib/jenkins/origin-ci-tool/95a472392910104fc805c4ab8af39791105c956d
++ VIRTUAL_ENV=/var/lib/jenkins/origin-ci-tool/95a472392910104fc805c4ab8af39791105c956d
++ export PATH=/var/lib/jenkins/origin-ci-tool/95a472392910104fc805c4ab8af39791105c956d/bin:/sbin:/usr/sbin:/bin:/usr/bin
++ PATH=/var/lib/jenkins/origin-ci-tool/95a472392910104fc805c4ab8af39791105c956d/bin:/sbin:/usr/sbin:/bin:/usr/bin
++ unset PYTHON_HOME
++ export OCT_CONFIG_HOME=/var/lib/jenkins/jobs/test_branch_origin_extended_conformance_install_update_containerized/workspace/.config
++ OCT_CONFIG_HOME=/var/lib/jenkins/jobs/test_branch_origin_extended_conformance_install_update_containerized/workspace/.config
+ trap 'exit 0' EXIT
+ mkdir -p gcs/artifacts gcs/artifacts/generated gcs/artifacts/journals gcs/artifacts/gathered
++ python -c 'import json; import urllib; print json.load(urllib.urlopen('\''https://ci.openshift.redhat.com/jenkins/job/test_branch_origin_extended_conformance_install_update_containerized/2841/api/json'\''))['\''result'\'']'
+ result=FAILURE
+ cat
++ date +%s
+ cat /var/lib/jenkins/jobs/test_branch_origin_extended_conformance_install_update_containerized/builds/2841/log
+ cp artifacts/generated/avc_denials.log artifacts/generated/containers.log artifacts/generated/dmesg.log artifacts/generated/docker.config artifacts/generated/docker.info artifacts/generated/filesystem.info artifacts/generated/installed_packages.log artifacts/generated/master-metrics.log artifacts/generated/node-metrics.log artifacts/generated/pid1.journal gcs/artifacts/generated/
+ cp artifacts/journals/dnsmasq.service artifacts/journals/docker.service artifacts/journals/etcd.service artifacts/journals/openvswitch.service artifacts/journals/origin-master-api.service artifacts/journals/origin-master-controllers.service artifacts/journals/origin-master.service artifacts/journals/origin-node.service artifacts/journals/ovsdb-server.service artifacts/journals/ovs-vswitchd.service artifacts/journals/systemd-journald.service gcs/artifacts/journals/
+ cp -r artifacts/gathered/scripts gcs/artifacts/
++ pwd
+ scp -F /var/lib/jenkins/jobs/test_branch_origin_extended_conformance_install_update_containerized/workspace/.config/origin-ci-tool/inventory/.ssh_config -r /var/lib/jenkins/jobs/test_branch_origin_extended_conformance_install_update_containerized/workspace/gcs openshiftdevel:/data
+ scp -F /var/lib/jenkins/jobs/test_branch_origin_extended_conformance_install_update_containerized/workspace/.config/origin-ci-tool/inventory/.ssh_config /var/lib/jenkins/.config/gcloud/gcs-publisher-credentials.json openshiftdevel:/data/credentials.json
+ exit 0
[workspace] $ /bin/bash /tmp/jenkins2244801320289012267.sh
########## STARTING STAGE: PUSH THE ARTIFACTS AND METADATA ##########
+ [[ -s /var/lib/jenkins/jobs/test_branch_origin_extended_conformance_install_update_containerized/workspace/activate ]]
+ source /var/lib/jenkins/jobs/test_branch_origin_extended_conformance_install_update_containerized/workspace/activate
++ export VIRTUAL_ENV=/var/lib/jenkins/origin-ci-tool/95a472392910104fc805c4ab8af39791105c956d
++ VIRTUAL_ENV=/var/lib/jenkins/origin-ci-tool/95a472392910104fc805c4ab8af39791105c956d
++ export PATH=/var/lib/jenkins/origin-ci-tool/95a472392910104fc805c4ab8af39791105c956d/bin:/sbin:/usr/sbin:/bin:/usr/bin
++ PATH=/var/lib/jenkins/origin-ci-tool/95a472392910104fc805c4ab8af39791105c956d/bin:/sbin:/usr/sbin:/bin:/usr/bin
++ unset PYTHON_HOME
++ export OCT_CONFIG_HOME=/var/lib/jenkins/jobs/test_branch_origin_extended_conformance_install_update_containerized/workspace/.config
++ OCT_CONFIG_HOME=/var/lib/jenkins/jobs/test_branch_origin_extended_conformance_install_update_containerized/workspace/.config
++ mktemp
+ script=/tmp/tmp.MxyW1fFRRG
+ cat
+ chmod +x /tmp/tmp.MxyW1fFRRG
+ scp -F /var/lib/jenkins/jobs/test_branch_origin_extended_conformance_install_update_containerized/workspace/.config/origin-ci-tool/inventory/.ssh_config /tmp/tmp.MxyW1fFRRG openshiftdevel:/tmp/tmp.MxyW1fFRRG
+ ssh -F /var/lib/jenkins/jobs/test_branch_origin_extended_conformance_install_update_containerized/workspace/.config/origin-ci-tool/inventory/.ssh_config -t openshiftdevel 'bash -l -c "timeout 300 /tmp/tmp.MxyW1fFRRG"'
+ cd /home/origin
+ trap 'exit 0' EXIT
+ [[ -n {"type":"postsubmit","job":"test_branch_origin_extended_conformance_install_update_containerized","buildid":"1486420654839304197","prowjobid":"ff2c1e06-7edd-11ec-bae3-0a580a810a54","refs":{"org":"openshift","repo":"openshift-ansible","repo_link":"https://github.com/openshift/openshift-ansible","base_ref":"release-3.11","base_sha":"390a56940bf9dbe265439919c49e3951ea9bebcd","base_link":"https://github.com/openshift/openshift-ansible/compare/d1ea3bcafd3b...390a56940bf9"}} ]]
++ jq --compact-output '.buildid |= "2841"'
+ JOB_SPEC='{"type":"postsubmit","job":"test_branch_origin_extended_conformance_install_update_containerized","buildid":"2841","prowjobid":"ff2c1e06-7edd-11ec-bae3-0a580a810a54","refs":{"org":"openshift","repo":"openshift-ansible","repo_link":"https://github.com/openshift/openshift-ansible","base_ref":"release-3.11","base_sha":"390a56940bf9dbe265439919c49e3951ea9bebcd","base_link":"https://github.com/openshift/openshift-ansible/compare/d1ea3bcafd3b...390a56940bf9"}}'
+ docker run -e 'JOB_SPEC={"type":"postsubmit","job":"test_branch_origin_extended_conformance_install_update_containerized","buildid":"2841","prowjobid":"ff2c1e06-7edd-11ec-bae3-0a580a810a54","refs":{"org":"openshift","repo":"openshift-ansible","repo_link":"https://github.com/openshift/openshift-ansible","base_ref":"release-3.11","base_sha":"390a56940bf9dbe265439919c49e3951ea9bebcd","base_link":"https://github.com/openshift/openshift-ansible/compare/d1ea3bcafd3b...390a56940bf9"}}' -v /data:/data:z registry.ci.openshift.org/ci/gcsupload:latest --dry-run=false --gcs-path=gs://origin-ci-test --gcs-credentials-file=/data/credentials.json --path-strategy=single --default-org=openshift --default-repo=origin /data/gcs/artifacts /data/gcs/build-log.txt /data/gcs/finished.json
Unable to find image 'registry.ci.openshift.org/ci/gcsupload:latest' locally
Trying to pull repository registry.ci.openshift.org/ci/gcsupload ... 
latest: Pulling from registry.ci.openshift.org/ci/gcsupload
df20fa9351a1: Already exists
809b39f1848e: Already exists
561a2d1d09ef: Pulling fs layer
85cea451eec0: Pulling fs layer
85cea451eec0: Verifying Checksum
85cea451eec0: Download complete
561a2d1d09ef: Verifying Checksum
561a2d1d09ef: Download complete
561a2d1d09ef: Pull complete
85cea451eec0: Pull complete
Digest: sha256:5d1c929e25ade585af643d1f1b358207350d4617fe3f99cbca08c68df9bb2972
Status: Downloaded newer image for registry.ci.openshift.org/ci/gcsupload:latest
{"component":"gcsupload","file":"prow/gcsupload/run.go:194","func":"k8s.io/test-infra/prow/gcsupload.gatherArtifacts","level":"info","msg":"Gathering artifacts from artifact directory: /data/gcs/artifacts","severity":"info","time":"2022-01-26T20:36:49Z"}
{"component":"gcsupload","file":"prow/gcsupload/run.go:212","func":"k8s.io/test-infra/prow/gcsupload.gatherArtifacts.func1","level":"info","msg":"Found /data/gcs/artifacts/generated/avc_denials.log in artifact directory. Uploading as logs/test_branch_origin_extended_conformance_install_update_containerized/2841/artifacts/generated/avc_denials.log\n","severity":"info","time":"2022-01-26T20:36:49Z"}
{"component":"gcsupload","file":"prow/gcsupload/run.go:212","func":"k8s.io/test-infra/prow/gcsupload.gatherArtifacts.func1","level":"info","msg":"Found /data/gcs/artifacts/generated/containers.log in artifact directory. Uploading as logs/test_branch_origin_extended_conformance_install_update_containerized/2841/artifacts/generated/containers.log\n","severity":"info","time":"2022-01-26T20:36:49Z"}
{"component":"gcsupload","file":"prow/gcsupload/run.go:212","func":"k8s.io/test-infra/prow/gcsupload.gatherArtifacts.func1","level":"info","msg":"Found /data/gcs/artifacts/generated/dmesg.log in artifact directory. Uploading as logs/test_branch_origin_extended_conformance_install_update_containerized/2841/artifacts/generated/dmesg.log\n","severity":"info","time":"2022-01-26T20:36:49Z"}
{"component":"gcsupload","file":"prow/gcsupload/run.go:212","func":"k8s.io/test-infra/prow/gcsupload.gatherArtifacts.func1","level":"info","msg":"Found /data/gcs/artifacts/generated/docker.config in artifact directory. Uploading as logs/test_branch_origin_extended_conformance_install_update_containerized/2841/artifacts/generated/docker.config\n","severity":"info","time":"2022-01-26T20:36:49Z"}
{"component":"gcsupload","file":"prow/gcsupload/run.go:212","func":"k8s.io/test-infra/prow/gcsupload.gatherArtifacts.func1","level":"info","msg":"Found /data/gcs/artifacts/generated/docker.info in artifact directory. Uploading as logs/test_branch_origin_extended_conformance_install_update_containerized/2841/artifacts/generated/docker.info\n","severity":"info","time":"2022-01-26T20:36:49Z"}
{"component":"gcsupload","file":"prow/gcsupload/run.go:212","func":"k8s.io/test-infra/prow/gcsupload.gatherArtifacts.func1","level":"info","msg":"Found /data/gcs/artifacts/generated/filesystem.info in artifact directory. Uploading as logs/test_branch_origin_extended_conformance_install_update_containerized/2841/artifacts/generated/filesystem.info\n","severity":"info","time":"2022-01-26T20:36:49Z"}
{"component":"gcsupload","file":"prow/gcsupload/run.go:212","func":"k8s.io/test-infra/prow/gcsupload.gatherArtifacts.func1","level":"info","msg":"Found /data/gcs/artifacts/generated/installed_packages.log in artifact directory. Uploading as logs/test_branch_origin_extended_conformance_install_update_containerized/2841/artifacts/generated/installed_packages.log\n","severity":"info","time":"2022-01-26T20:36:49Z"}
{"component":"gcsupload","file":"prow/gcsupload/run.go:212","func":"k8s.io/test-infra/prow/gcsupload.gatherArtifacts.func1","level":"info","msg":"Found /data/gcs/artifacts/generated/master-metrics.log in artifact directory. Uploading as logs/test_branch_origin_extended_conformance_install_update_containerized/2841/artifacts/generated/master-metrics.log\n","severity":"info","time":"2022-01-26T20:36:49Z"}
{"component":"gcsupload","file":"prow/gcsupload/run.go:212","func":"k8s.io/test-infra/prow/gcsupload.gatherArtifacts.func1","level":"info","msg":"Found /data/gcs/artifacts/generated/node-metrics.log in artifact directory. Uploading as logs/test_branch_origin_extended_conformance_install_update_containerized/2841/artifacts/generated/node-metrics.log\n","severity":"info","time":"2022-01-26T20:36:49Z"}
{"component":"gcsupload","file":"prow/gcsupload/run.go:212","func":"k8s.io/test-infra/prow/gcsupload.gatherArtifacts.func1","level":"info","msg":"Found /data/gcs/artifacts/generated/pid1.journal in artifact directory. Uploading as logs/test_branch_origin_extended_conformance_install_update_containerized/2841/artifacts/generated/pid1.journal\n","severity":"info","time":"2022-01-26T20:36:49Z"}
{"component":"gcsupload","file":"prow/gcsupload/run.go:212","func":"k8s.io/test-infra/prow/gcsupload.gatherArtifacts.func1","level":"info","msg":"Found /data/gcs/artifacts/journals/dnsmasq.service in artifact directory. Uploading as logs/test_branch_origin_extended_conformance_install_update_containerized/2841/artifacts/journals/dnsmasq.service\n","severity":"info","time":"2022-01-26T20:36:49Z"}
{"component":"gcsupload","file":"prow/gcsupload/run.go:212","func":"k8s.io/test-infra/prow/gcsupload.gatherArtifacts.func1","level":"info","msg":"Found /data/gcs/artifacts/journals/docker.service in artifact directory. Uploading as logs/test_branch_origin_extended_conformance_install_update_containerized/2841/artifacts/journals/docker.service\n","severity":"info","time":"2022-01-26T20:36:49Z"}
{"component":"gcsupload","file":"prow/gcsupload/run.go:212","func":"k8s.io/test-infra/prow/gcsupload.gatherArtifacts.func1","level":"info","msg":"Found /data/gcs/artifacts/journals/etcd.service in artifact directory. Uploading as logs/test_branch_origin_extended_conformance_install_update_containerized/2841/artifacts/journals/etcd.service\n","severity":"info","time":"2022-01-26T20:36:49Z"}
{"component":"gcsupload","file":"prow/gcsupload/run.go:212","func":"k8s.io/test-infra/prow/gcsupload.gatherArtifacts.func1","level":"info","msg":"Found /data/gcs/artifacts/journals/openvswitch.service in artifact directory. Uploading as logs/test_branch_origin_extended_conformance_install_update_containerized/2841/artifacts/journals/openvswitch.service\n","severity":"info","time":"2022-01-26T20:36:49Z"}
{"component":"gcsupload","file":"prow/gcsupload/run.go:212","func":"k8s.io/test-infra/prow/gcsupload.gatherArtifacts.func1","level":"info","msg":"Found /data/gcs/artifacts/journals/origin-master-api.service in artifact directory. Uploading as logs/test_branch_origin_extended_conformance_install_update_containerized/2841/artifacts/journals/origin-master-api.service\n","severity":"info","time":"2022-01-26T20:36:49Z"}
{"component":"gcsupload","file":"prow/gcsupload/run.go:212","func":"k8s.io/test-infra/prow/gcsupload.gatherArtifacts.func1","level":"info","msg":"Found /data/gcs/artifacts/journals/origin-master-controllers.service in artifact directory. Uploading as logs/test_branch_origin_extended_conformance_install_update_containerized/2841/artifacts/journals/origin-master-controllers.service\n","severity":"info","time":"2022-01-26T20:36:49Z"}
{"component":"gcsupload","file":"prow/gcsupload/run.go:212","func":"k8s.io/test-infra/prow/gcsupload.gatherArtifacts.func1","level":"info","msg":"Found /data/gcs/artifacts/journals/origin-master.service in artifact directory. Uploading as logs/test_branch_origin_extended_conformance_install_update_containerized/2841/artifacts/journals/origin-master.service\n","severity":"info","time":"2022-01-26T20:36:49Z"}
{"component":"gcsupload","file":"prow/gcsupload/run.go:212","func":"k8s.io/test-infra/prow/gcsupload.gatherArtifacts.func1","level":"info","msg":"Found /data/gcs/artifacts/journals/origin-node.service in artifact directory. Uploading as logs/test_branch_origin_extended_conformance_install_update_containerized/2841/artifacts/journals/origin-node.service\n","severity":"info","time":"2022-01-26T20:36:49Z"}
{"component":"gcsupload","file":"prow/gcsupload/run.go:212","func":"k8s.io/test-infra/prow/gcsupload.gatherArtifacts.func1","level":"info","msg":"Found /data/gcs/artifacts/journals/ovs-vswitchd.service in artifact directory. Uploading as logs/test_branch_origin_extended_conformance_install_update_containerized/2841/artifacts/journals/ovs-vswitchd.service\n","severity":"info","time":"2022-01-26T20:36:49Z"}
{"component":"gcsupload","file":"prow/gcsupload/run.go:212","func":"k8s.io/test-infra/prow/gcsupload.gatherArtifacts.func1","level":"info","msg":"Found /data/gcs/artifacts/journals/ovsdb-server.service in artifact directory. Uploading as logs/test_branch_origin_extended_conformance_install_update_containerized/2841/artifacts/journals/ovsdb-server.service\n","severity":"info","time":"2022-01-26T20:36:49Z"}
{"component":"gcsupload","file":"prow/gcsupload/run.go:212","func":"k8s.io/test-infra/prow/gcsupload.gatherArtifacts.func1","level":"info","msg":"Found /data/gcs/artifacts/journals/systemd-journald.service in artifact directory. Uploading as logs/test_branch_origin_extended_conformance_install_update_containerized/2841/artifacts/journals/systemd-journald.service\n","severity":"info","time":"2022-01-26T20:36:49Z"}
{"component":"gcsupload","file":"prow/gcsupload/run.go:212","func":"k8s.io/test-infra/prow/gcsupload.gatherArtifacts.func1","level":"info","msg":"Found /data/gcs/artifacts/scripts/build-images/logs/scripts.log in artifact directory. Uploading as logs/test_branch_origin_extended_conformance_install_update_containerized/2841/artifacts/scripts/build-images/logs/scripts.log\n","severity":"info","time":"2022-01-26T20:36:49Z"}
{"component":"gcsupload","file":"prow/gcsupload/run.go:212","func":"k8s.io/test-infra/prow/gcsupload.gatherArtifacts.func1","level":"info","msg":"Found /data/gcs/artifacts/scripts/env/logs/scripts.log in artifact directory. Uploading as logs/test_branch_origin_extended_conformance_install_update_containerized/2841/artifacts/scripts/env/logs/scripts.log\n","severity":"info","time":"2022-01-26T20:36:49Z"}
{"component":"gcsupload","dest":"logs/test_branch_origin_extended_conformance_install_update_containerized/2841/artifacts/generated/docker.config","file":"prow/pod-utils/gcs/upload.go:86","func":"k8s.io/test-infra/prow/pod-utils/gcs.upload","level":"info","msg":"Queued for upload","severity":"info","time":"2022-01-26T20:36:49Z"}
{"component":"gcsupload","dest":"logs/test_branch_origin_extended_conformance_install_update_containerized/2841/artifacts/journals/dnsmasq.service","file":"prow/pod-utils/gcs/upload.go:86","func":"k8s.io/test-infra/prow/pod-utils/gcs.upload","level":"info","msg":"Queued for upload","severity":"info","time":"2022-01-26T20:36:49Z"}
{"component":"gcsupload","dest":"logs/test_branch_origin_extended_conformance_install_update_containerized/2841/artifacts/journals/docker.service","file":"prow/pod-utils/gcs/upload.go:86","func":"k8s.io/test-infra/prow/pod-utils/gcs.upload","level":"info","msg":"Queued for upload","severity":"info","time":"2022-01-26T20:36:49Z"}
{"component":"gcsupload","dest":"logs/test_branch_origin_extended_conformance_install_update_containerized/2841/artifacts/journals/etcd.service","file":"prow/pod-utils/gcs/upload.go:86","func":"k8s.io/test-infra/prow/pod-utils/gcs.upload","level":"info","msg":"Queued for upload","severity":"info","time":"2022-01-26T20:36:49Z"}
{"component":"gcsupload","dest":"logs/test_branch_origin_extended_conformance_install_update_containerized/2841/artifacts/journals/origin-node.service","file":"prow/pod-utils/gcs/upload.go:86","func":"k8s.io/test-infra/prow/pod-utils/gcs.upload","level":"info","msg":"Queued for upload","severity":"info","time":"2022-01-26T20:36:49Z"}
{"component":"gcsupload","dest":"logs/test_branch_origin_extended_conformance_install_update_containerized/2841/artifacts/journals/systemd-journald.service","file":"prow/pod-utils/gcs/upload.go:86","func":"k8s.io/test-infra/prow/pod-utils/gcs.upload","level":"info","msg":"Queued for upload","severity":"info","time":"2022-01-26T20:36:49Z"}
{"component":"gcsupload","dest":"logs/test_branch_origin_extended_conformance_install_update_containerized/2841/artifacts/generated/containers.log","file":"prow/pod-utils/gcs/upload.go:86","func":"k8s.io/test-infra/prow/pod-utils/gcs.upload","level":"info","msg":"Queued for upload","severity":"info","time":"2022-01-26T20:36:49Z"}
{"component":"gcsupload","dest":"logs/test_branch_origin_extended_conformance_install_update_containerized/2841/artifacts/generated/dmesg.log","file":"prow/pod-utils/gcs/upload.go:86","func":"k8s.io/test-infra/prow/pod-utils/gcs.upload","level":"info","msg":"Queued for upload","severity":"info","time":"2022-01-26T20:36:49Z"}
{"component":"gcsupload","dest":"logs/test_branch_origin_extended_conformance_install_update_containerized/2841/artifacts/generated/node-metrics.log","file":"prow/pod-utils/gcs/upload.go:86","func":"k8s.io/test-infra/prow/pod-utils/gcs.upload","level":"info","msg":"Queued for upload","severity":"info","time":"2022-01-26T20:36:49Z"}
{"component":"gcsupload","dest":"logs/test_branch_origin_extended_conformance_install_update_containerized/2841/artifacts/generated/pid1.journal","file":"prow/pod-utils/gcs/upload.go:86","func":"k8s.io/test-infra/prow/pod-utils/gcs.upload","level":"info","msg":"Queued for upload","severity":"info","time":"2022-01-26T20:36:49Z"}
{"component":"gcsupload","dest":"logs/test_branch_origin_extended_conformance_install_update_containerized/2841/artifacts/journals/openvswitch.service","file":"prow/pod-utils/gcs/upload.go:86","func":"k8s.io/test-infra/prow/pod-utils/gcs.upload","level":"info","msg":"Queued for upload","severity":"info","time":"2022-01-26T20:36:49Z"}
{"component":"gcsupload","dest":"logs/test_branch_origin_extended_conformance_install_update_containerized/2841/artifacts/journals/origin-master-controllers.service","file":"prow/pod-utils/gcs/upload.go:86","func":"k8s.io/test-infra/prow/pod-utils/gcs.upload","level":"info","msg":"Queued for upload","severity":"info","time":"2022-01-26T20:36:49Z"}
{"component":"gcsupload","dest":"logs/test_branch_origin_extended_conformance_install_update_containerized/2841/artifacts/journals/ovs-vswitchd.service","file":"prow/pod-utils/gcs/upload.go:86","func":"k8s.io/test-infra/prow/pod-utils/gcs.upload","level":"info","msg":"Queued for upload","severity":"info","time":"2022-01-26T20:36:49Z"}
{"component":"gcsupload","dest":"logs/test_branch_origin_extended_conformance_install_update_containerized/latest-build.txt","file":"prow/pod-utils/gcs/upload.go:86","func":"k8s.io/test-infra/prow/pod-utils/gcs.upload","level":"info","msg":"Queued for upload","severity":"info","time":"2022-01-26T20:36:49Z"}
{"component":"gcsupload","dest":"logs/test_branch_origin_extended_conformance_install_update_containerized/2841/artifacts/generated/docker.info","file":"prow/pod-utils/gcs/upload.go:86","func":"k8s.io/test-infra/prow/pod-utils/gcs.upload","level":"info","msg":"Queued for upload","severity":"info","time":"2022-01-26T20:36:49Z"}
{"component":"gcsupload","dest":"logs/test_branch_origin_extended_conformance_install_update_containerized/2841/artifacts/generated/master-metrics.log","file":"prow/pod-utils/gcs/upload.go:86","func":"k8s.io/test-infra/prow/pod-utils/gcs.upload","level":"info","msg":"Queued for upload","severity":"info","time":"2022-01-26T20:36:49Z"}
{"component":"gcsupload","dest":"logs/test_branch_origin_extended_conformance_install_update_containerized/2841/artifacts/journals/origin-master-api.service","file":"prow/pod-utils/gcs/upload.go:86","func":"k8s.io/test-infra/prow/pod-utils/gcs.upload","level":"info","msg":"Queued for upload","severity":"info","time":"2022-01-26T20:36:49Z"}
{"component":"gcsupload","dest":"logs/test_branch_origin_extended_conformance_install_update_containerized/2841/artifacts/journals/origin-master.service","file":"prow/pod-utils/gcs/upload.go:86","func":"k8s.io/test-infra/prow/pod-utils/gcs.upload","level":"info","msg":"Queued for upload","severity":"info","time":"2022-01-26T20:36:49Z"}
{"component":"gcsupload","dest":"logs/test_branch_origin_extended_conformance_install_update_containerized/2841/build-log.txt","file":"prow/pod-utils/gcs/upload.go:86","func":"k8s.io/test-infra/prow/pod-utils/gcs.upload","level":"info","msg":"Queued for upload","severity":"info","time":"2022-01-26T20:36:49Z"}
{"component":"gcsupload","dest":"logs/test_branch_origin_extended_conformance_install_update_containerized/2841/finished.json","file":"prow/pod-utils/gcs/upload.go:86","func":"k8s.io/test-infra/prow/pod-utils/gcs.upload","level":"info","msg":"Queued for upload","severity":"info","time":"2022-01-26T20:36:49Z"}
{"component":"gcsupload","dest":"logs/test_branch_origin_extended_conformance_install_update_containerized/2841/artifacts/generated/avc_denials.log","file":"prow/pod-utils/gcs/upload.go:86","func":"k8s.io/test-infra/prow/pod-utils/gcs.upload","level":"info","msg":"Queued for upload","severity":"info","time":"2022-01-26T20:36:49Z"}
{"component":"gcsupload","dest":"logs/test_branch_origin_extended_conformance_install_update_containerized/2841/artifacts/generated/installed_packages.log","file":"prow/pod-utils/gcs/upload.go:86","func":"k8s.io/test-infra/prow/pod-utils/gcs.upload","level":"info","msg":"Queued for upload","severity":"info","time":"2022-01-26T20:36:49Z"}
{"component":"gcsupload","dest":"logs/test_branch_origin_extended_conformance_install_update_containerized/2841/artifacts/scripts/build-images/logs/scripts.log","file":"prow/pod-utils/gcs/upload.go:86","func":"k8s.io/test-infra/prow/pod-utils/gcs.upload","level":"info","msg":"Queued for upload","severity":"info","time":"2022-01-26T20:36:49Z"}
{"component":"gcsupload","dest":"logs/test_branch_origin_extended_conformance_install_update_containerized/2841/artifacts/scripts/env/logs/scripts.log","file":"prow/pod-utils/gcs/upload.go:86","func":"k8s.io/test-infra/prow/pod-utils/gcs.upload","level":"info","msg":"Queued for upload","severity":"info","time":"2022-01-26T20:36:49Z"}
{"component":"gcsupload","dest":"logs/test_branch_origin_extended_conformance_install_update_containerized/2841/artifacts/generated/filesystem.info","file":"prow/pod-utils/gcs/upload.go:86","func":"k8s.io/test-infra/prow/pod-utils/gcs.upload","level":"info","msg":"Queued for upload","severity":"info","time":"2022-01-26T20:36:49Z"}
{"component":"gcsupload","dest":"logs/test_branch_origin_extended_conformance_install_update_containerized/2841/artifacts/journals/ovsdb-server.service","file":"prow/pod-utils/gcs/upload.go:86","func":"k8s.io/test-infra/prow/pod-utils/gcs.upload","level":"info","msg":"Queued for upload","severity":"info","time":"2022-01-26T20:36:49Z"}
{"component":"gcsupload","dest":"logs/test_branch_origin_extended_conformance_install_update_containerized/2841/artifacts/journals/dnsmasq.service","file":"prow/pod-utils/gcs/upload.go:114","func":"k8s.io/test-infra/prow/pod-utils/gcs.upload.func1","level":"info","msg":"Finished upload","severity":"info","time":"2022-01-26T20:36:50Z"}
{"component":"gcsupload","dest":"logs/test_branch_origin_extended_conformance_install_update_containerized/2841/artifacts/generated/pid1.journal","file":"prow/pod-utils/gcs/upload.go:114","func":"k8s.io/test-infra/prow/pod-utils/gcs.upload.func1","level":"info","msg":"Finished upload","severity":"info","time":"2022-01-26T20:36:50Z"}
{"component":"gcsupload","dest":"logs/test_branch_origin_extended_conformance_install_update_containerized/2841/artifacts/journals/docker.service","file":"prow/pod-utils/gcs/upload.go:114","func":"k8s.io/test-infra/prow/pod-utils/gcs.upload.func1","level":"info","msg":"Finished upload","severity":"info","time":"2022-01-26T20:36:50Z"}
{"component":"gcsupload","dest":"logs/test_branch_origin_extended_conformance_install_update_containerized/2841/artifacts/journals/ovsdb-server.service","file":"prow/pod-utils/gcs/upload.go:114","func":"k8s.io/test-infra/prow/pod-utils/gcs.upload.func1","level":"info","msg":"Finished upload","severity":"info","time":"2022-01-26T20:36:50Z"}
{"component":"gcsupload","dest":"logs/test_branch_origin_extended_conformance_install_update_containerized/2841/artifacts/scripts/env/logs/scripts.log","file":"prow/pod-utils/gcs/upload.go:114","func":"k8s.io/test-infra/prow/pod-utils/gcs.upload.func1","level":"info","msg":"Finished upload","severity":"info","time":"2022-01-26T20:36:50Z"}
{"component":"gcsupload","dest":"logs/test_branch_origin_extended_conformance_install_update_containerized/2841/artifacts/generated/filesystem.info","file":"prow/pod-utils/gcs/upload.go:114","func":"k8s.io/test-infra/prow/pod-utils/gcs.upload.func1","level":"info","msg":"Finished upload","severity":"info","time":"2022-01-26T20:36:50Z"}
{"component":"gcsupload","dest":"logs/test_branch_origin_extended_conformance_install_update_containerized/2841/artifacts/generated/containers.log","file":"prow/pod-utils/gcs/upload.go:114","func":"k8s.io/test-infra/prow/pod-utils/gcs.upload.func1","level":"info","msg":"Finished upload","severity":"info","time":"2022-01-26T20:36:50Z"}
{"component":"gcsupload","dest":"logs/test_branch_origin_extended_conformance_install_update_containerized/2841/artifacts/journals/etcd.service","file":"prow/pod-utils/gcs/upload.go:114","func":"k8s.io/test-infra/prow/pod-utils/gcs.upload.func1","level":"info","msg":"Finished upload","severity":"info","time":"2022-01-26T20:36:50Z"}
{"component":"gcsupload","dest":"logs/test_branch_origin_extended_conformance_install_update_containerized/2841/artifacts/journals/origin-node.service","file":"prow/pod-utils/gcs/upload.go:114","func":"k8s.io/test-infra/prow/pod-utils/gcs.upload.func1","level":"info","msg":"Finished upload","severity":"info","time":"2022-01-26T20:36:50Z"}
{"component":"gcsupload","dest":"logs/test_branch_origin_extended_conformance_install_update_containerized/2841/artifacts/journals/systemd-journald.service","file":"prow/pod-utils/gcs/upload.go:114","func":"k8s.io/test-infra/prow/pod-utils/gcs.upload.func1","level":"info","msg":"Finished upload","severity":"info","time":"2022-01-26T20:36:50Z"}
{"component":"gcsupload","dest":"logs/test_branch_origin_extended_conformance_install_update_containerized/2841/artifacts/generated/docker.config","file":"prow/pod-utils/gcs/upload.go:114","func":"k8s.io/test-infra/prow/pod-utils/gcs.upload.func1","level":"info","msg":"Finished upload","severity":"info","time":"2022-01-26T20:36:50Z"}
{"component":"gcsupload","dest":"logs/test_branch_origin_extended_conformance_install_update_containerized/2841/artifacts/generated/master-metrics.log","file":"prow/pod-utils/gcs/upload.go:114","func":"k8s.io/test-infra/prow/pod-utils/gcs.upload.func1","level":"info","msg":"Finished upload","severity":"info","time":"2022-01-26T20:36:50Z"}
{"component":"gcsupload","dest":"logs/test_branch_origin_extended_conformance_install_update_containerized/2841/artifacts/journals/openvswitch.service","file":"prow/pod-utils/gcs/upload.go:114","func":"k8s.io/test-infra/prow/pod-utils/gcs.upload.func1","level":"info","msg":"Finished upload","severity":"info","time":"2022-01-26T20:36:50Z"}
{"component":"gcsupload","dest":"logs/test_branch_origin_extended_conformance_install_update_containerized/2841/artifacts/journals/origin-master-controllers.service","file":"prow/pod-utils/gcs/upload.go:114","func":"k8s.io/test-infra/prow/pod-utils/gcs.upload.func1","level":"info","msg":"Finished upload","severity":"info","time":"2022-01-26T20:36:50Z"}
{"component":"gcsupload","dest":"logs/test_branch_origin_extended_conformance_install_update_containerized/2841/artifacts/journals/ovs-vswitchd.service","file":"prow/pod-utils/gcs/upload.go:114","func":"k8s.io/test-infra/prow/pod-utils/gcs.upload.func1","level":"info","msg":"Finished upload","severity":"info","time":"2022-01-26T20:36:50Z"}
{"component":"gcsupload","dest":"logs/test_branch_origin_extended_conformance_install_update_containerized/latest-build.txt","file":"prow/pod-utils/gcs/upload.go:114","func":"k8s.io/test-infra/prow/pod-utils/gcs.upload.func1","level":"info","msg":"Finished upload","severity":"info","time":"2022-01-26T20:36:50Z"}
{"component":"gcsupload","dest":"logs/test_branch_origin_extended_conformance_install_update_containerized/2841/artifacts/scripts/build-images/logs/scripts.log","file":"prow/pod-utils/gcs/upload.go:114","func":"k8s.io/test-infra/prow/pod-utils/gcs.upload.func1","level":"info","msg":"Finished upload","severity":"info","time":"2022-01-26T20:36:51Z"}
{"component":"gcsupload","dest":"logs/test_branch_origin_extended_conformance_install_update_containerized/2841/artifacts/generated/node-metrics.log","file":"prow/pod-utils/gcs/upload.go:114","func":"k8s.io/test-infra/prow/pod-utils/gcs.upload.func1","level":"info","msg":"Finished upload","severity":"info","time":"2022-01-26T20:36:51Z"}
{"component":"gcsupload","dest":"logs/test_branch_origin_extended_conformance_install_update_containerized/2841/artifacts/generated/dmesg.log","file":"prow/pod-utils/gcs/upload.go:114","func":"k8s.io/test-infra/prow/pod-utils/gcs.upload.func1","level":"info","msg":"Finished upload","severity":"info","time":"2022-01-26T20:36:51Z"}
{"component":"gcsupload","dest":"logs/test_branch_origin_extended_conformance_install_update_containerized/2841/artifacts/journals/origin-master-api.service","file":"prow/pod-utils/gcs/upload.go:114","func":"k8s.io/test-infra/prow/pod-utils/gcs.upload.func1","level":"info","msg":"Finished upload","severity":"info","time":"2022-01-26T20:36:51Z"}
{"component":"gcsupload","dest":"logs/test_branch_origin_extended_conformance_install_update_containerized/2841/artifacts/journals/origin-master.service","file":"prow/pod-utils/gcs/upload.go:114","func":"k8s.io/test-infra/prow/pod-utils/gcs.upload.func1","level":"info","msg":"Finished upload","severity":"info","time":"2022-01-26T20:36:51Z"}
{"component":"gcsupload","dest":"logs/test_branch_origin_extended_conformance_install_update_containerized/2841/build-log.txt","file":"prow/pod-utils/gcs/upload.go:114","func":"k8s.io/test-infra/prow/pod-utils/gcs.upload.func1","level":"info","msg":"Finished upload","severity":"info","time":"2022-01-26T20:36:51Z"}
{"component":"gcsupload","dest":"logs/test_branch_origin_extended_conformance_install_update_containerized/2841/finished.json","file":"prow/pod-utils/gcs/upload.go:114","func":"k8s.io/test-infra/prow/pod-utils/gcs.upload.func1","level":"info","msg":"Finished upload","severity":"info","time":"2022-01-26T20:36:51Z"}
{"component":"gcsupload","dest":"logs/test_branch_origin_extended_conformance_install_update_containerized/2841/artifacts/generated/avc_denials.log","file":"prow/pod-utils/gcs/upload.go:114","func":"k8s.io/test-infra/prow/pod-utils/gcs.upload.func1","level":"info","msg":"Finished upload","severity":"info","time":"2022-01-26T20:36:51Z"}
{"component":"gcsupload","dest":"logs/test_branch_origin_extended_conformance_install_update_containerized/2841/artifacts/generated/installed_packages.log","file":"prow/pod-utils/gcs/upload.go:114","func":"k8s.io/test-infra/prow/pod-utils/gcs.upload.func1","level":"info","msg":"Finished upload","severity":"info","time":"2022-01-26T20:36:51Z"}
{"component":"gcsupload","dest":"logs/test_branch_origin_extended_conformance_install_update_containerized/2841/artifacts/generated/docker.info","file":"prow/pod-utils/gcs/upload.go:114","func":"k8s.io/test-infra/prow/pod-utils/gcs.upload.func1","level":"info","msg":"Finished upload","severity":"info","time":"2022-01-26T20:36:51Z"}
{"component":"gcsupload","file":"prow/gcsupload/run.go:78","func":"k8s.io/test-infra/prow/gcsupload.completeUpload","level":"info","msg":"Finished upload to blob storage","severity":"info","time":"2022-01-26T20:36:51Z"}
{"component":"gcsupload","file":"prow/gcsupload/run.go:78","func":"k8s.io/test-infra/prow/gcsupload.completeUpload","level":"info","msg":"Finished upload to blob storage","severity":"info","time":"2022-01-26T20:36:51Z"}
+ exit 0
+ set +o xtrace
########## FINISHED STAGE: SUCCESS: PUSH THE ARTIFACTS AND METADATA [00h 00m 08s] ##########
[workspace] $ /bin/bash /tmp/jenkins2895090455345938465.sh
########## STARTING STAGE: DEPROVISION CLOUD RESOURCES ##########
+ [[ -s /var/lib/jenkins/jobs/test_branch_origin_extended_conformance_install_update_containerized/workspace/activate ]]
+ source /var/lib/jenkins/jobs/test_branch_origin_extended_conformance_install_update_containerized/workspace/activate
++ export VIRTUAL_ENV=/var/lib/jenkins/origin-ci-tool/95a472392910104fc805c4ab8af39791105c956d
++ VIRTUAL_ENV=/var/lib/jenkins/origin-ci-tool/95a472392910104fc805c4ab8af39791105c956d
++ export PATH=/var/lib/jenkins/origin-ci-tool/95a472392910104fc805c4ab8af39791105c956d/bin:/sbin:/usr/sbin:/bin:/usr/bin
++ PATH=/var/lib/jenkins/origin-ci-tool/95a472392910104fc805c4ab8af39791105c956d/bin:/sbin:/usr/sbin:/bin:/usr/bin
++ unset PYTHON_HOME
++ export OCT_CONFIG_HOME=/var/lib/jenkins/jobs/test_branch_origin_extended_conformance_install_update_containerized/workspace/.config
++ OCT_CONFIG_HOME=/var/lib/jenkins/jobs/test_branch_origin_extended_conformance_install_update_containerized/workspace/.config
+ oct deprovision

PLAYBOOK: main.yml *************************************************************
4 plays in /var/lib/jenkins/origin-ci-tool/95a472392910104fc805c4ab8af39791105c956d/lib/python2.7/site-packages/oct/ansible/oct/playbooks/deprovision/main.yml

PLAY [ensure we have the parameters necessary to deprovision virtual hosts] ****

TASK [ensure all required variables are set] ***********************************
task path: /var/lib/jenkins/origin-ci-tool/95a472392910104fc805c4ab8af39791105c956d/lib/python2.7/site-packages/oct/ansible/oct/playbooks/deprovision/main.yml:9
skipping: [localhost] => (item=origin_ci_inventory_dir)  => {
    "changed": false, 
    "generated_timestamp": "2022-01-26 15:36:52.824500", 
    "item": "origin_ci_inventory_dir", 
    "skip_reason": "Conditional check failed", 
    "skipped": true
}
skipping: [localhost] => (item=origin_ci_aws_region)  => {
    "changed": false, 
    "generated_timestamp": "2022-01-26 15:36:52.828820", 
    "item": "origin_ci_aws_region", 
    "skip_reason": "Conditional check failed", 
    "skipped": true
}

PLAY [deprovision virtual hosts in EC2] ****************************************

TASK [Gathering Facts] *********************************************************
ok: [localhost]

TASK [deprovision a virtual EC2 host] ******************************************
task path: /var/lib/jenkins/origin-ci-tool/95a472392910104fc805c4ab8af39791105c956d/lib/python2.7/site-packages/oct/ansible/oct/playbooks/deprovision/main.yml:28
included: /var/lib/jenkins/origin-ci-tool/95a472392910104fc805c4ab8af39791105c956d/lib/python2.7/site-packages/oct/ansible/oct/playbooks/deprovision/roles/aws-down/tasks/main.yml for localhost

TASK [update the SSH configuration to remove AWS EC2 specifics] ****************
task path: /var/lib/jenkins/origin-ci-tool/95a472392910104fc805c4ab8af39791105c956d/lib/python2.7/site-packages/oct/ansible/oct/playbooks/deprovision/roles/aws-down/tasks/main.yml:2
ok: [localhost] => {
    "changed": false, 
    "generated_timestamp": "2022-01-26 15:36:53.736122", 
    "msg": ""
}

TASK [rename EC2 instance for termination reaper] ******************************
task path: /var/lib/jenkins/origin-ci-tool/95a472392910104fc805c4ab8af39791105c956d/lib/python2.7/site-packages/oct/ansible/oct/playbooks/deprovision/roles/aws-down/tasks/main.yml:8
changed: [localhost] => {
    "changed": true, 
    "generated_timestamp": "2022-01-26 15:36:54.460023", 
    "msg": "Tags {'Name': 'oct-terminate'} created for resource i-06e4b7053c3531f5f."
}

TASK [tear down the EC2 instance] **********************************************
task path: /var/lib/jenkins/origin-ci-tool/95a472392910104fc805c4ab8af39791105c956d/lib/python2.7/site-packages/oct/ansible/oct/playbooks/deprovision/roles/aws-down/tasks/main.yml:15
changed: [localhost] => {
    "changed": true, 
    "generated_timestamp": "2022-01-26 15:36:55.996262", 
    "instance_ids": [
        "i-06e4b7053c3531f5f"
    ], 
    "instances": [
        {
            "ami_launch_index": "0", 
            "architecture": "x86_64", 
            "block_device_mapping": {
                "/dev/sda1": {
                    "delete_on_termination": true, 
                    "status": "attached", 
                    "volume_id": "vol-0700e61db0f78f2a5"
                }, 
                "/dev/sdb": {
                    "delete_on_termination": true, 
                    "status": "attached", 
                    "volume_id": "vol-025224ff1e5fc10c5"
                }
            }, 
            "dns_name": "ec2-3-82-43-167.compute-1.amazonaws.com", 
            "ebs_optimized": false, 
            "groups": {
                "sg-7e73221a": "default"
            }, 
            "hypervisor": "xen", 
            "id": "i-06e4b7053c3531f5f", 
            "image_id": "ami-0be3a2afbcd35d3f1", 
            "instance_type": "m4.xlarge", 
            "kernel": null, 
            "key_name": "openshift-dev", 
            "launch_time": "2022-01-26T19:28:26.000Z", 
            "placement": "us-east-1d", 
            "private_dns_name": "ip-172-18-11-209.ec2.internal", 
            "private_ip": "172.18.11.209", 
            "public_dns_name": "ec2-3-82-43-167.compute-1.amazonaws.com", 
            "public_ip": "3.82.43.167", 
            "ramdisk": null, 
            "region": "us-east-1", 
            "root_device_name": "/dev/sda1", 
            "root_device_type": "ebs", 
            "state": "running", 
            "state_code": 16, 
            "tags": {
                "Name": "oct-terminate", 
                "openshift_etcd": "", 
                "openshift_master": "", 
                "openshift_node": ""
            }, 
            "tenancy": "default", 
            "virtualization_type": "hvm"
        }
    ], 
    "tagged_instances": []
}

TASK [remove the serialized host variables] ************************************
task path: /var/lib/jenkins/origin-ci-tool/95a472392910104fc805c4ab8af39791105c956d/lib/python2.7/site-packages/oct/ansible/oct/playbooks/deprovision/roles/aws-down/tasks/main.yml:22
changed: [localhost] => {
    "changed": true, 
    "generated_timestamp": "2022-01-26 15:36:56.261773", 
    "path": "/var/lib/jenkins/jobs/test_branch_origin_extended_conformance_install_update_containerized/workspace/.config/origin-ci-tool/inventory/host_vars/172.18.11.209.yml", 
    "state": "absent"
}

PLAY [deprovision virtual hosts locally manged by Vagrant] *********************

TASK [Gathering Facts] *********************************************************
ok: [localhost]

PLAY [clean up local configuration for deprovisioned instances] ****************

TASK [remove inventory configuration directory] ********************************
task path: /var/lib/jenkins/origin-ci-tool/95a472392910104fc805c4ab8af39791105c956d/lib/python2.7/site-packages/oct/ansible/oct/playbooks/deprovision/main.yml:61
changed: [localhost] => {
    "changed": true, 
    "generated_timestamp": "2022-01-26 15:36:56.770883", 
    "path": "/var/lib/jenkins/jobs/test_branch_origin_extended_conformance_install_update_containerized/workspace/.config/origin-ci-tool/inventory", 
    "state": "absent"
}

PLAY RECAP *********************************************************************
localhost                  : ok=8    changed=4    unreachable=0    failed=0   

+ set +o xtrace
########## FINISHED STAGE: SUCCESS: DEPROVISION CLOUD RESOURCES [00h 00m 05s] ##########
Archiving artifacts
sent [/var/lib/jenkins/jobs/test_branch_origin_extended_conformance_install_update_containerized/workspace/artifacts/gathered/scripts/build-images/logs/scripts.log, /var/lib/jenkins/jobs/test_branch_origin_extended_conformance_install_update_containerized/workspace/artifacts/gathered/scripts/env/logs/scripts.log, /var/lib/jenkins/jobs/test_branch_origin_extended_conformance_install_update_containerized/workspace/artifacts/generated/avc_denials.log, /var/lib/jenkins/jobs/test_branch_origin_extended_conformance_install_update_containerized/workspace/artifacts/generated/containers.log, /var/lib/jenkins/jobs/test_branch_origin_extended_conformance_install_update_containerized/workspace/artifacts/generated/dmesg.log, /var/lib/jenkins/jobs/test_branch_origin_extended_conformance_install_update_containerized/workspace/artifacts/generated/installed_packages.log, /var/lib/jenkins/jobs/test_branch_origin_extended_conformance_install_update_containerized/workspace/artifacts/generated/master-metrics.log, /var/lib/jenkins/jobs/test_branch_origin_extended_conformance_install_update_containerized/workspace/artifacts/generated/node-metrics.log, /var/lib/jenkins/jobs/test_branch_origin_extended_conformance_install_update_containerized/workspace/gcs/artifacts/generated/avc_denials.log, /var/lib/jenkins/jobs/test_branch_origin_extended_conformance_install_update_containerized/workspace/gcs/artifacts/generated/containers.log, /var/lib/jenkins/jobs/test_branch_origin_extended_conformance_install_update_containerized/workspace/gcs/artifacts/generated/dmesg.log, /var/lib/jenkins/jobs/test_branch_origin_extended_conformance_install_update_containerized/workspace/gcs/artifacts/generated/installed_packages.log, /var/lib/jenkins/jobs/test_branch_origin_extended_conformance_install_update_containerized/workspace/gcs/artifacts/generated/master-metrics.log, /var/lib/jenkins/jobs/test_branch_origin_extended_conformance_install_update_containerized/workspace/gcs/artifacts/generated/node-metrics.log, /var/lib/jenkins/jobs/test_branch_origin_extended_conformance_install_update_containerized/workspace/gcs/artifacts/scripts/build-images/logs/scripts.log, /var/lib/jenkins/jobs/test_branch_origin_extended_conformance_install_update_containerized/workspace/gcs/artifacts/scripts/env/logs/scripts.log] to splunk in 16 events
[WS-CLEANUP] Deleting project workspace...
[WS-CLEANUP] Deferred wipeout is used...
[WS-CLEANUP] done
Finished: FAILURE