Console Output

Skipping 436 KB.. Full Log
[openshift/origin-node]  device-mapper              x86_64 7:1.02.170-6.el7_9.5          updates  297 k
[openshift/origin-node]  device-mapper-libs         x86_64 7:1.02.170-6.el7_9.5          updates  325 k
[openshift/origin-node] Installing for dependencies:
[openshift/origin-node]  PyYAML                     x86_64 3.10-11.el7                   base     153 k
[openshift/origin-node]  atomic-registries          x86_64 1:1.22.1-33.gitb507039.el7_8  extras    36 k
[openshift/origin-node]  audit-libs-python          x86_64 2.8.5-4.el7                   base      76 k
[openshift/origin-node]  avahi-libs                 x86_64 0.6.31-20.el7                 base      62 k
[openshift/origin-node]  checkpolicy                x86_64 2.5-8.el7                     base     295 k
[openshift/origin-node]  cifs-utils                 x86_64 6.2-10.el7                    base      85 k
[openshift/origin-node]  container-selinux          noarch 2:2.119.2-1.911c772.el7_8     extras    40 k
[openshift/origin-node]  container-storage-setup    noarch 0.11.0-2.git5eaf76c.el7       extras    35 k
[openshift/origin-node]  containers-common          x86_64 1:0.1.40-11.el7_8             extras    43 k
[openshift/origin-node]  cups-libs                  x86_64 1:1.6.3-51.el7                base     359 k
[openshift/origin-node]  device-mapper-event        x86_64 7:1.02.170-6.el7_9.5          updates  192 k
[openshift/origin-node]  device-mapper-event-libs   x86_64 7:1.02.170-6.el7_9.5          updates  192 k
[openshift/origin-node]  dmidecode                  x86_64 1:3.2-5.el7_9.1               updates   82 k
[openshift/origin-node]  docker                     x86_64 2:1.13.1-208.git7d71120.el7_9 extras    17 M
[openshift/origin-node]  docker-client              x86_64 2:1.13.1-208.git7d71120.el7_9 extras   3.9 M
[openshift/origin-node]  docker-common              x86_64 2:1.13.1-208.git7d71120.el7_9 extras   101 k
[openshift/origin-node]  e2fsprogs-libs             x86_64 1.42.9-19.el7                 base     168 k
[openshift/origin-node]  fuse-overlayfs             x86_64 0.7.2-6.el7_8                 extras    54 k
[openshift/origin-node]  fuse3-libs                 x86_64 3.6.1-4.el7                   extras    82 k
[openshift/origin-node]  gnutls                     x86_64 3.3.29-9.el7_6                base     680 k
[openshift/origin-node]  gssproxy                   x86_64 0.7.0-30.el7_9                updates  111 k
[openshift/origin-node]  iscsi-initiator-utils-iscsiuio
[openshift/origin-node]                             x86_64 6.2.0.874-21.el7_9            updates   94 k
[openshift/origin-node]  jansson                    x86_64 2.10-1.el7                    base      37 k
[openshift/origin-node]  keyutils                   x86_64 1.5.8-3.el7                   base      54 k
[openshift/origin-node]  libbasicobjects            x86_64 0.1.1-32.el7                  base      26 k
[openshift/origin-node]  libcgroup                  x86_64 0.41-21.el7                   base      66 k
[openshift/origin-node]  libcollection              x86_64 0.7.0-32.el7                  base      42 k
[openshift/origin-node]  libevent                   x86_64 2.0.21-4.el7                  base     214 k
[openshift/origin-node]  libini_config              x86_64 1.3.1-32.el7                  base      64 k
[openshift/origin-node]  libldb                     x86_64 1.5.4-2.el7                   updates  149 k
[openshift/origin-node]  libnetfilter_cthelper      x86_64 1.0.0-11.el7                  base      18 k
[openshift/origin-node]  libnetfilter_cttimeout     x86_64 1.0.0-7.el7                   base      18 k
[openshift/origin-node]  libnetfilter_queue         x86_64 1.0.2-2.el7_2                 base      23 k
[openshift/origin-node]  libnfsidmap                x86_64 0.25-19.el7                   base      50 k
[openshift/origin-node]  libnl                      x86_64 1.1.4-3.el7                   base     128 k
[openshift/origin-node]  libpath_utils              x86_64 0.2.1-32.el7                  base      28 k
[openshift/origin-node]  libpcap                    x86_64 14:1.5.3-12.el7               base     139 k
[openshift/origin-node]  libref_array               x86_64 0.1.5-32.el7                  base      27 k
[openshift/origin-node]  libseccomp                 x86_64 2.3.1-4.el7                   base      56 k
[openshift/origin-node]  libselinux-python          x86_64 2.5-15.el7                    base     236 k
[openshift/origin-node]  libselinux-utils           x86_64 2.5-15.el7                    base     151 k
[openshift/origin-node]  libsemanage-python         x86_64 2.5-14.el7                    base     113 k
[openshift/origin-node]  libss                      x86_64 1.42.9-19.el7                 base      47 k
[openshift/origin-node]  libtalloc                  x86_64 2.1.16-1.el7                  base      33 k
[openshift/origin-node]  libtdb                     x86_64 1.3.18-1.el7                  base      49 k
[openshift/origin-node]  libtevent                  x86_64 0.9.39-1.el7                  base      41 k
[openshift/origin-node]  libtirpc                   x86_64 0.2.4-0.16.el7                base      89 k
[openshift/origin-node]  libverto-libevent          x86_64 0.2.5-4.el7                   base     8.9 k
[openshift/origin-node]  libwbclient                x86_64 4.10.16-15.el7_9              updates  116 k
[openshift/origin-node]  libyaml                    x86_64 0.1.4-11.el7_0                base      55 k
[openshift/origin-node]  lvm2                       x86_64 7:2.02.187-6.el7_9.5          updates  1.3 M
[openshift/origin-node]  lvm2-libs                  x86_64 7:2.02.187-6.el7_9.5          updates  1.1 M
[openshift/origin-node]  make                       x86_64 1:3.82-24.el7                 base     421 k
[openshift/origin-node]  nettle                     x86_64 2.7.1-9.el7_9                 updates  328 k
[openshift/origin-node]  nfs-utils                  x86_64 1:1.3.0-0.68.el7.2            updates  413 k
[openshift/origin-node]  oci-register-machine       x86_64 1:0-6.git2b44233.el7          extras   1.1 M
[openshift/origin-node]  oci-systemd-hook           x86_64 1:0.2.0-1.git05e6923.el7_6    extras    34 k
[openshift/origin-node]  oci-umount                 x86_64 2:2.5-3.el7                   extras    33 k
[openshift/origin-node]  openvswitch                x86_64 2.7.0-1.el7                   cbs-paas7-openshift-multiarch-el7-build
[openshift/origin-node]                                                                           2.5 M
[openshift/origin-node]  parted                     x86_64 3.1-32.el7                    base     609 k
[openshift/origin-node]  policycoreutils            x86_64 2.5-34.el7                    base     917 k
[openshift/origin-node]  policycoreutils-python     x86_64 2.5-34.el7                    base     457 k
[openshift/origin-node]  python-IPy                 noarch 0.75-6.el7                    base      32 k
[openshift/origin-node]  python-dateutil            noarch 1.5-7.el7                     base      85 k
[openshift/origin-node]  python-decorator           noarch 3.4.0-3.el7                   base      27 k
[openshift/origin-node]  python-dmidecode           x86_64 3.12.2-4.el7                  base      83 k
[openshift/origin-node]  python-ethtool             x86_64 0.8-8.el7                     base      34 k
[openshift/origin-node]  python-inotify             noarch 0.9.4-4.el7                   base      49 k
[openshift/origin-node]  python-pytoml              noarch 0.1.14-1.git7dea353.el7       extras    18 k
[openshift/origin-node]  python-setuptools          noarch 0.9.8-7.el7                   base     397 k
[openshift/origin-node]  python-syspurpose          x86_64 1.24.48-1.el7.centos          updates  274 k
[openshift/origin-node]  quota                      x86_64 1:4.01-19.el7                 base     179 k
[openshift/origin-node]  quota-nls                  noarch 1:4.01-19.el7                 base      90 k
[openshift/origin-node]  rpcbind                    x86_64 0.2.0-49.el7                  base      60 k
[openshift/origin-node]  samba-client-libs          x86_64 4.10.16-15.el7_9              updates  5.0 M
[openshift/origin-node]  samba-common               noarch 4.10.16-15.el7_9              updates  215 k
[openshift/origin-node]  samba-common-libs          x86_64 4.10.16-15.el7_9              updates  182 k
[openshift/origin-node]  selinux-policy             noarch 3.13.1-268.el7_9.2            updates  498 k
[openshift/origin-node]  selinux-policy-targeted    noarch 3.13.1-268.el7_9.2            updates  7.0 M
[openshift/origin-node]  setools-libs               x86_64 3.3.8-4.el7                   base     620 k
[openshift/origin-node]  slirp4netns                x86_64 0.4.3-4.el7_8                 extras    81 k
[openshift/origin-node]  subscription-manager       x86_64 1.24.48-1.el7.centos          updates  1.1 M
[openshift/origin-node]  subscription-manager-rhsm  x86_64 1.24.48-1.el7.centos          updates  333 k
[openshift/origin-node]  subscription-manager-rhsm-certificates
[openshift/origin-node]                             x86_64 1.24.48-1.el7.centos          updates  237 k
[openshift/origin-node]  systemd-sysv               x86_64 219-78.el7_9.3                updates   97 k
[openshift/origin-node]  tcp_wrappers               x86_64 7.6-77.el7                    base      78 k
[openshift/origin-node]  trousers                   x86_64 0.3.14-2.el7                  base     289 k
[openshift/origin-node]  usermode                   x86_64 1.111-6.el7                   base     193 k
[openshift/origin-node]  virt-what                  x86_64 1.18-4.el7_9.1                updates   30 k
[openshift/origin-node]  yajl                       x86_64 2.0.4-4.el7                   base      39 k
[openshift/origin-node] Updating for dependencies:
[openshift/origin-node]  openssl-libs               x86_64 1:1.0.2k-22.el7_9             updates  1.2 M
[openshift/origin-node]  systemd                    x86_64 219-78.el7_9.3                updates  5.1 M
[openshift/origin-node]  systemd-libs               x86_64 219-78.el7_9.3                updates  418 k
[openshift/origin-node] Transaction Summary
[openshift/origin-node] ================================================================================
[openshift/origin-node] Install  12 Packages (+90 Dependent packages)
[openshift/origin-node] Upgrade   3 Packages (+ 3 Dependent packages)
[openshift/origin-node] Total download size: 110 M
[openshift/origin-node] Downloading packages:
[openshift/origin-node] Delta RPMs disabled because /usr/bin/applydeltarpm not installed.
[openshift/origin-node] --------------------------------------------------------------------------------
[openshift/origin-node] Total                                               14 MB/s | 110 MB  00:08     
[openshift/origin-node] Running transaction check
[openshift/origin-node] Running transaction test
[openshift/origin-node] Transaction test succeeded
[openshift/origin-node] Running transaction
[openshift/origin-node]   Updating   : 1:openssl-libs-1.0.2k-22.el7_9.x86_64                      1/114 
[openshift/origin-node]   Updating   : systemd-libs-219-78.el7_9.3.x86_64                         2/114 
[openshift/origin-node]   Updating   : systemd-219-78.el7_9.3.x86_64                              3/114 
[openshift/origin-node] Failed to get D-Bus connection: Operation not permitted
[openshift/origin-node]   Installing : libtalloc-2.1.16-1.el7.x86_64                              4/114 
[openshift/origin-node]   Installing : libtevent-0.9.39-1.el7.x86_64                              5/114 
[openshift/origin-node]   Installing : libtdb-1.3.18-1.el7.x86_64                                 6/114 
[openshift/origin-node]   Installing : libldb-1.5.4-2.el7.x86_64                                  7/114 
[openshift/origin-node]   Updating   : 7:device-mapper-libs-1.02.170-6.el7_9.5.x86_64             8/114 
[openshift/origin-node]   Updating   : 7:device-mapper-1.02.170-6.el7_9.5.x86_64                  9/114 
[openshift/origin-node]   Installing : 7:device-mapper-event-libs-1.02.170-6.el7_9.5.x86_64      10/114 
[openshift/origin-node]   Installing : samba-common-4.10.16-15.el7_9.noarch                      11/114 
[openshift/origin-node]   Installing : libevent-2.0.21-4.el7.x86_64                              12/114 
[openshift/origin-node]   Installing : libcollection-0.7.0-32.el7.x86_64                         13/114 
[openshift/origin-node]   Installing : libselinux-utils-2.5-15.el7.x86_64                        14/114 
[openshift/origin-node]   Installing : policycoreutils-2.5-34.el7.x86_64                         15/114 
[openshift/origin-node]   Installing : selinux-policy-3.13.1-268.el7_9.2.noarch                  16/114 
[openshift/origin-node]   Installing : libseccomp-2.3.1-4.el7.x86_64                             17/114 
[openshift/origin-node]   Installing : 2:ethtool-4.8-10.el7.x86_64                               18/114 
[openshift/origin-node]   Installing : libtirpc-0.2.4-0.16.el7.x86_64                            19/114 
[openshift/origin-node]   Installing : device-mapper-persistent-data-0.8.5-3.el7_9.2.x86_64      20/114 
[openshift/origin-node]   Installing : xfsprogs-4.5.0-22.el7.x86_64                              21/114 
[openshift/origin-node]   Installing : python-dateutil-1.5-7.el7.noarch                          22/114 
[openshift/origin-node]   Installing : avahi-libs-0.6.31-20.el7.x86_64                           23/114 
[openshift/origin-node]   Installing : 1:cups-libs-1.6.3-51.el7.x86_64                           24/114 
[openshift/origin-node]   Installing : keyutils-1.5.8-3.el7.x86_64                               25/114 
[openshift/origin-node]   Installing : jansson-2.10-1.el7.x86_64                                 26/114 
[openshift/origin-node]   Installing : libref_array-0.1.5-32.el7.x86_64                          27/114 
[openshift/origin-node]   Installing : e2fsprogs-libs-1.42.9-19.el7.x86_64                       28/114 
[openshift/origin-node]   Installing : subscription-manager-rhsm-certificates-1.24.48-1.el7.c    29/114 
[openshift/origin-node]   Installing : python-setuptools-0.9.8-7.el7.noarch                      30/114 
[openshift/origin-node]   Installing : libbasicobjects-0.1.1-32.el7.x86_64                       31/114 
[openshift/origin-node]   Installing : yajl-2.0.4-4.el7.x86_64                                   32/114 
[openshift/origin-node]   Installing : 2:oci-umount-2.5-3.el7.x86_64                             33/114 
[openshift/origin-node]   Installing : 1:oci-systemd-hook-0.2.0-1.git05e6923.el7_6.x86_64        34/114 
[openshift/origin-node]   Installing : subscription-manager-rhsm-1.24.48-1.el7.centos.x86_64     35/114 
[openshift/origin-node]   Installing : slirp4netns-0.4.3-4.el7_8.x86_64                          36/114 
[openshift/origin-node]   Installing : selinux-policy-targeted-3.13.1-268.el7_9.2.noarch         37/114 
[openshift/origin-node]   Installing : libverto-libevent-0.2.5-4.el7.x86_64                      38/114 
[openshift/origin-node]   Installing : 7:device-mapper-event-1.02.170-6.el7_9.5.x86_64           39/114 
[openshift/origin-node] Failed to get D-Bus connection: Operation not permitted
[openshift/origin-node] warning: %post(device-mapper-event-7:1.02.170-6.el7_9.5.x86_64) scriptlet failed, exit status 1
[openshift/origin-node] Non-fatal POSTIN scriptlet failure in rpm package 7:device-mapper-event-1.02.170-6.el7_9.5.x86_64
[openshift/origin-node]   Installing : 7:lvm2-libs-2.02.187-6.el7_9.5.x86_64                     40/114 
[openshift/origin-node]   Installing : 7:lvm2-2.02.187-6.el7_9.5.x86_64                          41/114 
[openshift/origin-node] Failed to get D-Bus connection: Operation not permitted
[openshift/origin-node] Failed to get D-Bus connection: Operation not permitted
[openshift/origin-node] Failed to get D-Bus connection: Operation not permitted
[openshift/origin-node] warning: %post(lvm2-7:2.02.187-6.el7_9.5.x86_64) scriptlet failed, exit status 1
[openshift/origin-node] Non-fatal POSTIN scriptlet failure in rpm package 7:lvm2-2.02.187-6.el7_9.5.x86_64
[openshift/origin-node]   Installing : parted-3.1-32.el7.x86_64                                  42/114 
[openshift/origin-node]   Installing : container-storage-setup-0.11.0-2.git5eaf76c.el7.noarch    43/114 
[openshift/origin-node]   Installing : systemd-sysv-219-78.el7_9.3.x86_64                        44/114 
[openshift/origin-node]   Installing : rpcbind-0.2.0-49.el7.x86_64                               45/114 
[openshift/origin-node]   Installing : iscsi-initiator-utils-iscsiuio-6.2.0.874-21.el7_9.x86_    46/114 
[openshift/origin-node]   Installing : iscsi-initiator-utils-6.2.0.874-21.el7_9.x86_64           47/114 
[openshift/origin-node]   Installing : trousers-0.3.14-2.el7.x86_64                              48/114 
[openshift/origin-node]   Installing : 1:oci-register-machine-0-6.git2b44233.el7.x86_64          49/114 
[openshift/origin-node]   Installing : libcgroup-0.41-21.el7.x86_64                              50/114 
[openshift/origin-node]   Installing : 1:quota-nls-4.01-19.el7.noarch                            51/114 
[openshift/origin-node]   Installing : python-syspurpose-1.24.48-1.el7.centos.x86_64             52/114 
[openshift/origin-node]   Installing : libss-1.42.9-19.el7.x86_64                                53/114 
[openshift/origin-node]   Installing : checkpolicy-2.5-8.el7.x86_64                              54/114 
[openshift/origin-node]   Installing : python-inotify-0.9.4-4.el7.noarch                         55/114 
[openshift/origin-node]   Installing : libyaml-0.1.4-11.el7_0.x86_64                             56/114 
[openshift/origin-node]   Installing : PyYAML-3.10-11.el7.x86_64                                 57/114 
[openshift/origin-node]   Installing : python-dmidecode-3.12.2-4.el7.x86_64                      58/114 
[openshift/origin-node]   Installing : libsemanage-python-2.5-14.el7.x86_64                      59/114 
[openshift/origin-node]   Installing : fuse3-libs-3.6.1-4.el7.x86_64                             60/114 
[openshift/origin-node]   Installing : fuse-overlayfs-0.7.2-6.el7_8.x86_64                       61/114 
[openshift/origin-node]   Installing : libnetfilter_cttimeout-1.0.0-7.el7.x86_64                 62/114 
[openshift/origin-node]   Installing : libnetfilter_queue-1.0.2-2.el7_2.x86_64                   63/114 
[openshift/origin-node]   Installing : audit-libs-python-2.8.5-4.el7.x86_64                      64/114 
[openshift/origin-node]   Installing : libselinux-python-2.5-15.el7.x86_64                       65/114 
[openshift/origin-node]   Installing : usermode-1.111-6.el7.x86_64                               66/114 
[openshift/origin-node]   Installing : libnfsidmap-0.25-19.el7.x86_64                            67/114 
[openshift/origin-node]   Installing : nettle-2.7.1-9.el7_9.x86_64                               68/114 
[openshift/origin-node] install-info: No such file or directory for /usr/share/info/nettle.info
[openshift/origin-node]   Installing : gnutls-3.3.29-9.el7_6.x86_64                              69/114 
[openshift/origin-node]   Installing : samba-client-libs-4.10.16-15.el7_9.x86_64                 70/114 
[openshift/origin-node]   Installing : libwbclient-4.10.16-15.el7_9.x86_64                       71/114 
[openshift/origin-node]   Installing : samba-common-libs-4.10.16-15.el7_9.x86_64                 72/114 
[openshift/origin-node]   Installing : cifs-utils-6.2-10.el7.x86_64                              73/114 
[openshift/origin-node]   Installing : bridge-utils-1.5-9.el7.x86_64                             74/114 
[openshift/origin-node]   Installing : setools-libs-3.3.8-4.el7.x86_64                           75/114 
[openshift/origin-node]   Installing : 1:make-3.82-24.el7.x86_64                                 76/114 
[openshift/origin-node]   Installing : 1:openssl-1.0.2k-22.el7_9.x86_64                          77/114 
[openshift/origin-node]   Installing : openvswitch-2.7.0-1.el7.x86_64                            78/114 
[openshift/origin-node]   Installing : python-IPy-0.75-6.el7.noarch                              79/114 
[openshift/origin-node]   Installing : policycoreutils-python-2.5-34.el7.x86_64                  80/114 
[openshift/origin-node]   Installing : 2:container-selinux-2.119.2-1.911c772.el7_8.noarch        81/114 
[openshift/origin-node] setsebool:  SELinux is disabled.
[openshift/origin-node]   Installing : tcp_wrappers-7.6-77.el7.x86_64                            82/114 
[openshift/origin-node]   Installing : 1:quota-4.01-19.el7.x86_64                                83/114 
[openshift/origin-node]   Installing : libnl-1.1.4-3.el7.x86_64                                  84/114 
[openshift/origin-node]   Installing : python-ethtool-0.8-8.el7.x86_64                           85/114 
[openshift/origin-node]   Installing : libpath_utils-0.2.1-32.el7.x86_64                         86/114 
[openshift/origin-node]   Installing : libini_config-1.3.1-32.el7.x86_64                         87/114 
[openshift/origin-node]   Installing : gssproxy-0.7.0-30.el7_9.x86_64                            88/114 
[openshift/origin-node]   Installing : 1:nfs-utils-1.3.0-0.68.el7.2.x86_64                       89/114 
[openshift/origin-node]   Installing : python-decorator-3.4.0-3.el7.noarch                       90/114 
[openshift/origin-node]   Installing : libnetfilter_cthelper-1.0.0-11.el7.x86_64                 91/114 
[openshift/origin-node]   Installing : conntrack-tools-1.4.4-7.el7.x86_64                        92/114 
[openshift/origin-node]   Installing : 1:dmidecode-3.2-5.el7_9.1.x86_64                          93/114 
[openshift/origin-node]   Installing : virt-what-1.18-4.el7_9.1.x86_64                           94/114 
[openshift/origin-node]   Installing : subscription-manager-1.24.48-1.el7.centos.x86_64          95/114 
[openshift/origin-node]   Installing : 1:containers-common-0.1.40-11.el7_8.x86_64                96/114 
[openshift/origin-node]   Installing : python-pytoml-0.1.14-1.git7dea353.el7.noarch              97/114 
[openshift/origin-node]   Installing : 1:atomic-registries-1.22.1-33.gitb507039.el7_8.x86_64     98/114 
[openshift/origin-node]   Installing : 2:docker-common-1.13.1-208.git7d71120.el7_9.x86_64        99/114 
[openshift/origin-node]   Installing : 2:docker-client-1.13.1-208.git7d71120.el7_9.x86_64       100/114 
[openshift/origin-node]   Installing : 2:docker-1.13.1-208.git7d71120.el7_9.x86_64              101/114 
[openshift/origin-node]   Installing : 14:libpcap-1.5.3-12.el7.x86_64                           102/114 
[openshift/origin-node]   Installing : origin-hyperkube-3.10.0-1.164.d4ca19f.x86_64             103/114 
[openshift/origin-node]   Installing : origin-node-3.10.0-1.164.d4ca19f.x86_64                  104/114 
[openshift/origin-node]   Installing : origin-sdn-ovs-3.10.0-1.164.d4ca19f.x86_64               105/114 
[openshift/origin-node]   Installing : 2:nmap-ncat-6.40-19.el7.x86_64                           106/114 
[openshift/origin-node]   Installing : e2fsprogs-1.42.9-19.el7.x86_64                           107/114 
[openshift/origin-node]   Updating   : binutils-2.27-44.base.el7_9.1.x86_64                     108/114 
[openshift/origin-node] install-info: No such file or directory for /usr/share/info/as.info.gz
[openshift/origin-node] install-info: No such file or directory for /usr/share/info/binutils.info.gz
[openshift/origin-node] install-info: No such file or directory for /usr/share/info/gprof.info.gz
[openshift/origin-node] install-info: No such file or directory for /usr/share/info/ld.info.gz
[openshift/origin-node] install-info: No such file or directory for /usr/share/info/standards.info.gz
[openshift/origin-node]   Cleanup    : 7:device-mapper-libs-1.02.170-6.el7.x86_64               109/114 
[openshift/origin-node]   Cleanup    : 7:device-mapper-1.02.170-6.el7.x86_64                    110/114 
[openshift/origin-node]   Cleanup    : systemd-219-78.el7.x86_64                                111/114 
[openshift/origin-node]   Cleanup    : systemd-libs-219-78.el7.x86_64                           112/114 
[openshift/origin-node]   Cleanup    : 1:openssl-libs-1.0.2k-19.el7.x86_64                      113/114 
[openshift/origin-node]   Cleanup    : binutils-2.27-44.base.el7.x86_64                         114/114 
[openshift/origin-node]   Verifying  : 7:device-mapper-event-1.02.170-6.el7_9.5.x86_64            1/114 
[openshift/origin-node]   Verifying  : origin-hyperkube-3.10.0-1.164.d4ca19f.x86_64               2/114 
[openshift/origin-node]   Verifying  : libwbclient-4.10.16-15.el7_9.x86_64                        3/114 
[openshift/origin-node]   Verifying  : 14:libpcap-1.5.3-12.el7.x86_64                             4/114 
[openshift/origin-node]   Verifying  : selinux-policy-targeted-3.13.1-268.el7_9.2.noarch          5/114 
[openshift/origin-node]   Verifying  : samba-client-libs-4.10.16-15.el7_9.x86_64                  6/114 
[openshift/origin-node]   Verifying  : systemd-219-78.el7_9.3.x86_64                              7/114 
[openshift/origin-node]   Verifying  : 2:oci-umount-2.5-3.el7.x86_64                              8/114 
[openshift/origin-node]   Verifying  : python-pytoml-0.1.14-1.git7dea353.el7.noarch               9/114 
[openshift/origin-node]   Verifying  : 7:lvm2-2.02.187-6.el7_9.5.x86_64                          10/114 
[openshift/origin-node]   Verifying  : 2:docker-1.13.1-208.git7d71120.el7_9.x86_64               11/114 
[openshift/origin-node]   Verifying  : openvswitch-2.7.0-1.el7.x86_64                            12/114 
[openshift/origin-node]   Verifying  : slirp4netns-0.4.3-4.el7_8.x86_64                          13/114 
[openshift/origin-node]   Verifying  : subscription-manager-1.24.48-1.el7.centos.x86_64          14/114 
[openshift/origin-node]   Verifying  : 1:dmidecode-3.2-5.el7_9.1.x86_64                          15/114 
[openshift/origin-node]   Verifying  : yajl-2.0.4-4.el7.x86_64                                   16/114 
[openshift/origin-node]   Verifying  : selinux-policy-3.13.1-268.el7_9.2.noarch                  17/114 
[openshift/origin-node]   Verifying  : libnetfilter_cthelper-1.0.0-11.el7.x86_64                 18/114 
[openshift/origin-node]   Verifying  : python-decorator-3.4.0-3.el7.noarch                       19/114 
[openshift/origin-node]   Verifying  : 2:docker-common-1.13.1-208.git7d71120.el7_9.x86_64        20/114 
[openshift/origin-node]   Verifying  : libpath_utils-0.2.1-32.el7.x86_64                         21/114 
[openshift/origin-node]   Verifying  : libnl-1.1.4-3.el7.x86_64                                  22/114 
[openshift/origin-node]   Verifying  : 2:docker-client-1.13.1-208.git7d71120.el7_9.x86_64        23/114 
[openshift/origin-node]   Verifying  : 7:device-mapper-1.02.170-6.el7_9.5.x86_64                 24/114 
[openshift/origin-node]   Verifying  : PyYAML-3.10-11.el7.x86_64                                 25/114 
[openshift/origin-node]   Verifying  : gssproxy-0.7.0-30.el7_9.x86_64                            26/114 
[openshift/origin-node]   Verifying  : fuse-overlayfs-0.7.2-6.el7_8.x86_64                       27/114 
[openshift/origin-node]   Verifying  : 2:container-selinux-2.119.2-1.911c772.el7_8.noarch        28/114 
[openshift/origin-node]   Verifying  : e2fsprogs-1.42.9-19.el7.x86_64                            29/114 
[openshift/origin-node]   Verifying  : libtdb-1.3.18-1.el7.x86_64                                30/114 
[openshift/origin-node]   Verifying  : libbasicobjects-0.1.1-32.el7.x86_64                       31/114 
[openshift/origin-node]   Verifying  : python-setuptools-0.9.8-7.el7.noarch                      32/114 
[openshift/origin-node]   Verifying  : 1:cups-libs-1.6.3-51.el7.x86_64                           33/114 
[openshift/origin-node]   Verifying  : subscription-manager-rhsm-certificates-1.24.48-1.el7.c    34/114 
[openshift/origin-node]   Verifying  : tcp_wrappers-7.6-77.el7.x86_64                            35/114 
[openshift/origin-node]   Verifying  : libldb-1.5.4-2.el7.x86_64                                 36/114 
[openshift/origin-node]   Verifying  : systemd-sysv-219-78.el7_9.3.x86_64                        37/114 
[openshift/origin-node]   Verifying  : python-IPy-0.75-6.el7.noarch                              38/114 
[openshift/origin-node]   Verifying  : 1:make-3.82-24.el7.x86_64                                 39/114 
[openshift/origin-node]   Verifying  : gnutls-3.3.29-9.el7_6.x86_64                              40/114 
[openshift/origin-node]   Verifying  : setools-libs-3.3.8-4.el7.x86_64                           41/114 
[openshift/origin-node]   Verifying  : binutils-2.27-44.base.el7_9.1.x86_64                      42/114 
[openshift/origin-node]   Verifying  : e2fsprogs-libs-1.42.9-19.el7.x86_64                       43/114 
[openshift/origin-node]   Verifying  : 1:oci-systemd-hook-0.2.0-1.git05e6923.el7_6.x86_64        44/114 
[openshift/origin-node]   Verifying  : iscsi-initiator-utils-6.2.0.874-21.el7_9.x86_64           45/114 
[openshift/origin-node]   Verifying  : bridge-utils-1.5-9.el7.x86_64                             46/114 
[openshift/origin-node]   Verifying  : iscsi-initiator-utils-iscsiuio-6.2.0.874-21.el7_9.x86_    47/114 
[openshift/origin-node]   Verifying  : libref_array-0.1.5-32.el7.x86_64                          48/114 
[openshift/origin-node]   Verifying  : origin-node-3.10.0-1.164.d4ca19f.x86_64                   49/114 
[openshift/origin-node]   Verifying  : jansson-2.10-1.el7.x86_64                                 50/114 
[openshift/origin-node]   Verifying  : nettle-2.7.1-9.el7_9.x86_64                               51/114 
[openshift/origin-node]   Verifying  : libtevent-0.9.39-1.el7.x86_64                             52/114 
[openshift/origin-node]   Verifying  : libnfsidmap-0.25-19.el7.x86_64                            53/114 
[openshift/origin-node]   Verifying  : keyutils-1.5.8-3.el7.x86_64                               54/114 
[openshift/origin-node]   Verifying  : parted-3.1-32.el7.x86_64                                  55/114 
[openshift/origin-node]   Verifying  : usermode-1.111-6.el7.x86_64                               56/114 
[openshift/origin-node]   Verifying  : avahi-libs-0.6.31-20.el7.x86_64                           57/114 
[openshift/origin-node]   Verifying  : trousers-0.3.14-2.el7.x86_64                              58/114 
[openshift/origin-node]   Verifying  : python-ethtool-0.8-8.el7.x86_64                           59/114 
[openshift/origin-node]   Verifying  : container-storage-setup-0.11.0-2.git5eaf76c.el7.noarch    60/114 
[openshift/origin-node]   Verifying  : libselinux-python-2.5-15.el7.x86_64                       61/114 
[openshift/origin-node]   Verifying  : 1:nfs-utils-1.3.0-0.68.el7.2.x86_64                       62/114 
[openshift/origin-node]   Verifying  : 7:device-mapper-libs-1.02.170-6.el7_9.5.x86_64            63/114 
[openshift/origin-node]   Verifying  : audit-libs-python-2.8.5-4.el7.x86_64                      64/114 
[openshift/origin-node]   Verifying  : rpcbind-0.2.0-49.el7.x86_64                               65/114 
[openshift/origin-node]   Verifying  : conntrack-tools-1.4.4-7.el7.x86_64                        66/114 
[openshift/origin-node]   Verifying  : python-dateutil-1.5-7.el7.noarch                          67/114 
[openshift/origin-node]   Verifying  : policycoreutils-2.5-34.el7.x86_64                         68/114 
[openshift/origin-node]   Verifying  : libnetfilter_queue-1.0.2-2.el7_2.x86_64                   69/114 
[openshift/origin-node]   Verifying  : subscription-manager-rhsm-1.24.48-1.el7.centos.x86_64     70/114 
[openshift/origin-node]   Verifying  : xfsprogs-4.5.0-22.el7.x86_64                              71/114 
[openshift/origin-node]   Verifying  : policycoreutils-python-2.5-34.el7.x86_64                  72/114 
[openshift/origin-node]   Verifying  : libnetfilter_cttimeout-1.0.0-7.el7.x86_64                 73/114 
[openshift/origin-node]   Verifying  : 1:openssl-libs-1.0.2k-22.el7_9.x86_64                     74/114 
[openshift/origin-node]   Verifying  : fuse3-libs-3.6.1-4.el7.x86_64                             75/114 
[openshift/origin-node]   Verifying  : 1:openssl-1.0.2k-22.el7_9.x86_64                          76/114 
[openshift/origin-node]   Verifying  : libsemanage-python-2.5-14.el7.x86_64                      77/114 
[openshift/origin-node]   Verifying  : libtalloc-2.1.16-1.el7.x86_64                             78/114 
[openshift/origin-node]   Verifying  : python-dmidecode-3.12.2-4.el7.x86_64                      79/114 
[openshift/origin-node]   Verifying  : libyaml-0.1.4-11.el7_0.x86_64                             80/114 
[openshift/origin-node]   Verifying  : 1:quota-4.01-19.el7.x86_64                                81/114 
[openshift/origin-node]   Verifying  : samba-common-libs-4.10.16-15.el7_9.x86_64                 82/114 
[openshift/origin-node]   Verifying  : device-mapper-persistent-data-0.8.5-3.el7_9.2.x86_64      83/114 
[openshift/origin-node]   Verifying  : samba-common-4.10.16-15.el7_9.noarch                      84/114 
[openshift/origin-node]   Verifying  : libtirpc-0.2.4-0.16.el7.x86_64                            85/114 
[openshift/origin-node]   Verifying  : virt-what-1.18-4.el7_9.1.x86_64                           86/114 
[openshift/origin-node]   Verifying  : 1:atomic-registries-1.22.1-33.gitb507039.el7_8.x86_64     87/114 
[openshift/origin-node]   Verifying  : 2:ethtool-4.8-10.el7.x86_64                               88/114 
[openshift/origin-node]   Verifying  : python-inotify-0.9.4-4.el7.noarch                         89/114 
[openshift/origin-node]   Verifying  : 1:containers-common-0.1.40-11.el7_8.x86_64                90/114 
[openshift/origin-node]   Verifying  : systemd-libs-219-78.el7_9.3.x86_64                        91/114 
[openshift/origin-node]   Verifying  : libseccomp-2.3.1-4.el7.x86_64                             92/114 
[openshift/origin-node]   Verifying  : libselinux-utils-2.5-15.el7.x86_64                        93/114 
[openshift/origin-node]   Verifying  : libini_config-1.3.1-32.el7.x86_64                         94/114 
[openshift/origin-node]   Verifying  : 7:lvm2-libs-2.02.187-6.el7_9.5.x86_64                     95/114 
[openshift/origin-node]   Verifying  : 1:oci-register-machine-0-6.git2b44233.el7.x86_64          96/114 
[openshift/origin-node]   Verifying  : libverto-libevent-0.2.5-4.el7.x86_64                      97/114 
[openshift/origin-node]   Verifying  : libcollection-0.7.0-32.el7.x86_64                         98/114 
[openshift/origin-node]   Verifying  : checkpolicy-2.5-8.el7.x86_64                              99/114 
[openshift/origin-node]   Verifying  : cifs-utils-6.2-10.el7.x86_64                             100/114 
[openshift/origin-node]   Verifying  : 7:device-mapper-event-libs-1.02.170-6.el7_9.5.x86_64     101/114 
[openshift/origin-node]   Verifying  : libss-1.42.9-19.el7.x86_64                               102/114 
[openshift/origin-node]   Verifying  : 2:nmap-ncat-6.40-19.el7.x86_64                           103/114 
[openshift/origin-node]   Verifying  : origin-sdn-ovs-3.10.0-1.164.d4ca19f.x86_64               104/114 
[openshift/origin-node]   Verifying  : libevent-2.0.21-4.el7.x86_64                             105/114 
[openshift/origin-node]   Verifying  : python-syspurpose-1.24.48-1.el7.centos.x86_64            106/114 
[openshift/origin-node]   Verifying  : 1:quota-nls-4.01-19.el7.noarch                           107/114 
[openshift/origin-node]   Verifying  : libcgroup-0.41-21.el7.x86_64                             108/114 
[openshift/origin-node]   Verifying  : systemd-219-78.el7.x86_64                                109/114 
[openshift/origin-node]   Verifying  : 1:openssl-libs-1.0.2k-19.el7.x86_64                      110/114 
[openshift/origin-node]   Verifying  : systemd-libs-219-78.el7.x86_64                           111/114 
[openshift/origin-node]   Verifying  : binutils-2.27-44.base.el7.x86_64                         112/114 
[openshift/origin-node]   Verifying  : 7:device-mapper-libs-1.02.170-6.el7.x86_64               113/114 
[openshift/origin-node]   Verifying  : 7:device-mapper-1.02.170-6.el7.x86_64                    114/114 
[openshift/origin-node] Installed:
[openshift/origin-node]   bridge-utils.x86_64 0:1.5-9.el7                                               
[openshift/origin-node]   conntrack-tools.x86_64 0:1.4.4-7.el7                                          
[openshift/origin-node]   device-mapper-persistent-data.x86_64 0:0.8.5-3.el7_9.2                        
[openshift/origin-node]   e2fsprogs.x86_64 0:1.42.9-19.el7                                              
[openshift/origin-node]   ethtool.x86_64 2:4.8-10.el7                                                   
[openshift/origin-node]   iscsi-initiator-utils.x86_64 0:6.2.0.874-21.el7_9                             
[openshift/origin-node]   nmap-ncat.x86_64 2:6.40-19.el7                                                
[openshift/origin-node]   openssl.x86_64 1:1.0.2k-22.el7_9                                              
[openshift/origin-node]   origin-hyperkube.x86_64 0:3.10.0-1.164.d4ca19f                                
[openshift/origin-node]   origin-node.x86_64 0:3.10.0-1.164.d4ca19f                                     
[openshift/origin-node]   origin-sdn-ovs.x86_64 0:3.10.0-1.164.d4ca19f                                  
[openshift/origin-node]   xfsprogs.x86_64 0:4.5.0-22.el7                                                
[openshift/origin-node] Dependency Installed:
[openshift/origin-node]   PyYAML.x86_64 0:3.10-11.el7                                                   
[openshift/origin-node]   atomic-registries.x86_64 1:1.22.1-33.gitb507039.el7_8                         
[openshift/origin-node]   audit-libs-python.x86_64 0:2.8.5-4.el7                                        
[openshift/origin-node]   avahi-libs.x86_64 0:0.6.31-20.el7                                             
[openshift/origin-node]   checkpolicy.x86_64 0:2.5-8.el7                                                
[openshift/origin-node]   cifs-utils.x86_64 0:6.2-10.el7                                                
[openshift/origin-node]   container-selinux.noarch 2:2.119.2-1.911c772.el7_8                            
[openshift/origin-node]   container-storage-setup.noarch 0:0.11.0-2.git5eaf76c.el7                      
[openshift/origin-node]   containers-common.x86_64 1:0.1.40-11.el7_8                                    
[openshift/origin-node]   cups-libs.x86_64 1:1.6.3-51.el7                                               
[openshift/origin-node]   device-mapper-event.x86_64 7:1.02.170-6.el7_9.5                               
[openshift/origin-node]   device-mapper-event-libs.x86_64 7:1.02.170-6.el7_9.5                          
[openshift/origin-node]   dmidecode.x86_64 1:3.2-5.el7_9.1                                              
[openshift/origin-node]   docker.x86_64 2:1.13.1-208.git7d71120.el7_9                                   
[openshift/origin-node]   docker-client.x86_64 2:1.13.1-208.git7d71120.el7_9                            
[openshift/origin-node]   docker-common.x86_64 2:1.13.1-208.git7d71120.el7_9                            
[openshift/origin-node]   e2fsprogs-libs.x86_64 0:1.42.9-19.el7                                         
[openshift/origin-node]   fuse-overlayfs.x86_64 0:0.7.2-6.el7_8                                         
[openshift/origin-node]   fuse3-libs.x86_64 0:3.6.1-4.el7                                               
[openshift/origin-node]   gnutls.x86_64 0:3.3.29-9.el7_6                                                
[openshift/origin-node]   gssproxy.x86_64 0:0.7.0-30.el7_9                                              
[openshift/origin-node]   iscsi-initiator-utils-iscsiuio.x86_64 0:6.2.0.874-21.el7_9                    
[openshift/origin-node]   jansson.x86_64 0:2.10-1.el7                                                   
[openshift/origin-node]   keyutils.x86_64 0:1.5.8-3.el7                                                 
[openshift/origin-node]   libbasicobjects.x86_64 0:0.1.1-32.el7                                         
[openshift/origin-node]   libcgroup.x86_64 0:0.41-21.el7                                                
[openshift/origin-node]   libcollection.x86_64 0:0.7.0-32.el7                                           
[openshift/origin-node]   libevent.x86_64 0:2.0.21-4.el7                                                
[openshift/origin-node]   libini_config.x86_64 0:1.3.1-32.el7                                           
[openshift/origin-node]   libldb.x86_64 0:1.5.4-2.el7                                                   
[openshift/origin-node]   libnetfilter_cthelper.x86_64 0:1.0.0-11.el7                                   
[openshift/origin-node]   libnetfilter_cttimeout.x86_64 0:1.0.0-7.el7                                   
[openshift/origin-node]   libnetfilter_queue.x86_64 0:1.0.2-2.el7_2                                     
[openshift/origin-node]   libnfsidmap.x86_64 0:0.25-19.el7                                              
[openshift/origin-node]   libnl.x86_64 0:1.1.4-3.el7                                                    
[openshift/origin-node]   libpath_utils.x86_64 0:0.2.1-32.el7                                           
[openshift/origin-node]   libpcap.x86_64 14:1.5.3-12.el7                                                
[openshift/origin-node]   libref_array.x86_64 0:0.1.5-32.el7                                            
[openshift/origin-node]   libseccomp.x86_64 0:2.3.1-4.el7                                               
[openshift/origin-node]   libselinux-python.x86_64 0:2.5-15.el7                                         
[openshift/origin-node]   libselinux-utils.x86_64 0:2.5-15.el7                                          
[openshift/origin-node]   libsemanage-python.x86_64 0:2.5-14.el7                                        
[openshift/origin-node]   libss.x86_64 0:1.42.9-19.el7                                                  
[openshift/origin-node]   libtalloc.x86_64 0:2.1.16-1.el7                                               
[openshift/origin-node]   libtdb.x86_64 0:1.3.18-1.el7                                                  
[openshift/origin-node]   libtevent.x86_64 0:0.9.39-1.el7                                               
[openshift/origin-node]   libtirpc.x86_64 0:0.2.4-0.16.el7                                              
[openshift/origin-node]   libverto-libevent.x86_64 0:0.2.5-4.el7                                        
[openshift/origin-node]   libwbclient.x86_64 0:4.10.16-15.el7_9                                         
[openshift/origin-node]   libyaml.x86_64 0:0.1.4-11.el7_0                                               
[openshift/origin-node]   lvm2.x86_64 7:2.02.187-6.el7_9.5                                              
[openshift/origin-node]   lvm2-libs.x86_64 7:2.02.187-6.el7_9.5                                         
[openshift/origin-node]   make.x86_64 1:3.82-24.el7                                                     
[openshift/origin-node]   nettle.x86_64 0:2.7.1-9.el7_9                                                 
[openshift/origin-node]   nfs-utils.x86_64 1:1.3.0-0.68.el7.2                                           
[openshift/origin-node]   oci-register-machine.x86_64 1:0-6.git2b44233.el7                              
[openshift/origin-node]   oci-systemd-hook.x86_64 1:0.2.0-1.git05e6923.el7_6                            
[openshift/origin-node]   oci-umount.x86_64 2:2.5-3.el7                                                 
[openshift/origin-node]   openvswitch.x86_64 0:2.7.0-1.el7                                              
[openshift/origin-node]   parted.x86_64 0:3.1-32.el7                                                    
[openshift/origin-node]   policycoreutils.x86_64 0:2.5-34.el7                                           
[openshift/origin-node]   policycoreutils-python.x86_64 0:2.5-34.el7                                    
[openshift/origin-node]   python-IPy.noarch 0:0.75-6.el7                                                
[openshift/origin-node]   python-dateutil.noarch 0:1.5-7.el7                                            
[openshift/origin-node]   python-decorator.noarch 0:3.4.0-3.el7                                         
[openshift/origin-node]   python-dmidecode.x86_64 0:3.12.2-4.el7                                        
[openshift/origin-node]   python-ethtool.x86_64 0:0.8-8.el7                                             
[openshift/origin-node]   python-inotify.noarch 0:0.9.4-4.el7                                           
[openshift/origin-node]   python-pytoml.noarch 0:0.1.14-1.git7dea353.el7                                
[openshift/origin-node]   python-setuptools.noarch 0:0.9.8-7.el7                                        
[openshift/origin-node]   python-syspurpose.x86_64 0:1.24.48-1.el7.centos                               
[openshift/origin-node]   quota.x86_64 1:4.01-19.el7                                                    
[openshift/origin-node]   quota-nls.noarch 1:4.01-19.el7                                                
[openshift/origin-node]   rpcbind.x86_64 0:0.2.0-49.el7                                                 
[openshift/origin-node]   samba-client-libs.x86_64 0:4.10.16-15.el7_9                                   
[openshift/origin-node]   samba-common.noarch 0:4.10.16-15.el7_9                                        
[openshift/origin-node]   samba-common-libs.x86_64 0:4.10.16-15.el7_9                                   
[openshift/origin-node]   selinux-policy.noarch 0:3.13.1-268.el7_9.2                                    
[openshift/origin-node]   selinux-policy-targeted.noarch 0:3.13.1-268.el7_9.2                           
[openshift/origin-node]   setools-libs.x86_64 0:3.3.8-4.el7                                             
[openshift/origin-node]   slirp4netns.x86_64 0:0.4.3-4.el7_8                                            
[openshift/origin-node]   subscription-manager.x86_64 0:1.24.48-1.el7.centos                            
[openshift/origin-node]   subscription-manager-rhsm.x86_64 0:1.24.48-1.el7.centos                       
[openshift/origin-node]   subscription-manager-rhsm-certificates.x86_64 0:1.24.48-1.el7.centos          
[openshift/origin-node]   systemd-sysv.x86_64 0:219-78.el7_9.3                                          
[openshift/origin-node]   tcp_wrappers.x86_64 0:7.6-77.el7                                              
[openshift/origin-node]   trousers.x86_64 0:0.3.14-2.el7                                                
[openshift/origin-node]   usermode.x86_64 0:1.111-6.el7                                                 
[openshift/origin-node]   virt-what.x86_64 0:1.18-4.el7_9.1                                             
[openshift/origin-node]   yajl.x86_64 0:2.0.4-4.el7                                                     
[openshift/origin-node] Updated:
[openshift/origin-node]   binutils.x86_64 0:2.27-44.base.el7_9.1                                        
[openshift/origin-node]   device-mapper.x86_64 7:1.02.170-6.el7_9.5                                     
[openshift/origin-node]   device-mapper-libs.x86_64 7:1.02.170-6.el7_9.5                                
[openshift/origin-node] Dependency Updated:
[openshift/origin-node]   openssl-libs.x86_64 1:1.0.2k-22.el7_9     systemd.x86_64 0:219-78.el7_9.3    
[openshift/origin-node]   systemd-libs.x86_64 0:219-78.el7_9.3     
[openshift/origin-node] Complete!
[openshift/origin-node] Loaded plugins: fastestmirror, ovl, product-id, search-disabled-repos,
[openshift/origin-node]               : subscription-manager
[openshift/origin-node] This system is not registered with an entitlement server. You can use subscription-manager to register.
[openshift/origin-node] Cleaning repos: base cbs-paas7-openshift-multiarch-el7-build
[openshift/origin-node]               : centos-ceph-luminous extras updates
[openshift/origin-node] Cleaning up list of fastest mirrors
[openshift/origin-node] --> LABEL io.k8s.display-name="OpenShift Node"       io.k8s.description="This is a component of OpenShift and contains the software for individual nodes when using SDN."       io.openshift.tags="openshift,node"
[openshift/origin-node] --> ENV OPENSHIFT_CONTAINERIZED=true     KUBECONFIG=/etc/origin/node/node.kubeconfig
[openshift/origin-node] --> ENTRYPOINT [ "/usr/local/bin/origin-node-run.sh" ]
[openshift/origin-node] --> Committing changes to openshift/origin-node:d4ca19f ...
[openshift/origin-node] --> Tagged as openshift/origin-node:latest
[openshift/origin-node] --> Done
[INFO] [15:32:12+0000] hack/build-images.sh exited with code 0 after 00h 07m 54s
+ sed -i 's|go/src|data/src|' _output/local/releases/rpms/origin-local-release.repo
+ sudo cp _output/local/releases/rpms/origin-local-release.repo /etc/yum.repos.d/
+ sudo systemctl restart docker.service
+ set +o xtrace
########## FINISHED STAGE: SUCCESS: BUILD AN ORIGIN RELEASE [00h 21m 50s] ##########
[workspace] $ /bin/bash /tmp/jenkins8459994063741586240.sh
########## STARTING STAGE: DETERMINE THE RELEASE COMMIT FOR ORIGIN IMAGES AND VERSION FOR RPMS ##########
+ [[ -s /var/lib/jenkins/jobs/test_branch_origin_extended_conformance_k8s_310/workspace/activate ]]
+ source /var/lib/jenkins/jobs/test_branch_origin_extended_conformance_k8s_310/workspace/activate
++ export VIRTUAL_ENV=/var/lib/jenkins/origin-ci-tool/95a472392910104fc805c4ab8af39791105c956d
++ VIRTUAL_ENV=/var/lib/jenkins/origin-ci-tool/95a472392910104fc805c4ab8af39791105c956d
++ export PATH=/var/lib/jenkins/origin-ci-tool/95a472392910104fc805c4ab8af39791105c956d/bin:/sbin:/usr/sbin:/bin:/usr/bin
++ PATH=/var/lib/jenkins/origin-ci-tool/95a472392910104fc805c4ab8af39791105c956d/bin:/sbin:/usr/sbin:/bin:/usr/bin
++ unset PYTHON_HOME
++ export OCT_CONFIG_HOME=/var/lib/jenkins/jobs/test_branch_origin_extended_conformance_k8s_310/workspace/.config
++ OCT_CONFIG_HOME=/var/lib/jenkins/jobs/test_branch_origin_extended_conformance_k8s_310/workspace/.config
++ mktemp
+ script=/tmp/tmp.23QXSjJWFm
+ cat
+ chmod +x /tmp/tmp.23QXSjJWFm
+ scp -F /var/lib/jenkins/jobs/test_branch_origin_extended_conformance_k8s_310/workspace/.config/origin-ci-tool/inventory/.ssh_config /tmp/tmp.23QXSjJWFm openshiftdevel:/tmp/tmp.23QXSjJWFm
+ ssh -F /var/lib/jenkins/jobs/test_branch_origin_extended_conformance_k8s_310/workspace/.config/origin-ci-tool/inventory/.ssh_config -t openshiftdevel 'bash -l -c "timeout 600 /tmp/tmp.23QXSjJWFm"'
+ cd /data/src/github.com/openshift/origin
+ jobs_repo=/data/src/github.com/openshift/aos-cd-jobs/
+ git log -1 --pretty=%h
+ source hack/lib/init.sh
++ set -o errexit
++ set -o nounset
++ set -o pipefail
+++ date +%s
++ OS_SCRIPT_START_TIME=1638113582
++ export OS_SCRIPT_START_TIME
++ readonly -f os::util::absolute_path
+++ dirname hack/lib/init.sh
++ init_source=hack/lib/../..
+++ os::util::absolute_path hack/lib/../..
+++ local relative_path=hack/lib/../..
+++ local absolute_path
+++ pushd hack/lib/../..
++++ pwd
+++ relative_path=/data/src/github.com/openshift/origin
+++ [[ -h /data/src/github.com/openshift/origin ]]
+++ absolute_path=/data/src/github.com/openshift/origin
+++ popd
+++ echo /data/src/github.com/openshift/origin
++ OS_ROOT=/data/src/github.com/openshift/origin
++ export OS_ROOT
++ cd /data/src/github.com/openshift/origin
+++ find /data/src/github.com/openshift/origin/hack/lib -type f -name '*.sh' -not -path '*/hack/lib/init.sh'
++ for library_file in '$( find "${OS_ROOT}/hack/lib" -type f -name '\''*.sh'\'' -not -path '\''*/hack/lib/init.sh'\'' )'
++ source /data/src/github.com/openshift/origin/hack/lib/build/archive.sh
+++ readonly -f os::build::archive::name
+++ readonly -f os::build::archive::zip
+++ readonly -f os::build::archive::tar
+++ readonly -f os::build::archive::internal::is_hardlink_supported
+++ readonly -f os::build::archive::extract_tar
+++ readonly -f os::build::archive::detect_local_release_tars
++ for library_file in '$( find "${OS_ROOT}/hack/lib" -type f -name '\''*.sh'\'' -not -path '\''*/hack/lib/init.sh'\'' )'
++ source /data/src/github.com/openshift/origin/hack/lib/build/binaries.sh
+++ readonly -f os::build::binaries_from_targets
+++ readonly -f os::build::host_platform
+++ readonly -f os::build::host_platform_friendly
+++ readonly -f os::build::platform_arch
+++ readonly -f os::build::setup_env
+++ readonly -f os::build::build_static_binaries
+++ readonly -f os::build::build_binaries
+++ readonly -f os::build::export_targets
+++ readonly -f os::build::place_bins
+++ readonly -f os::build::release_sha
+++ readonly -f os::build::make_openshift_binary_symlinks
+++ readonly -f os::build::ldflag
+++ readonly -f os::build::require_clean_tree
+++ readonly -f os::build::commit_range
++ for library_file in '$( find "${OS_ROOT}/hack/lib" -type f -name '\''*.sh'\'' -not -path '\''*/hack/lib/init.sh'\'' )'
++ source /data/src/github.com/openshift/origin/hack/lib/build/environment.sh
+++ readonly -f os::build::environment::create
+++ readonly -f os::build::environment::release::workingdir
+++ readonly -f os::build::environment::cleanup
+++ readonly -f os::build::environment::start
+++ readonly -f os::build::environment::withsource
+++ readonly -f os::build::environment::volume_name
+++ readonly -f os::build::environment::remove_volume
+++ readonly -f os::build::environment::run
++ for library_file in '$( find "${OS_ROOT}/hack/lib" -type f -name '\''*.sh'\'' -not -path '\''*/hack/lib/init.sh'\'' )'
++ source /data/src/github.com/openshift/origin/hack/lib/build/images.sh
+++ readonly -f os::build::image
+++ readonly -f os::build::image::internal::generic
+++ readonly -f os::build::image::internal::imagebuilder
+++ readonly -f os::build::image::internal::docker
++ for library_file in '$( find "${OS_ROOT}/hack/lib" -type f -name '\''*.sh'\'' -not -path '\''*/hack/lib/init.sh'\'' )'
++ source /data/src/github.com/openshift/origin/hack/lib/build/release.sh
++ for library_file in '$( find "${OS_ROOT}/hack/lib" -type f -name '\''*.sh'\'' -not -path '\''*/hack/lib/init.sh'\'' )'
++ source /data/src/github.com/openshift/origin/hack/lib/build/rpm.sh
++ for library_file in '$( find "${OS_ROOT}/hack/lib" -type f -name '\''*.sh'\'' -not -path '\''*/hack/lib/init.sh'\'' )'
++ source /data/src/github.com/openshift/origin/hack/lib/build/version.sh
+++ readonly -f os::build::version::get_vars
+++ readonly -f os::build::version::git_vars
+++ readonly -f os::build::version::etcd_vars
+++ readonly -f os::build::version::kubernetes_vars
+++ readonly -f os::build::version::save_vars
++ for library_file in '$( find "${OS_ROOT}/hack/lib" -type f -name '\''*.sh'\'' -not -path '\''*/hack/lib/init.sh'\'' )'
++ source /data/src/github.com/openshift/origin/hack/lib/log/output.sh
+++ readonly -f os::log::info
+++ readonly -f os::log::warning
+++ readonly -f os::log::error
+++ readonly -f os::log::fatal
+++ readonly -f os::log::debug
++ for library_file in '$( find "${OS_ROOT}/hack/lib" -type f -name '\''*.sh'\'' -not -path '\''*/hack/lib/init.sh'\'' )'
++ source /data/src/github.com/openshift/origin/hack/lib/log/stacktrace.sh
+++ readonly -f os::log::stacktrace::install
+++ readonly -f os::log::stacktrace::print
++ for library_file in '$( find "${OS_ROOT}/hack/lib" -type f -name '\''*.sh'\'' -not -path '\''*/hack/lib/init.sh'\'' )'
++ source /data/src/github.com/openshift/origin/hack/lib/log/system.sh
+++ readonly -f os::log::system::install_cleanup
+++ readonly -f os::log::system::clean_up
+++ readonly -f os::log::system::internal::prune_datafile
+++ readonly -f os::log::system::internal::plot
+++ readonly -f os::log::system::start
+++ readonly -f os::log::system::internal::run
++ for library_file in '$( find "${OS_ROOT}/hack/lib" -type f -name '\''*.sh'\'' -not -path '\''*/hack/lib/init.sh'\'' )'
++ source /data/src/github.com/openshift/origin/hack/lib/test/junit.sh
+++ readonly -f os::test::junit::declare_suite_start
+++ readonly -f os::test::junit::declare_suite_end
+++ readonly -f os::test::junit::declare_test_start
+++ readonly -f os::test::junit::declare_test_end
+++ readonly -f os::test::junit::check_test_counters
+++ readonly -f os::test::junit::reconcile_output
++ for library_file in '$( find "${OS_ROOT}/hack/lib" -type f -name '\''*.sh'\'' -not -path '\''*/hack/lib/init.sh'\'' )'
++ source /data/src/github.com/openshift/origin/hack/lib/util/docs.sh
+++ readonly -f generate_manual_pages
+++ readonly -f generate_documentation
+++ readonly -f os::util::gen-docs
+++ readonly -f os::util::set-man-placeholder
+++ readonly -f os::util::set-docs-placeholder
++ for library_file in '$( find "${OS_ROOT}/hack/lib" -type f -name '\''*.sh'\'' -not -path '\''*/hack/lib/init.sh'\'' )'
++ source /data/src/github.com/openshift/origin/hack/lib/util/ensure.sh
+++ readonly -f os::util::ensure::system_binary_exists
+++ readonly -f os::util::ensure::built_binary_exists
+++ readonly -f os::util::ensure::gopath_binary_exists
+++ readonly -f os::util::ensure::iptables_privileges_exist
++ for library_file in '$( find "${OS_ROOT}/hack/lib" -type f -name '\''*.sh'\'' -not -path '\''*/hack/lib/init.sh'\'' )'
++ source /data/src/github.com/openshift/origin/hack/lib/util/environment.sh
+++ readonly -f os::util::environment::use_sudo
+++ readonly -f os::util::environment::setup_time_vars
+++ readonly -f os::util::environment::setup_all_server_vars
+++ readonly -f os::util::environment::update_path_var
+++ readonly -f os::util::environment::setup_tmpdir_vars
+++ readonly -f os::util::environment::setup_kubelet_vars
+++ readonly -f os::util::environment::setup_etcd_vars
+++ readonly -f os::util::environment::setup_server_vars
+++ readonly -f os::util::environment::setup_images_vars
++ for library_file in '$( find "${OS_ROOT}/hack/lib" -type f -name '\''*.sh'\'' -not -path '\''*/hack/lib/init.sh'\'' )'
++ source /data/src/github.com/openshift/origin/hack/lib/util/find.sh
+++ readonly -f os::util::find::system_binary
+++ readonly -f os::util::find::built_binary
+++ readonly -f os::util::find::gopath_binary
++ for library_file in '$( find "${OS_ROOT}/hack/lib" -type f -name '\''*.sh'\'' -not -path '\''*/hack/lib/init.sh'\'' )'
++ source /data/src/github.com/openshift/origin/hack/lib/util/golang.sh
+++ readonly -f os::golang::verify_go_version
+++ readonly -f os::golang::verify_glide_version
++ for library_file in '$( find "${OS_ROOT}/hack/lib" -type f -name '\''*.sh'\'' -not -path '\''*/hack/lib/init.sh'\'' )'
++ source /data/src/github.com/openshift/origin/hack/lib/util/misc.sh
+++ readonly -f os::util::describe_return_code
+++ readonly -f os::util::install_describe_return_code
+++ [[ -z '' ]]
++++ pwd
+++ OS_ORIGINAL_WD=/data/src/github.com/openshift/origin
+++ readonly OS_ORIGINAL_WD
+++ export OS_ORIGINAL_WD
+++ readonly -f os::util::repository_relative_path
+++ readonly -f os::util::format_seconds
+++ readonly -f os::util::sed
+++ readonly -f os::util::base64decode
++ for library_file in '$( find "${OS_ROOT}/hack/lib" -type f -name '\''*.sh'\'' -not -path '\''*/hack/lib/init.sh'\'' )'
++ source /data/src/github.com/openshift/origin/hack/lib/util/text.sh
+++ readonly -f os::text::reset
+++ readonly -f os::text::bold
+++ readonly -f os::text::red
+++ readonly -f os::text::green
+++ readonly -f os::text::blue
+++ readonly -f os::text::yellow
+++ readonly -f os::text::clear_last_line
+++ readonly -f os::text::internal::is_tty
+++ readonly -f os::text::print_bold
+++ readonly -f os::text::print_red
+++ readonly -f os::text::print_red_bold
+++ readonly -f os::text::print_green
+++ readonly -f os::text::print_green_bold
+++ readonly -f os::text::print_blue
+++ readonly -f os::text::print_blue_bold
+++ readonly -f os::text::print_yellow
+++ readonly -f os::text::print_yellow_bold
++ for library_file in '$( find "${OS_ROOT}/hack/lib" -type f -name '\''*.sh'\'' -not -path '\''*/hack/lib/init.sh'\'' )'
++ source /data/src/github.com/openshift/origin/hack/lib/util/trap.sh
+++ readonly -f os::util::trap::init_err
+++ readonly -f os::util::trap::init_exit
+++ readonly -f os::util::trap::err_handler
+++ readonly -f os::util::trap::exit_handler
++ for library_file in '$( find "${OS_ROOT}/hack/lib" -type f -name '\''*.sh'\'' -not -path '\''*/hack/lib/init.sh'\'' )'
++ source /data/src/github.com/openshift/origin/hack/lib/cleanup.sh
+++ readonly -f os::cleanup::all
+++ readonly -f os::cleanup::dump_etcd
+++ readonly -f os::cleanup::internal::dump_etcd_v3
+++ readonly -f os::cleanup::prune_etcd
+++ readonly -f os::cleanup::containers
+++ readonly -f os::cleanup::dump_container_logs
+++ readonly -f os::cleanup::internal::list_our_containers
+++ readonly -f os::cleanup::internal::list_k8s_containers
+++ readonly -f os::cleanup::internal::list_containers
+++ readonly -f os::cleanup::tmpdir
+++ readonly -f os::cleanup::dump_events
+++ readonly -f os::cleanup::find_cache_alterations
+++ readonly -f os::cleanup::dump_pprof_output
+++ readonly -f os::cleanup::truncate_large_logs
+++ readonly -f os::cleanup::processes
++ for library_file in '$( find "${OS_ROOT}/hack/lib" -type f -name '\''*.sh'\'' -not -path '\''*/hack/lib/init.sh'\'' )'
++ source /data/src/github.com/openshift/origin/hack/lib/cmd.sh
+++ readonly -f os::cmd::expect_success
+++ readonly -f os::cmd::expect_failure
+++ readonly -f os::cmd::expect_success_and_text
+++ readonly -f os::cmd::expect_failure_and_text
+++ readonly -f os::cmd::expect_success_and_not_text
+++ readonly -f os::cmd::expect_failure_and_not_text
+++ readonly -f os::cmd::expect_code
+++ readonly -f os::cmd::expect_code_and_text
+++ readonly -f os::cmd::expect_code_and_not_text
+++ millisecond=1
+++ second=1000
+++ minute=60000
+++ readonly -f os::cmd::try_until_success
+++ readonly -f os::cmd::try_until_failure
+++ readonly -f os::cmd::try_until_text
+++ readonly -f os::cmd::try_until_text
+++ os_cmd_internal_tmpdir=/tmp/openshift
+++ os_cmd_internal_tmpout=/tmp/openshift/tmp_stdout.log
+++ os_cmd_internal_tmperr=/tmp/openshift/tmp_stderr.log
+++ readonly -f os::cmd::internal::expect_exit_code_run_grep
+++ readonly -f os::cmd::internal::init_tempdir
+++ readonly -f os::cmd::internal::describe_call
+++ readonly -f os::cmd::internal::determine_caller
+++ readonly -f os::cmd::internal::describe_expectation
+++ readonly -f os::cmd::internal::seconds_since_epoch
+++ readonly -f os::cmd::internal::run_collecting_output
+++ readonly -f os::cmd::internal::success_func
+++ readonly -f os::cmd::internal::failure_func
+++ readonly -f os::cmd::internal::specific_code_func
+++ readonly -f os::cmd::internal::get_results
+++ readonly -f os::cmd::internal::get_last_results
+++ readonly -f os::cmd::internal::mark_attempt
+++ readonly -f os::cmd::internal::compress_output
+++ readonly -f os::cmd::internal::print_results
+++ readonly -f os::cmd::internal::assemble_causes
+++ readonly -f os::cmd::internal::run_until_exit_code
+++ readonly -f os::cmd::internal::run_until_text
++ for library_file in '$( find "${OS_ROOT}/hack/lib" -type f -name '\''*.sh'\'' -not -path '\''*/hack/lib/init.sh'\'' )'
++ source /data/src/github.com/openshift/origin/hack/lib/constants.sh
+++ readonly OS_GO_PACKAGE=github.com/openshift/origin
+++ OS_GO_PACKAGE=github.com/openshift/origin
+++ readonly OS_BUILD_ENV_GOLANG=1.9
+++ OS_BUILD_ENV_GOLANG=1.9
+++ readonly OS_BUILD_ENV_IMAGE=openshift/origin-release:golang-1.9
+++ OS_BUILD_ENV_IMAGE=openshift/origin-release:golang-1.9
+++ readonly OS_REQUIRED_GO_VERSION=go1.9
+++ OS_REQUIRED_GO_VERSION=go1.9
+++ readonly OS_GLIDE_MINOR_VERSION=13
+++ OS_GLIDE_MINOR_VERSION=13
+++ readonly OS_REQUIRED_GLIDE_VERSION=0.13
+++ OS_REQUIRED_GLIDE_VERSION=0.13
+++ readonly 'OS_GOFLAGS_TAGS=include_gcs include_oss containers_image_openpgp'
+++ OS_GOFLAGS_TAGS='include_gcs include_oss containers_image_openpgp'
+++ readonly OS_GOFLAGS_TAGS_LINUX_AMD64=gssapi
+++ OS_GOFLAGS_TAGS_LINUX_AMD64=gssapi
+++ readonly OS_GOFLAGS_TAGS_LINUX_S390X=gssapi
+++ OS_GOFLAGS_TAGS_LINUX_S390X=gssapi
+++ readonly OS_GOFLAGS_TAGS_LINUX_ARM64=gssapi
+++ OS_GOFLAGS_TAGS_LINUX_ARM64=gssapi
+++ readonly OS_GOFLAGS_TAGS_LINUX_PPC64LE=gssapi
+++ OS_GOFLAGS_TAGS_LINUX_PPC64LE=gssapi
+++ readonly OS_OUTPUT_BASEPATH=_output
+++ OS_OUTPUT_BASEPATH=_output
+++ readonly OS_BASE_OUTPUT=/data/src/github.com/openshift/origin/_output
+++ OS_BASE_OUTPUT=/data/src/github.com/openshift/origin/_output
+++ readonly OS_OUTPUT_SCRIPTPATH=/data/src/github.com/openshift/origin/_output/scripts
+++ OS_OUTPUT_SCRIPTPATH=/data/src/github.com/openshift/origin/_output/scripts
+++ readonly OS_OUTPUT_SUBPATH=_output/local
+++ OS_OUTPUT_SUBPATH=_output/local
+++ readonly OS_OUTPUT=/data/src/github.com/openshift/origin/_output/local
+++ OS_OUTPUT=/data/src/github.com/openshift/origin/_output/local
+++ readonly OS_OUTPUT_RELEASEPATH=/data/src/github.com/openshift/origin/_output/local/releases
+++ OS_OUTPUT_RELEASEPATH=/data/src/github.com/openshift/origin/_output/local/releases
+++ readonly OS_OUTPUT_RPMPATH=/data/src/github.com/openshift/origin/_output/local/releases/rpms
+++ OS_OUTPUT_RPMPATH=/data/src/github.com/openshift/origin/_output/local/releases/rpms
+++ readonly OS_OUTPUT_BINPATH=/data/src/github.com/openshift/origin/_output/local/bin
+++ OS_OUTPUT_BINPATH=/data/src/github.com/openshift/origin/_output/local/bin
+++ readonly OS_OUTPUT_PKGDIR=/data/src/github.com/openshift/origin/_output/local/pkgdir
+++ OS_OUTPUT_PKGDIR=/data/src/github.com/openshift/origin/_output/local/pkgdir
+++ OS_SDN_COMPILE_TARGETS_LINUX=(pkg/network/sdn-cni-plugin vendor/github.com/containernetworking/plugins/plugins/ipam/host-local vendor/github.com/containernetworking/plugins/plugins/main/loopback)
+++ readonly OS_SDN_COMPILE_TARGETS_LINUX
+++ OS_IMAGE_COMPILE_TARGETS_LINUX=("${OS_SDN_COMPILE_TARGETS_LINUX[@]}")
+++ readonly OS_IMAGE_COMPILE_TARGETS_LINUX
+++ OS_SCRATCH_IMAGE_COMPILE_TARGETS_LINUX=(images/pod)
+++ readonly OS_SCRATCH_IMAGE_COMPILE_TARGETS_LINUX
+++ OS_IMAGE_COMPILE_BINARIES=("${OS_SCRATCH_IMAGE_COMPILE_TARGETS_LINUX[@]##*/}" "${OS_IMAGE_COMPILE_TARGETS_LINUX[@]##*/}")
+++ readonly OS_IMAGE_COMPILE_BINARIES
+++ OS_CROSS_COMPILE_TARGETS=(cmd/hypershift cmd/openshift cmd/oc cmd/oadm cmd/template-service-broker cmd/openshift-node-config vendor/k8s.io/kubernetes/cmd/hyperkube)
+++ readonly OS_CROSS_COMPILE_TARGETS
+++ OS_CROSS_COMPILE_BINARIES=("${OS_CROSS_COMPILE_TARGETS[@]##*/}")
+++ readonly OS_CROSS_COMPILE_BINARIES
+++ OS_TEST_TARGETS=(test/extended/extended.test)
+++ readonly OS_TEST_TARGETS
+++ OS_GOVET_BLACKLIST=("pkg/.*/generated/internalclientset/fake/clientset_generated.go:[0-9]+: literal copies lock value from fakePtr: github.com/openshift/origin/vendor/k8s.io/client-go/testing.Fake" "pkg/.*/generated/clientset/fake/clientset_generated.go:[0-9]+: literal copies lock value from fakePtr: github.com/openshift/origin/vendor/k8s.io/client-go/testing.Fake" "pkg/build/vendor/github.com/docker/docker/client/hijack.go:[0-9]+: assignment copies lock value to c: crypto/tls.Config contains sync.Once contains sync.Mutex" "pkg/build/builder/vendor/.*" "pkg/cmd/server/start/.*")
+++ readonly OS_GOVET_BLACKLIST
+++ OPENSHIFT_BINARY_SYMLINKS=(openshift-router openshift-deploy openshift-recycle openshift-sti-build openshift-docker-build openshift-git-clone openshift-manage-dockerfile openshift-extract-image-content origin)
+++ readonly OPENSHIFT_BINARY_SYMLINKS
+++ OC_BINARY_COPY=(kubectl)
+++ readonly OC_BINARY_COPY
+++ OS_BINARY_RELEASE_CLIENT_WINDOWS=(oc.exe README.md ./LICENSE)
+++ readonly OS_BINARY_RELEASE_CLIENT_WINDOWS
+++ OS_BINARY_RELEASE_CLIENT_MAC=(oc README.md ./LICENSE)
+++ readonly OS_BINARY_RELEASE_CLIENT_MAC
+++ OS_BINARY_RELEASE_CLIENT_LINUX=(./oc ./README.md ./LICENSE)
+++ readonly OS_BINARY_RELEASE_CLIENT_LINUX
+++ OS_BINARY_RELEASE_SERVER_LINUX=('./*')
+++ readonly OS_BINARY_RELEASE_SERVER_LINUX
+++ OS_BINARY_RELEASE_CLIENT_EXTRA=(${OS_ROOT}/README.md ${OS_ROOT}/LICENSE)
+++ readonly OS_BINARY_RELEASE_CLIENT_EXTRA
+++ readonly -f os::build::ldflags
+++ readonly -f os::util::list_go_src_files
+++ readonly -f os::util::list_go_src_dirs
+++ readonly -f os::util::list_test_packages_under
+++ readonly -f os::build::generate_windows_versioninfo
+++ readonly -f os::build::clean_windows_versioninfo
+++ OS_ALL_IMAGES=(origin-pod origin-base origin-cli origin-hypershift origin-hyperkube origin-control-plane origin-node origin-deployer origin-docker-builder origin-keepalived-ipfailover origin-haproxy-router origin-f5-router origin-egress-router origin-egress-http-proxy origin-egress-dns-proxy origin-recycler origin-template-service-broker origin-tests)
+++ readonly OS_ALL_IMAGES
+++ readonly -f os::build::images
++ for library_file in '$( find "${OS_ROOT}/hack/lib" -type f -name '\''*.sh'\'' -not -path '\''*/hack/lib/init.sh'\'' )'
++ source /data/src/github.com/openshift/origin/hack/lib/start.sh
+++ readonly -f os::start::configure_server
+++ readonly -f os::start::internal::create_master_certs
+++ readonly -f os::start::internal::configure_node
+++ readonly -f os::start::internal::configure_master
+++ readonly -f os::start::internal::patch_master_config
+++ readonly -f os::start::server
+++ readonly -f os::start::master
+++ readonly -f os::start::all_in_one
+++ readonly -f os::start::etcd
+++ readonly -f os::start::api_server
+++ readonly -f os::start::controllers
+++ readonly -f os::start::internal::start_node
+++ readonly -f os::start::internal::openshift_executable
+++ readonly -f os::start::internal::determine_hostnames
+++ readonly -f os::start::router
+++ readonly -f os::start::registry
++ unset library_files library_file init_source
++ os::log::stacktrace::install
++ set -o errtrace
++ export OS_USE_STACKTRACE=true
++ OS_USE_STACKTRACE=true
++ os::util::trap::init_err
++ trap -p ERR
++ grep -q os::util::trap::err_handler
++ trap 'os::util::trap::err_handler;' ERR
++ os::util::environment::update_path_var
++ local prefix
++ os::util::find::system_binary go
+++ os::build::host_platform
++++ go env GOHOSTOS
++++ go env GOHOSTARCH
+++ echo linux/amd64
++ prefix+=/data/src/github.com/openshift/origin/_output/local/bin/linux/amd64:
++ [[ -n /data ]]
++ prefix+=/data/bin:
++ PATH=/data/src/github.com/openshift/origin/_output/local/bin/linux/amd64:/data/bin:/usr/local/bin:/usr/bin:/usr/local/sbin:/usr/sbin:/home/origin/.local/bin:/home/origin/bin
++ export PATH
++ [[ -z '' ]]
++ [[ /tmp/tmp.23QXSjJWFm =~ .*\.sh ]]
++ os::util::environment::setup_tmpdir_vars shell
++ local sub_dir=shell
++ BASETMPDIR=/tmp/openshift/shell
++ export BASETMPDIR
++ VOLUME_DIR=/tmp/openshift/shell/volumes
++ export VOLUME_DIR
++ BASEOUTDIR=/data/src/github.com/openshift/origin/_output/scripts/shell
++ export BASEOUTDIR
++ LOG_DIR=/data/src/github.com/openshift/origin/_output/scripts/shell/logs
++ export LOG_DIR
++ ARTIFACT_DIR=/data/src/github.com/openshift/origin/_output/scripts/shell/artifacts
++ export ARTIFACT_DIR
++ FAKE_HOME_DIR=/data/src/github.com/openshift/origin/_output/scripts/shell/openshift.local.home
++ export FAKE_HOME_DIR
++ mkdir -p /data/src/github.com/openshift/origin/_output/scripts/shell/logs /tmp/openshift/shell/volumes /data/src/github.com/openshift/origin/_output/scripts/shell/artifacts /data/src/github.com/openshift/origin/_output/scripts/shell/openshift.local.home
++ export OS_TMP_ENV_SET=shell
++ OS_TMP_ENV_SET=shell
++ [[ -n '' ]]
+ os::build::rpm::get_nvra_vars
++ uname -i
+ OS_RPM_ARCHITECTURE=x86_64
+ os::build::version::get_vars
+ [[ -n '' ]]
+ os::build::version::git_vars
+ [[ -n '' ]]
+ os::build::version::kubernetes_vars
++ go run /data/src/github.com/openshift/origin/tools/godepversion/godepversion.go /data/src/github.com/openshift/origin/Godeps/Godeps.json k8s.io/kubernetes/pkg/api comment
+ KUBE_GIT_VERSION=v1.10.0-47-gb81c8f8
++ go run /data/src/github.com/openshift/origin/tools/godepversion/godepversion.go /data/src/github.com/openshift/origin/Godeps/Godeps.json k8s.io/kubernetes/pkg/api
+ KUBE_GIT_COMMIT=b81c8f8
++ echo v1.10.0-47-gb81c8f8
++ sed 's/-\([0-9]\{1,\}\)-g\([0-9a-f]\{7,40\}\)$/\+\2/'
+ KUBE_GIT_VERSION=v1.10.0+b81c8f8
+ [[ v1.10.0+b81c8f8 =~ ^v([0-9]+)\.([0-9]+)\. ]]
+ KUBE_GIT_MAJOR=1
+ KUBE_GIT_MINOR=10+
+ os::build::version::etcd_vars
++ go run /data/src/github.com/openshift/origin/tools/godepversion/godepversion.go /data/src/github.com/openshift/origin/Godeps/Godeps.json github.com/coreos/etcd/etcdserver comment
+ ETCD_GIT_VERSION=v3.2.16-0-g121edf0
++ go run /data/src/github.com/openshift/origin/tools/godepversion/godepversion.go /data/src/github.com/openshift/origin/Godeps/Godeps.json github.com/coreos/etcd/etcdserver
+ ETCD_GIT_COMMIT=121edf0
+ git=(git --work-tree "${OS_ROOT}")
+ local git
+ [[ -n '' ]]
++ git --work-tree /data/src/github.com/openshift/origin rev-parse --short 'HEAD^{commit}'
+ OS_GIT_COMMIT=d4ca19f
+ [[ -z '' ]]
++ git --work-tree /data/src/github.com/openshift/origin status --porcelain
+ git_status=
+ [[ -z '' ]]
+ OS_GIT_TREE_STATE=clean
+ [[ -n '' ]]
++ git --work-tree /data/src/github.com/openshift/origin describe --long --tags --abbrev=7 --match 'v[0-9]*' 'd4ca19f^{commit}'
+ OS_GIT_VERSION=v3.10.0-164-gd4ca19f
+ [[ v3.10.0-164-gd4ca19f =~ ^v([0-9]+)\.([0-9]+)\.([0-9]+)(\.[0-9]+)*([-].*)?$ ]]
+ OS_GIT_MAJOR=3
+ OS_GIT_MINOR=10
+ OS_GIT_PATCH=0
+ [[ -n -164-gd4ca19f ]]
+ OS_GIT_MINOR+=+
++ echo v3.10.0-164-gd4ca19f
++ sed 's/-\([0-9]\{1,\}\)-g\([0-9a-f]\{7,40\}\)$/\+\2-\1/'
+ OS_GIT_VERSION=v3.10.0+d4ca19f-164
++ echo v3.10.0+d4ca19f-164
++ sed 's/-0$//'
+ OS_GIT_VERSION=v3.10.0+d4ca19f-164
+ [[ clean == \d\i\r\t\y ]]
+ [[ v3.10.0+d4ca19f-164 =~ ^v([0-9](\.[0-9]+)*)(.*) ]]
+ OS_RPM_VERSION=3.10.0
+ metadata=+d4ca19f-164
+ [[ + == \+ ]]
+ [[ +d4ca19f-164 =~ ^\+([a-z0-9]{7,40})(-([0-9]+))?(-dirty)?$ ]]
+ build_sha=d4ca19f
+ build_num=164
+ OS_RPM_RELEASE=1.164.d4ca19f
++ os::build::version::save_vars
++ cat
++ tr '\n' ' '
+ OS_RPM_GIT_VARS='OS_GIT_COMMIT='\''d4ca19f'\'' OS_GIT_TREE_STATE='\''clean'\'' OS_GIT_VERSION='\''v3.10.0+d4ca19f-164'\'' OS_GIT_MAJOR='\''3'\'' OS_GIT_MINOR='\''10+'\'' OS_GIT_PATCH='\''0'\'' KUBE_GIT_MAJOR='\''1'\'' KUBE_GIT_MINOR='\''10+'\'' KUBE_GIT_COMMIT='\''b81c8f8'\'' KUBE_GIT_VERSION='\''v1.10.0+b81c8f8'\'' ETCD_GIT_VERSION='\''v3.2.16-0-g121edf0'\'' ETCD_GIT_COMMIT='\''121edf0'\'' '
+ export OS_RPM_VERSION OS_RPM_RELEASE OS_RPM_ARCHITECTURE OS_RPM_GIT_VARS
+ echo -3.10.0-1.164.d4ca19f
+ echo 3.10+
+ sed s/+//
+ echo 3.10.0
+ cut -d. -f2
++ echo v3.10+
++ sed s/+//
+ tag=v3.10
+ echo v3.10
+ [[ v3.10 == \v\3\.\1\1 ]]
+ [[ v3.10 == \v\4\.\0 ]]
+ set +o xtrace
########## FINISHED STAGE: SUCCESS: DETERMINE THE RELEASE COMMIT FOR ORIGIN IMAGES AND VERSION FOR RPMS [00h 00m 12s] ##########
[workspace] $ /bin/bash /tmp/jenkins2753333956243817939.sh
########## STARTING STAGE: BUILD AN OPENSHIFT-ANSIBLE RELEASE ##########
+ [[ -s /var/lib/jenkins/jobs/test_branch_origin_extended_conformance_k8s_310/workspace/activate ]]
+ source /var/lib/jenkins/jobs/test_branch_origin_extended_conformance_k8s_310/workspace/activate
++ export VIRTUAL_ENV=/var/lib/jenkins/origin-ci-tool/95a472392910104fc805c4ab8af39791105c956d
++ VIRTUAL_ENV=/var/lib/jenkins/origin-ci-tool/95a472392910104fc805c4ab8af39791105c956d
++ export PATH=/var/lib/jenkins/origin-ci-tool/95a472392910104fc805c4ab8af39791105c956d/bin:/sbin:/usr/sbin:/bin:/usr/bin
++ PATH=/var/lib/jenkins/origin-ci-tool/95a472392910104fc805c4ab8af39791105c956d/bin:/sbin:/usr/sbin:/bin:/usr/bin
++ unset PYTHON_HOME
++ export OCT_CONFIG_HOME=/var/lib/jenkins/jobs/test_branch_origin_extended_conformance_k8s_310/workspace/.config
++ OCT_CONFIG_HOME=/var/lib/jenkins/jobs/test_branch_origin_extended_conformance_k8s_310/workspace/.config
++ mktemp
+ script=/tmp/tmp.dYRgmKL31a
+ cat
+ chmod +x /tmp/tmp.dYRgmKL31a
+ scp -F /var/lib/jenkins/jobs/test_branch_origin_extended_conformance_k8s_310/workspace/.config/origin-ci-tool/inventory/.ssh_config /tmp/tmp.dYRgmKL31a openshiftdevel:/tmp/tmp.dYRgmKL31a
+ ssh -F /var/lib/jenkins/jobs/test_branch_origin_extended_conformance_k8s_310/workspace/.config/origin-ci-tool/inventory/.ssh_config -t openshiftdevel 'bash -l -c "timeout 14400 /tmp/tmp.dYRgmKL31a"'
+ cd /data/src/github.com/openshift/openshift-ansible
+ tito_tmp_dir=tito
+ mkdir -p tito
+ tito tag --offline --accept-auto-changelog --use-release '9999%{?dist}'
Creating output directory: /tmp/tito
Tagging new version of openshift-ansible: 3.10.183-1 -> 3.10.184-9999

Created tag: openshift-ansible-3.10.184-9999
   View: git show HEAD
   Undo: tito tag -u
   Push: git push --follow-tags origin
+ tito build --output=tito --rpm --test --offline --quiet
Creating output directory: /data/src/github.com/openshift/openshift-ansible/tito
Building package [openshift-ansible-3.10.184-9999]
Wrote: /data/src/github.com/openshift/openshift-ansible/tito/openshift-ansible-git-0.8f197a4.tar.gz

Successfully built: /data/src/github.com/openshift/openshift-ansible/tito/openshift-ansible-3.10.184-9999.git.0.8f197a4.el7_9.src.rpm
	- /data/src/github.com/openshift/openshift-ansible/tito/noarch/openshift-ansible-3.10.184-9999.git.0.8f197a4.el7_9.noarch.rpm
	- /data/src/github.com/openshift/openshift-ansible/tito/noarch/openshift-ansible-docs-3.10.184-9999.git.0.8f197a4.el7_9.noarch.rpm
	- /data/src/github.com/openshift/openshift-ansible/tito/noarch/openshift-ansible-playbooks-3.10.184-9999.git.0.8f197a4.el7_9.noarch.rpm
	- /data/src/github.com/openshift/openshift-ansible/tito/noarch/openshift-ansible-roles-3.10.184-9999.git.0.8f197a4.el7_9.noarch.rpm
	- /data/src/github.com/openshift/openshift-ansible/tito/noarch/openshift-ansible-test-3.10.184-9999.git.0.8f197a4.el7_9.noarch.rpm
+ createrepo tito/noarch
Spawning worker 0 with 2 pkgs
Spawning worker 1 with 1 pkgs
Spawning worker 2 with 1 pkgs
Spawning worker 3 with 1 pkgs
Workers Finished
Saving Primary metadata
Saving file lists metadata
Saving other metadata
Generating sqlite DBs
Sqlite DBs complete
+ cat
++ pwd
+ sudo cp ./openshift-ansible-local-release.repo /etc/yum.repos.d
+ set +o xtrace
########## FINISHED STAGE: SUCCESS: BUILD AN OPENSHIFT-ANSIBLE RELEASE [00h 00m 36s] ##########
[workspace] $ /bin/bash /tmp/jenkins4159832520657646056.sh
########## STARTING STAGE: PULL AND TAG OTHER IMAGES ##########
+ [[ -s /var/lib/jenkins/jobs/test_branch_origin_extended_conformance_k8s_310/workspace/activate ]]
+ source /var/lib/jenkins/jobs/test_branch_origin_extended_conformance_k8s_310/workspace/activate
++ export VIRTUAL_ENV=/var/lib/jenkins/origin-ci-tool/95a472392910104fc805c4ab8af39791105c956d
++ VIRTUAL_ENV=/var/lib/jenkins/origin-ci-tool/95a472392910104fc805c4ab8af39791105c956d
++ export PATH=/var/lib/jenkins/origin-ci-tool/95a472392910104fc805c4ab8af39791105c956d/bin:/sbin:/usr/sbin:/bin:/usr/bin
++ PATH=/var/lib/jenkins/origin-ci-tool/95a472392910104fc805c4ab8af39791105c956d/bin:/sbin:/usr/sbin:/bin:/usr/bin
++ unset PYTHON_HOME
++ export OCT_CONFIG_HOME=/var/lib/jenkins/jobs/test_branch_origin_extended_conformance_k8s_310/workspace/.config
++ OCT_CONFIG_HOME=/var/lib/jenkins/jobs/test_branch_origin_extended_conformance_k8s_310/workspace/.config
++ mktemp
+ script=/tmp/tmp.tEGsZm9yMG
+ cat
+ chmod +x /tmp/tmp.tEGsZm9yMG
+ scp -F /var/lib/jenkins/jobs/test_branch_origin_extended_conformance_k8s_310/workspace/.config/origin-ci-tool/inventory/.ssh_config /tmp/tmp.tEGsZm9yMG openshiftdevel:/tmp/tmp.tEGsZm9yMG
+ ssh -F /var/lib/jenkins/jobs/test_branch_origin_extended_conformance_k8s_310/workspace/.config/origin-ci-tool/inventory/.ssh_config -t openshiftdevel 'bash -l -c "timeout 3600 /tmp/tmp.tEGsZm9yMG"'
+ cd /data/src/github.com/openshift/origin
+ jobs_repo=/data/src/github.com/openshift/aos-cd-jobs/
+ for i in console service-catalog web-console metrics-server docker-registry
+ docker pull openshift/origin-console:v4.0
Trying to pull repository registry.access.redhat.com/openshift/origin-console ... 
Pulling repository registry.access.redhat.com/openshift/origin-console
Trying to pull repository registry.redhat.io/openshift/origin-console ... 
Trying to pull repository docker.io/openshift/origin-console ... 
v4.0: Pulling from docker.io/openshift/origin-console
c2340472a0fa: Pulling fs layer
6e55351c18ff: Pulling fs layer
b2d2704dda6c: Pulling fs layer
a2c10be042b9: Pulling fs layer
935defe83e2f: Pulling fs layer
a2c10be042b9: Waiting
935defe83e2f: Waiting
b2d2704dda6c: Verifying Checksum
b2d2704dda6c: Download complete
6e55351c18ff: Download complete
935defe83e2f: Verifying Checksum
935defe83e2f: Download complete
a2c10be042b9: Verifying Checksum
a2c10be042b9: Download complete
c2340472a0fa: Verifying Checksum
c2340472a0fa: Download complete
c2340472a0fa: Pull complete
6e55351c18ff: Pull complete
b2d2704dda6c: Pull complete
a2c10be042b9: Pull complete
935defe83e2f: Pull complete
Digest: sha256:2a8606c0f0445a49693b3a9e8fa8b55e5f5fa57312fca59b1e5ff2ab8c4a9000
Status: Downloaded newer image for docker.io/openshift/origin-console:v4.0
++ cat /data/src/github.com/openshift/aos-cd-jobs//ORIGIN_COMMIT
+ docker tag openshift/origin-console:v4.0 openshift/origin-console:d4ca19f
+ for i in console service-catalog web-console metrics-server docker-registry
+ docker pull openshift/origin-service-catalog:v4.0
Trying to pull repository registry.access.redhat.com/openshift/origin-service-catalog ... 
Pulling repository registry.access.redhat.com/openshift/origin-service-catalog
Trying to pull repository registry.redhat.io/openshift/origin-service-catalog ... 
Trying to pull repository docker.io/openshift/origin-service-catalog ... 
v4.0: Pulling from docker.io/openshift/origin-service-catalog
68cddb23acfe: Pulling fs layer
b1ae8487cc2f: Pulling fs layer
e4b71d26d12a: Pulling fs layer
0eddba817d92: Pulling fs layer
36ed5f97072c: Pulling fs layer
0eddba817d92: Waiting
36ed5f97072c: Waiting
e4b71d26d12a: Verifying Checksum
e4b71d26d12a: Download complete
b1ae8487cc2f: Verifying Checksum
b1ae8487cc2f: Download complete
0eddba817d92: Verifying Checksum
0eddba817d92: Download complete
36ed5f97072c: Verifying Checksum
36ed5f97072c: Download complete
68cddb23acfe: Verifying Checksum
68cddb23acfe: Download complete
68cddb23acfe: Pull complete
b1ae8487cc2f: Pull complete
e4b71d26d12a: Pull complete
0eddba817d92: Pull complete
36ed5f97072c: Pull complete
Digest: sha256:cc22f2af68a261c938fb1ec9a9e94643eba23a3bb8c9e22652139f80ee57681b
Status: Downloaded newer image for docker.io/openshift/origin-service-catalog:v4.0
++ cat /data/src/github.com/openshift/aos-cd-jobs//ORIGIN_COMMIT
+ docker tag openshift/origin-service-catalog:v4.0 openshift/origin-service-catalog:d4ca19f
+ for i in console service-catalog web-console metrics-server docker-registry
+ docker pull openshift/origin-web-console:v4.0
Trying to pull repository registry.access.redhat.com/openshift/origin-web-console ... 
Pulling repository registry.access.redhat.com/openshift/origin-web-console
Trying to pull repository registry.redhat.io/openshift/origin-web-console ... 
Trying to pull repository docker.io/openshift/origin-web-console ... 
v4.0: Pulling from docker.io/openshift/origin-web-console
aeb7866da422: Already exists
d1f116af4307: Pulling fs layer
c1da4639813a: Pulling fs layer
f2233aefcda2: Pulling fs layer
c1da4639813a: Download complete
d1f116af4307: Verifying Checksum
d1f116af4307: Download complete
f2233aefcda2: Verifying Checksum
f2233aefcda2: Download complete
d1f116af4307: Pull complete
c1da4639813a: Pull complete
f2233aefcda2: Pull complete
Digest: sha256:23a5c2efc574f1b27074ee82e0164fa7446ae44bec2d49caad9fcd9c368b32d0
Status: Downloaded newer image for docker.io/openshift/origin-web-console:v4.0
++ cat /data/src/github.com/openshift/aos-cd-jobs//ORIGIN_COMMIT
+ docker tag openshift/origin-web-console:v4.0 openshift/origin-web-console:d4ca19f
+ for i in console service-catalog web-console metrics-server docker-registry
+ docker pull openshift/origin-metrics-server:v4.0
Trying to pull repository registry.access.redhat.com/openshift/origin-metrics-server ... 
Pulling repository registry.access.redhat.com/openshift/origin-metrics-server
Trying to pull repository registry.redhat.io/openshift/origin-metrics-server ... 
Trying to pull repository docker.io/openshift/origin-metrics-server ... 
v4.0: Pulling from docker.io/openshift/origin-metrics-server
aeb7866da422: Already exists
0e352e62961d: Pulling fs layer
63a9aa64e43d: Pulling fs layer
0e352e62961d: Verifying Checksum
0e352e62961d: Download complete
63a9aa64e43d: Verifying Checksum
63a9aa64e43d: Download complete
0e352e62961d: Pull complete
63a9aa64e43d: Pull complete
Digest: sha256:3a5c4a8975dd720b84ef60408b5bfafebf7494cef5cc3c7ec334186d86ab54d3
Status: Downloaded newer image for docker.io/openshift/origin-metrics-server:v4.0
++ cat /data/src/github.com/openshift/aos-cd-jobs//ORIGIN_COMMIT
+ docker tag openshift/origin-metrics-server:v4.0 openshift/origin-metrics-server:d4ca19f
+ for i in console service-catalog web-console metrics-server docker-registry
+ docker pull openshift/origin-docker-registry:v4.0
Trying to pull repository registry.access.redhat.com/openshift/origin-docker-registry ... 
Pulling repository registry.access.redhat.com/openshift/origin-docker-registry
Trying to pull repository registry.redhat.io/openshift/origin-docker-registry ... 
Trying to pull repository docker.io/openshift/origin-docker-registry ... 
v4.0: Pulling from docker.io/openshift/origin-docker-registry
68cddb23acfe: Already exists
b1ae8487cc2f: Already exists
e4b71d26d12a: Already exists
0eddba817d92: Already exists
df167346889d: Pulling fs layer
df167346889d: Verifying Checksum
df167346889d: Download complete
df167346889d: Pull complete
Digest: sha256:7a5306e053351c921993093024f91bdeece8a3cc6762ff69a2a2568b8e360e08
Status: Downloaded newer image for docker.io/openshift/origin-docker-registry:v4.0
++ cat /data/src/github.com/openshift/aos-cd-jobs//ORIGIN_COMMIT
+ docker tag openshift/origin-docker-registry:v4.0 openshift/origin-docker-registry:d4ca19f
+ set +o xtrace
########## FINISHED STAGE: SUCCESS: PULL AND TAG OTHER IMAGES [00h 00m 27s] ##########
[workspace] $ /bin/bash /tmp/jenkins301264130949282942.sh
########## STARTING STAGE: FORWARD PARAMETERS TO THE REMOTE HOST ##########
+ [[ -s /var/lib/jenkins/jobs/test_branch_origin_extended_conformance_k8s_310/workspace/activate ]]
+ source /var/lib/jenkins/jobs/test_branch_origin_extended_conformance_k8s_310/workspace/activate
++ export VIRTUAL_ENV=/var/lib/jenkins/origin-ci-tool/95a472392910104fc805c4ab8af39791105c956d
++ VIRTUAL_ENV=/var/lib/jenkins/origin-ci-tool/95a472392910104fc805c4ab8af39791105c956d
++ export PATH=/var/lib/jenkins/origin-ci-tool/95a472392910104fc805c4ab8af39791105c956d/bin:/sbin:/usr/sbin:/bin:/usr/bin
++ PATH=/var/lib/jenkins/origin-ci-tool/95a472392910104fc805c4ab8af39791105c956d/bin:/sbin:/usr/sbin:/bin:/usr/bin
++ unset PYTHON_HOME
++ export OCT_CONFIG_HOME=/var/lib/jenkins/jobs/test_branch_origin_extended_conformance_k8s_310/workspace/.config
++ OCT_CONFIG_HOME=/var/lib/jenkins/jobs/test_branch_origin_extended_conformance_k8s_310/workspace/.config
+ ssh -F /var/lib/jenkins/jobs/test_branch_origin_extended_conformance_k8s_310/workspace/.config/origin-ci-tool/inventory/.ssh_config openshiftdevel sudo chmod o+rw /etc/environment
+ ssh -F /var/lib/jenkins/jobs/test_branch_origin_extended_conformance_k8s_310/workspace/.config/origin-ci-tool/inventory/.ssh_config openshiftdevel 'echo '\''OPENSHIFT_ANSIBLE_IMAGE=openshift/origin-ansible:v3.10'\'' >> /etc/environment'
+ ssh -F /var/lib/jenkins/jobs/test_branch_origin_extended_conformance_k8s_310/workspace/.config/origin-ci-tool/inventory/.ssh_config openshiftdevel 'echo '\''ADDITIONAL_SKIP='\'' >> /etc/environment'
+ ssh -F /var/lib/jenkins/jobs/test_branch_origin_extended_conformance_k8s_310/workspace/.config/origin-ci-tool/inventory/.ssh_config openshiftdevel 'echo '\''JOB_NAME=test_branch_origin_extended_conformance_k8s_310'\'' >> /etc/environment'
+ ssh -F /var/lib/jenkins/jobs/test_branch_origin_extended_conformance_k8s_310/workspace/.config/origin-ci-tool/inventory/.ssh_config openshiftdevel 'echo '\''BUILD_NUMBER=1071'\'' >> /etc/environment'
+ ssh -F /var/lib/jenkins/jobs/test_branch_origin_extended_conformance_k8s_310/workspace/.config/origin-ci-tool/inventory/.ssh_config openshiftdevel 'echo '\''SUITE=conformance-k8s'\'' >> /etc/environment'
+ ssh -F /var/lib/jenkins/jobs/test_branch_origin_extended_conformance_k8s_310/workspace/.config/origin-ci-tool/inventory/.ssh_config openshiftdevel 'echo '\''FOCUS='\'' >> /etc/environment'
+ ssh -F /var/lib/jenkins/jobs/test_branch_origin_extended_conformance_k8s_310/workspace/.config/origin-ci-tool/inventory/.ssh_config openshiftdevel 'echo '\''JOB_SPEC={"type":"periodic","job":"test_branch_origin_extended_conformance_k8s_310","buildid":"1464974026395881472","prowjobid":"b5a0e80b-505c-11ec-8d29-0a580a8010a7"}'\'' >> /etc/environment'
+ ssh -F /var/lib/jenkins/jobs/test_branch_origin_extended_conformance_k8s_310/workspace/.config/origin-ci-tool/inventory/.ssh_config openshiftdevel 'echo '\''CLUSTER_PROFILE=gcp'\'' >> /etc/environment'
+ ssh -F /var/lib/jenkins/jobs/test_branch_origin_extended_conformance_k8s_310/workspace/.config/origin-ci-tool/inventory/.ssh_config openshiftdevel 'echo '\''OS_PUSH_BASE_REGISTRY=registry.ci.openshift.org/'\'' >> /etc/environment'
+ ssh -F /var/lib/jenkins/jobs/test_branch_origin_extended_conformance_k8s_310/workspace/.config/origin-ci-tool/inventory/.ssh_config openshiftdevel 'echo '\''OS_PUSH_BASE_REPO=ci-pr-images/'\'' >> /etc/environment'
+ set +o xtrace
########## FINISHED STAGE: SUCCESS: FORWARD PARAMETERS TO THE REMOTE HOST [00h 00m 05s] ##########
[workspace] $ /bin/bash /tmp/jenkins6269073614816125222.sh
########## STARTING STAGE: BUILD OPENSHIFT-ANSIBLE IMAGE ##########
+ [[ -s /var/lib/jenkins/jobs/test_branch_origin_extended_conformance_k8s_310/workspace/activate ]]
+ source /var/lib/jenkins/jobs/test_branch_origin_extended_conformance_k8s_310/workspace/activate
++ export VIRTUAL_ENV=/var/lib/jenkins/origin-ci-tool/95a472392910104fc805c4ab8af39791105c956d
++ VIRTUAL_ENV=/var/lib/jenkins/origin-ci-tool/95a472392910104fc805c4ab8af39791105c956d
++ export PATH=/var/lib/jenkins/origin-ci-tool/95a472392910104fc805c4ab8af39791105c956d/bin:/sbin:/usr/sbin:/bin:/usr/bin
++ PATH=/var/lib/jenkins/origin-ci-tool/95a472392910104fc805c4ab8af39791105c956d/bin:/sbin:/usr/sbin:/bin:/usr/bin
++ unset PYTHON_HOME
++ export OCT_CONFIG_HOME=/var/lib/jenkins/jobs/test_branch_origin_extended_conformance_k8s_310/workspace/.config
++ OCT_CONFIG_HOME=/var/lib/jenkins/jobs/test_branch_origin_extended_conformance_k8s_310/workspace/.config
++ mktemp
+ script=/tmp/tmp.goEucGUHOp
+ cat
+ chmod +x /tmp/tmp.goEucGUHOp
+ scp -F /var/lib/jenkins/jobs/test_branch_origin_extended_conformance_k8s_310/workspace/.config/origin-ci-tool/inventory/.ssh_config /tmp/tmp.goEucGUHOp openshiftdevel:/tmp/tmp.goEucGUHOp
+ ssh -F /var/lib/jenkins/jobs/test_branch_origin_extended_conformance_k8s_310/workspace/.config/origin-ci-tool/inventory/.ssh_config -t openshiftdevel 'bash -l -c "timeout 900 /tmp/tmp.goEucGUHOp"'
+ cd /data/src/github.com/openshift/openshift-ansible
+ [[ '' != \o\p\e\n\s\h\i\f\t ]]
+ docker pull openshift/origin-ansible:v3.10
Trying to pull repository registry.access.redhat.com/openshift/origin-ansible ... 
Pulling repository registry.access.redhat.com/openshift/origin-ansible
Trying to pull repository registry.redhat.io/openshift/origin-ansible ... 
Trying to pull repository docker.io/openshift/origin-ansible ... 
v3.10: Pulling from docker.io/openshift/origin-ansible
a02a4930cb5d: Pulling fs layer
99772896d46c: Pulling fs layer
4801ee46c90b: Pulling fs layer
1de0d502dc3a: Pulling fs layer
c3959c5d6c2d: Pulling fs layer
1de0d502dc3a: Waiting
c3959c5d6c2d: Waiting
99772896d46c: Verifying Checksum
99772896d46c: Download complete
1de0d502dc3a: Download complete
4801ee46c90b: Verifying Checksum
4801ee46c90b: Download complete
a02a4930cb5d: Verifying Checksum
a02a4930cb5d: Download complete
c3959c5d6c2d: Verifying Checksum
c3959c5d6c2d: Download complete
a02a4930cb5d: Pull complete
99772896d46c: Pull complete
4801ee46c90b: Pull complete
1de0d502dc3a: Pull complete
c3959c5d6c2d: Pull complete
Digest: sha256:2ba29ab506e10492c7fddfa8b4d13abd635027fdce75e387b73d3b94b608a6f6
Status: Downloaded newer image for docker.io/openshift/origin-ansible:v3.10
+ exit 0
+ set +o xtrace
########## FINISHED STAGE: SUCCESS: BUILD OPENSHIFT-ANSIBLE IMAGE [00h 00m 37s] ##########
[workspace] $ /bin/bash /tmp/jenkins3034273390257848352.sh
########## STARTING STAGE: DETERMINE THE INSTANCE PREFIX ##########
+ [[ -s /var/lib/jenkins/jobs/test_branch_origin_extended_conformance_k8s_310/workspace/activate ]]
+ source /var/lib/jenkins/jobs/test_branch_origin_extended_conformance_k8s_310/workspace/activate
++ export VIRTUAL_ENV=/var/lib/jenkins/origin-ci-tool/95a472392910104fc805c4ab8af39791105c956d
++ VIRTUAL_ENV=/var/lib/jenkins/origin-ci-tool/95a472392910104fc805c4ab8af39791105c956d
++ export PATH=/var/lib/jenkins/origin-ci-tool/95a472392910104fc805c4ab8af39791105c956d/bin:/sbin:/usr/sbin:/bin:/usr/bin
++ PATH=/var/lib/jenkins/origin-ci-tool/95a472392910104fc805c4ab8af39791105c956d/bin:/sbin:/usr/sbin:/bin:/usr/bin
++ unset PYTHON_HOME
++ export OCT_CONFIG_HOME=/var/lib/jenkins/jobs/test_branch_origin_extended_conformance_k8s_310/workspace/.config
++ OCT_CONFIG_HOME=/var/lib/jenkins/jobs/test_branch_origin_extended_conformance_k8s_310/workspace/.config
++ echo test_branch_origin_extended_conformance_k8s_310
++ sha1sum
+ hashed_identifier='7ef3e0bb03060d4aa0acd77d662ee0d6e5ec4803  -'
+ export INSTANCE_PREFIX=prtest-7ef3e0b-1071
+ INSTANCE_PREFIX=prtest-7ef3e0b-1071
+ echo INSTANCE_PREFIX=prtest-7ef3e0b-1071
++ ssh -F ./.config/origin-ci-tool/inventory/.ssh_config openshiftdevel 'cat /data/src/github.com/openshift/aos-cd-jobs/ORIGIN_COMMIT'
+ echo OS_TAG=d4ca19f
+ echo OS_PUSH_BASE_REPO=ci-pr-images/prtest-7ef3e0b-1071-
+ cat INSTANCE_PREFIX
+ ssh -F ./.config/origin-ci-tool/inventory/.ssh_config openshiftdevel 'cat >> /etc/environment'
+ set +o xtrace
########## FINISHED STAGE: SUCCESS: DETERMINE THE INSTANCE PREFIX [00h 00m 01s] ##########
[workspace] $ /bin/bash /tmp/jenkins6810011846683490451.sh
########## STARTING STAGE: MOVE RPMS TO GCS REPO ##########
+ [[ -s /var/lib/jenkins/jobs/test_branch_origin_extended_conformance_k8s_310/workspace/activate ]]
+ source /var/lib/jenkins/jobs/test_branch_origin_extended_conformance_k8s_310/workspace/activate
++ export VIRTUAL_ENV=/var/lib/jenkins/origin-ci-tool/95a472392910104fc805c4ab8af39791105c956d
++ VIRTUAL_ENV=/var/lib/jenkins/origin-ci-tool/95a472392910104fc805c4ab8af39791105c956d
++ export PATH=/var/lib/jenkins/origin-ci-tool/95a472392910104fc805c4ab8af39791105c956d/bin:/sbin:/usr/sbin:/bin:/usr/bin
++ PATH=/var/lib/jenkins/origin-ci-tool/95a472392910104fc805c4ab8af39791105c956d/bin:/sbin:/usr/sbin:/bin:/usr/bin
++ unset PYTHON_HOME
++ export OCT_CONFIG_HOME=/var/lib/jenkins/jobs/test_branch_origin_extended_conformance_k8s_310/workspace/.config
++ OCT_CONFIG_HOME=/var/lib/jenkins/jobs/test_branch_origin_extended_conformance_k8s_310/workspace/.config
+ [[ '' != \o\p\e\n\s\h\i\f\t ]]
++ curl -q https://storage.googleapis.com/origin-ci-test/releases/openshift/origin/release-3.10/.latest-rpms
  % Total    % Received % Xferd  Average Speed   Time    Time     Time  Current
                                 Dload  Upload   Total   Spent    Left  Speed

  0     0    0     0    0     0      0      0 --:--:-- --:--:-- --:--:--     0
100   228  100   228    0     0    914      0 --:--:-- --:--:-- --:--:--   915
+ location_url='<?xml version='\''1.0'\'' encoding='\''UTF-8'\''?><Error><Code>NoSuchKey</Code><Message>The specified key does not exist.</Message><Details>No such object: origin-ci-test/releases/openshift/origin/release-3.10/.latest-rpms</Details></Error>'
+ ssh -F ./.config/origin-ci-tool/inventory/.ssh_config openshiftdevel 'echo '\''location_url=<?xml version='\''1.0'\'' encoding='\''UTF-8'\''?><Error><Code>NoSuchKey</Code><Message>The specified key does not exist.</Message><Details>No such object: origin-ci-test/releases/openshift/origin/release-3.10/.latest-rpms</Details></Error>'\'' >> /etc/environment'
+ exit 0
+ set +o xtrace
########## FINISHED STAGE: SUCCESS: MOVE RPMS TO GCS REPO [00h 00m 01s] ##########
[workspace] $ /bin/bash /tmp/jenkins2694291161790778672.sh
########## STARTING STAGE: CREATE DIRECTORY FOR DOCKER CONFIG ##########
+ [[ -s /var/lib/jenkins/jobs/test_branch_origin_extended_conformance_k8s_310/workspace/activate ]]
+ source /var/lib/jenkins/jobs/test_branch_origin_extended_conformance_k8s_310/workspace/activate
++ export VIRTUAL_ENV=/var/lib/jenkins/origin-ci-tool/95a472392910104fc805c4ab8af39791105c956d
++ VIRTUAL_ENV=/var/lib/jenkins/origin-ci-tool/95a472392910104fc805c4ab8af39791105c956d
++ export PATH=/var/lib/jenkins/origin-ci-tool/95a472392910104fc805c4ab8af39791105c956d/bin:/sbin:/usr/sbin:/bin:/usr/bin
++ PATH=/var/lib/jenkins/origin-ci-tool/95a472392910104fc805c4ab8af39791105c956d/bin:/sbin:/usr/sbin:/bin:/usr/bin
++ unset PYTHON_HOME
++ export OCT_CONFIG_HOME=/var/lib/jenkins/jobs/test_branch_origin_extended_conformance_k8s_310/workspace/.config
++ OCT_CONFIG_HOME=/var/lib/jenkins/jobs/test_branch_origin_extended_conformance_k8s_310/workspace/.config
++ mktemp
+ script=/tmp/tmp.PfgQ6Bbboj
+ cat
+ chmod +x /tmp/tmp.PfgQ6Bbboj
+ scp -F /var/lib/jenkins/jobs/test_branch_origin_extended_conformance_k8s_310/workspace/.config/origin-ci-tool/inventory/.ssh_config /tmp/tmp.PfgQ6Bbboj openshiftdevel:/tmp/tmp.PfgQ6Bbboj
+ ssh -F /var/lib/jenkins/jobs/test_branch_origin_extended_conformance_k8s_310/workspace/.config/origin-ci-tool/inventory/.ssh_config -t openshiftdevel 'bash -l -c "timeout 14400 /tmp/tmp.PfgQ6Bbboj"'
+ cd /home/origin
+ mkdir -p /tmp/.docker
+ chmod a+rwx /tmp/.docker
+ set +o xtrace
########## FINISHED STAGE: SUCCESS: CREATE DIRECTORY FOR DOCKER CONFIG [00h 00m 00s] ##########
[workspace] $ /bin/bash /tmp/jenkins9080818923819509156.sh
########## STARTING STAGE: TRANSFER DOCKER CONFIG TO REMOTE HOST ##########
+ [[ -s /var/lib/jenkins/jobs/test_branch_origin_extended_conformance_k8s_310/workspace/activate ]]
+ source /var/lib/jenkins/jobs/test_branch_origin_extended_conformance_k8s_310/workspace/activate
++ export VIRTUAL_ENV=/var/lib/jenkins/origin-ci-tool/95a472392910104fc805c4ab8af39791105c956d
++ VIRTUAL_ENV=/var/lib/jenkins/origin-ci-tool/95a472392910104fc805c4ab8af39791105c956d
++ export PATH=/var/lib/jenkins/origin-ci-tool/95a472392910104fc805c4ab8af39791105c956d/bin:/sbin:/usr/sbin:/bin:/usr/bin
++ PATH=/var/lib/jenkins/origin-ci-tool/95a472392910104fc805c4ab8af39791105c956d/bin:/sbin:/usr/sbin:/bin:/usr/bin
++ unset PYTHON_HOME
++ export OCT_CONFIG_HOME=/var/lib/jenkins/jobs/test_branch_origin_extended_conformance_k8s_310/workspace/.config
++ OCT_CONFIG_HOME=/var/lib/jenkins/jobs/test_branch_origin_extended_conformance_k8s_310/workspace/.config
+ scp -F ./.config/origin-ci-tool/inventory/.ssh_config /var/lib/jenkins/.docker/config.json openshiftdevel:/tmp/.docker/
+ set +o xtrace
########## FINISHED STAGE: SUCCESS: TRANSFER DOCKER CONFIG TO REMOTE HOST [00h 00m 01s] ##########
[workspace] $ /bin/bash /tmp/jenkins732424805464425923.sh
########## STARTING STAGE: FORWARD PARAMETERS TO THE REMOTE HOST ##########
+ [[ -s /var/lib/jenkins/jobs/test_branch_origin_extended_conformance_k8s_310/workspace/activate ]]
+ source /var/lib/jenkins/jobs/test_branch_origin_extended_conformance_k8s_310/workspace/activate
++ export VIRTUAL_ENV=/var/lib/jenkins/origin-ci-tool/95a472392910104fc805c4ab8af39791105c956d
++ VIRTUAL_ENV=/var/lib/jenkins/origin-ci-tool/95a472392910104fc805c4ab8af39791105c956d
++ export PATH=/var/lib/jenkins/origin-ci-tool/95a472392910104fc805c4ab8af39791105c956d/bin:/sbin:/usr/sbin:/bin:/usr/bin
++ PATH=/var/lib/jenkins/origin-ci-tool/95a472392910104fc805c4ab8af39791105c956d/bin:/sbin:/usr/sbin:/bin:/usr/bin
++ unset PYTHON_HOME
++ export OCT_CONFIG_HOME=/var/lib/jenkins/jobs/test_branch_origin_extended_conformance_k8s_310/workspace/.config
++ OCT_CONFIG_HOME=/var/lib/jenkins/jobs/test_branch_origin_extended_conformance_k8s_310/workspace/.config
+ ssh -F /var/lib/jenkins/jobs/test_branch_origin_extended_conformance_k8s_310/workspace/.config/origin-ci-tool/inventory/.ssh_config openshiftdevel sudo chmod o+rw /etc/environment
+ ssh -F /var/lib/jenkins/jobs/test_branch_origin_extended_conformance_k8s_310/workspace/.config/origin-ci-tool/inventory/.ssh_config openshiftdevel 'echo '\''OS_PUSH_TAG='\'' >> /etc/environment'
+ ssh -F /var/lib/jenkins/jobs/test_branch_origin_extended_conformance_k8s_310/workspace/.config/origin-ci-tool/inventory/.ssh_config openshiftdevel 'echo '\''OS_PUSH_BASE_REGISTRY=registry.ci.openshift.org/'\'' >> /etc/environment'
+ set +o xtrace
########## FINISHED STAGE: SUCCESS: FORWARD PARAMETERS TO THE REMOTE HOST [00h 00m 01s] ##########
[workspace] $ /bin/bash /tmp/jenkins2759189612925961066.sh
########## STARTING STAGE: PUSH THE RELEASE ##########
+ [[ -s /var/lib/jenkins/jobs/test_branch_origin_extended_conformance_k8s_310/workspace/activate ]]
+ source /var/lib/jenkins/jobs/test_branch_origin_extended_conformance_k8s_310/workspace/activate
++ export VIRTUAL_ENV=/var/lib/jenkins/origin-ci-tool/95a472392910104fc805c4ab8af39791105c956d
++ VIRTUAL_ENV=/var/lib/jenkins/origin-ci-tool/95a472392910104fc805c4ab8af39791105c956d
++ export PATH=/var/lib/jenkins/origin-ci-tool/95a472392910104fc805c4ab8af39791105c956d/bin:/sbin:/usr/sbin:/bin:/usr/bin
++ PATH=/var/lib/jenkins/origin-ci-tool/95a472392910104fc805c4ab8af39791105c956d/bin:/sbin:/usr/sbin:/bin:/usr/bin
++ unset PYTHON_HOME
++ export OCT_CONFIG_HOME=/var/lib/jenkins/jobs/test_branch_origin_extended_conformance_k8s_310/workspace/.config
++ OCT_CONFIG_HOME=/var/lib/jenkins/jobs/test_branch_origin_extended_conformance_k8s_310/workspace/.config
++ mktemp
+ script=/tmp/tmp.7xv7ZtCNgq
+ cat
+ chmod +x /tmp/tmp.7xv7ZtCNgq
+ scp -F /var/lib/jenkins/jobs/test_branch_origin_extended_conformance_k8s_310/workspace/.config/origin-ci-tool/inventory/.ssh_config /tmp/tmp.7xv7ZtCNgq openshiftdevel:/tmp/tmp.7xv7ZtCNgq
+ ssh -F /var/lib/jenkins/jobs/test_branch_origin_extended_conformance_k8s_310/workspace/.config/origin-ci-tool/inventory/.ssh_config -t openshiftdevel 'bash -l -c "timeout 14400 /tmp/tmp.7xv7ZtCNgq"'
+ cd /data/src/github.com/openshift/origin
+ sudo chmod a+rw /tmp/.docker/config.json
+ DOCKER_CONFIG=/tmp/.docker
+ OS_PUSH_LOCAL=1
+ OS_PUSH_ALWAYS=1
+ hack/push-release.sh
[WARNING] [15:35:04+0000] Pushing local :d4ca19f images to registry.ci.openshift.org/ci-pr-images/prtest-7ef3e0b-1071-*:v3.10,:v3.10.0
[INFO] [15:35:05+0000] Pushing registry.ci.openshift.org/ci-pr-images/prtest-7ef3e0b-1071-origin-pod:v3.10...
The push refers to a repository [registry.ci.openshift.org/ci-pr-images/prtest-7ef3e0b-1071-origin-pod]
86c0b4948e3c: Preparing
442f6f312de6: Preparing
174f56854903: Preparing
unauthorized: authentication required
[ERROR] [15:35:05+0000] PID 12479: hack/push-release.sh:83: `docker push ${PUSH_OPTS} "${OS_PUSH_BASE_REGISTRY-}${OS_PUSH_BASE_REPO}${image}${tag}"` exited with status 1.
[INFO] [15:35:05+0000] 		Stack Trace: 
[INFO] [15:35:05+0000] 		  1: hack/push-release.sh:83: `docker push ${PUSH_OPTS} "${OS_PUSH_BASE_REGISTRY-}${OS_PUSH_BASE_REPO}${image}${tag}"`
[INFO] [15:35:05+0000]   Exiting with code 1.
++ export status=FAILURE
++ status=FAILURE
+ set +o xtrace
########## FINISHED STAGE: FAILURE: PUSH THE RELEASE [00h 00m 03s] ##########
Build step 'Execute shell' marked build as failure
[PostBuildScript] - [INFO] Executing post build scripts.
[workspace] $ /bin/bash /tmp/jenkins3766566495813017219.sh
########## STARTING STAGE: DOWNLOAD ARTIFACTS FROM THE REMOTE HOST ##########
+ [[ -s /var/lib/jenkins/jobs/test_branch_origin_extended_conformance_k8s_310/workspace/activate ]]
+ source /var/lib/jenkins/jobs/test_branch_origin_extended_conformance_k8s_310/workspace/activate
++ export VIRTUAL_ENV=/var/lib/jenkins/origin-ci-tool/95a472392910104fc805c4ab8af39791105c956d
++ VIRTUAL_ENV=/var/lib/jenkins/origin-ci-tool/95a472392910104fc805c4ab8af39791105c956d
++ export PATH=/var/lib/jenkins/origin-ci-tool/95a472392910104fc805c4ab8af39791105c956d/bin:/sbin:/usr/sbin:/bin:/usr/bin
++ PATH=/var/lib/jenkins/origin-ci-tool/95a472392910104fc805c4ab8af39791105c956d/bin:/sbin:/usr/sbin:/bin:/usr/bin
++ unset PYTHON_HOME
++ export OCT_CONFIG_HOME=/var/lib/jenkins/jobs/test_branch_origin_extended_conformance_k8s_310/workspace/.config
++ OCT_CONFIG_HOME=/var/lib/jenkins/jobs/test_branch_origin_extended_conformance_k8s_310/workspace/.config
+ trap 'exit 0' EXIT
++ pwd
+ ARTIFACT_DIR=/var/lib/jenkins/jobs/test_branch_origin_extended_conformance_k8s_310/workspace/artifacts/gathered
+ rm -rf /var/lib/jenkins/jobs/test_branch_origin_extended_conformance_k8s_310/workspace/artifacts/gathered
+ mkdir -p /var/lib/jenkins/jobs/test_branch_origin_extended_conformance_k8s_310/workspace/artifacts/gathered
+ ssh -F /var/lib/jenkins/jobs/test_branch_origin_extended_conformance_k8s_310/workspace/.config/origin-ci-tool/inventory/.ssh_config openshiftdevel sudo stat /data/src/github.com/openshift/origin/_output/scripts
  File: ‘/data/src/github.com/openshift/origin/_output/scripts’
  Size: 64        	Blocks: 0          IO Block: 4096   directory
Device: ca02h/51714d	Inode: 100721146   Links: 5
Access: (2755/drwxr-sr-x)  Uid: ( 1001/  origin)   Gid: ( 1003/origin-git)
Context: unconfined_u:object_r:container_file_t:s0
Access: 2021-11-28 15:11:14.194713728 +0000
Modify: 2021-11-28 15:35:03.384585668 +0000
Change: 2021-11-28 15:35:03.384585668 +0000
 Birth: -
+ ssh -F /var/lib/jenkins/jobs/test_branch_origin_extended_conformance_k8s_310/workspace/.config/origin-ci-tool/inventory/.ssh_config openshiftdevel sudo chmod -R o+rX /data/src/github.com/openshift/origin/_output/scripts
+ scp -r -F /var/lib/jenkins/jobs/test_branch_origin_extended_conformance_k8s_310/workspace/.config/origin-ci-tool/inventory/.ssh_config openshiftdevel:/data/src/github.com/openshift/origin/_output/scripts /var/lib/jenkins/jobs/test_branch_origin_extended_conformance_k8s_310/workspace/artifacts/gathered
+ ssh -F /var/lib/jenkins/jobs/test_branch_origin_extended_conformance_k8s_310/workspace/.config/origin-ci-tool/inventory/.ssh_config openshiftdevel sudo stat /tmp/artifacts
stat: cannot stat ‘/tmp/artifacts’: No such file or directory
+ tree /var/lib/jenkins/jobs/test_branch_origin_extended_conformance_k8s_310/workspace/artifacts/gathered
/var/lib/jenkins/jobs/test_branch_origin_extended_conformance_k8s_310/workspace/artifacts/gathered
└── scripts
    ├── build-base-images
    │   ├── artifacts
    │   ├── logs
    │   └── openshift.local.home
    ├── push-release
    │   ├── artifacts
    │   ├── logs
    │   │   └── scripts.log
    │   └── openshift.local.home
    └── shell
        ├── artifacts
        ├── logs
        │   ├── 3e1da5333b23d4143c1d5583959f962dee384983c41e356a87cc415440a6257b.json
        │   └── scripts.log
        └── openshift.local.home

13 directories, 3 files
+ exit 0
[workspace] $ /bin/bash /tmp/jenkins4442881373920234537.sh
########## STARTING STAGE: GENERATE ARTIFACTS FROM THE REMOTE HOST ##########
+ [[ -s /var/lib/jenkins/jobs/test_branch_origin_extended_conformance_k8s_310/workspace/activate ]]
+ source /var/lib/jenkins/jobs/test_branch_origin_extended_conformance_k8s_310/workspace/activate
++ export VIRTUAL_ENV=/var/lib/jenkins/origin-ci-tool/95a472392910104fc805c4ab8af39791105c956d
++ VIRTUAL_ENV=/var/lib/jenkins/origin-ci-tool/95a472392910104fc805c4ab8af39791105c956d
++ export PATH=/var/lib/jenkins/origin-ci-tool/95a472392910104fc805c4ab8af39791105c956d/bin:/sbin:/usr/sbin:/bin:/usr/bin
++ PATH=/var/lib/jenkins/origin-ci-tool/95a472392910104fc805c4ab8af39791105c956d/bin:/sbin:/usr/sbin:/bin:/usr/bin
++ unset PYTHON_HOME
++ export OCT_CONFIG_HOME=/var/lib/jenkins/jobs/test_branch_origin_extended_conformance_k8s_310/workspace/.config
++ OCT_CONFIG_HOME=/var/lib/jenkins/jobs/test_branch_origin_extended_conformance_k8s_310/workspace/.config
+ trap 'exit 0' EXIT
++ pwd
+ ARTIFACT_DIR=/var/lib/jenkins/jobs/test_branch_origin_extended_conformance_k8s_310/workspace/artifacts/generated
+ rm -rf /var/lib/jenkins/jobs/test_branch_origin_extended_conformance_k8s_310/workspace/artifacts/generated
+ mkdir /var/lib/jenkins/jobs/test_branch_origin_extended_conformance_k8s_310/workspace/artifacts/generated
+ ssh -F /var/lib/jenkins/jobs/test_branch_origin_extended_conformance_k8s_310/workspace/.config/origin-ci-tool/inventory/.ssh_config openshiftdevel 'sudo docker version && sudo docker info && sudo docker images && sudo docker ps -a 2>&1'
  WARNING: You're not using the default seccomp profile
+ ssh -F /var/lib/jenkins/jobs/test_branch_origin_extended_conformance_k8s_310/workspace/.config/origin-ci-tool/inventory/.ssh_config openshiftdevel 'sudo cat /etc/sysconfig/docker /etc/sysconfig/docker-network /etc/sysconfig/docker-storage /etc/sysconfig/docker-storage-setup /etc/systemd/system/docker.service 2>&1'
+ true
+ ssh -F /var/lib/jenkins/jobs/test_branch_origin_extended_conformance_k8s_310/workspace/.config/origin-ci-tool/inventory/.ssh_config openshiftdevel 'sudo find /var/lib/docker/containers -name *.log | sudo xargs tail -vn +1 2>&1'
+ ssh -F /var/lib/jenkins/jobs/test_branch_origin_extended_conformance_k8s_310/workspace/.config/origin-ci-tool/inventory/.ssh_config openshiftdevel 'oc get --raw /metrics --server=https://$( uname --nodename ):10250 --config=/etc/origin/master/admin.kubeconfig 2>&1'
+ true
+ ssh -F /var/lib/jenkins/jobs/test_branch_origin_extended_conformance_k8s_310/workspace/.config/origin-ci-tool/inventory/.ssh_config openshiftdevel 'sudo ausearch -m AVC -m SELINUX_ERR -m USER_AVC 2>&1'
+ true
+ ssh -F /var/lib/jenkins/jobs/test_branch_origin_extended_conformance_k8s_310/workspace/.config/origin-ci-tool/inventory/.ssh_config openshiftdevel 'oc get --raw /metrics --config=/etc/origin/master/admin.kubeconfig 2>&1'
+ true
+ ssh -F /var/lib/jenkins/jobs/test_branch_origin_extended_conformance_k8s_310/workspace/.config/origin-ci-tool/inventory/.ssh_config openshiftdevel 'sudo df -T -h && sudo pvs && sudo vgs && sudo lvs && sudo findmnt --all 2>&1'
+ ssh -F /var/lib/jenkins/jobs/test_branch_origin_extended_conformance_k8s_310/workspace/.config/origin-ci-tool/inventory/.ssh_config openshiftdevel 'sudo yum list installed 2>&1'
+ ssh -F /var/lib/jenkins/jobs/test_branch_origin_extended_conformance_k8s_310/workspace/.config/origin-ci-tool/inventory/.ssh_config openshiftdevel 'sudo journalctl --dmesg --no-pager --all --lines=all 2>&1'
+ ssh -F /var/lib/jenkins/jobs/test_branch_origin_extended_conformance_k8s_310/workspace/.config/origin-ci-tool/inventory/.ssh_config openshiftdevel 'sudo journalctl _PID=1 --no-pager --all --lines=all 2>&1'
+ tree /var/lib/jenkins/jobs/test_branch_origin_extended_conformance_k8s_310/workspace/artifacts/generated
/var/lib/jenkins/jobs/test_branch_origin_extended_conformance_k8s_310/workspace/artifacts/generated
├── avc_denials.log
├── containers.log
├── dmesg.log
├── docker.config
├── docker.info
├── filesystem.info
├── installed_packages.log
├── master-metrics.log
├── node-metrics.log
└── pid1.journal

0 directories, 10 files
+ exit 0
[workspace] $ /bin/bash /tmp/jenkins2785369446581317639.sh
########## STARTING STAGE: FETCH SYSTEMD JOURNALS FROM THE REMOTE HOST ##########
+ [[ -s /var/lib/jenkins/jobs/test_branch_origin_extended_conformance_k8s_310/workspace/activate ]]
+ source /var/lib/jenkins/jobs/test_branch_origin_extended_conformance_k8s_310/workspace/activate
++ export VIRTUAL_ENV=/var/lib/jenkins/origin-ci-tool/95a472392910104fc805c4ab8af39791105c956d
++ VIRTUAL_ENV=/var/lib/jenkins/origin-ci-tool/95a472392910104fc805c4ab8af39791105c956d
++ export PATH=/var/lib/jenkins/origin-ci-tool/95a472392910104fc805c4ab8af39791105c956d/bin:/sbin:/usr/sbin:/bin:/usr/bin
++ PATH=/var/lib/jenkins/origin-ci-tool/95a472392910104fc805c4ab8af39791105c956d/bin:/sbin:/usr/sbin:/bin:/usr/bin
++ unset PYTHON_HOME
++ export OCT_CONFIG_HOME=/var/lib/jenkins/jobs/test_branch_origin_extended_conformance_k8s_310/workspace/.config
++ OCT_CONFIG_HOME=/var/lib/jenkins/jobs/test_branch_origin_extended_conformance_k8s_310/workspace/.config
+ trap 'exit 0' EXIT
++ pwd
+ ARTIFACT_DIR=/var/lib/jenkins/jobs/test_branch_origin_extended_conformance_k8s_310/workspace/artifacts/journals
+ rm -rf /var/lib/jenkins/jobs/test_branch_origin_extended_conformance_k8s_310/workspace/artifacts/journals
+ mkdir /var/lib/jenkins/jobs/test_branch_origin_extended_conformance_k8s_310/workspace/artifacts/journals
+ ssh -F /var/lib/jenkins/jobs/test_branch_origin_extended_conformance_k8s_310/workspace/.config/origin-ci-tool/inventory/.ssh_config openshiftdevel sudo journalctl --unit docker.service --no-pager --all --lines=all
+ ssh -F /var/lib/jenkins/jobs/test_branch_origin_extended_conformance_k8s_310/workspace/.config/origin-ci-tool/inventory/.ssh_config openshiftdevel sudo journalctl --unit dnsmasq.service --no-pager --all --lines=all
+ ssh -F /var/lib/jenkins/jobs/test_branch_origin_extended_conformance_k8s_310/workspace/.config/origin-ci-tool/inventory/.ssh_config openshiftdevel sudo journalctl --unit systemd-journald.service --no-pager --all --lines=all
+ tree /var/lib/jenkins/jobs/test_branch_origin_extended_conformance_k8s_310/workspace/artifacts/journals
/var/lib/jenkins/jobs/test_branch_origin_extended_conformance_k8s_310/workspace/artifacts/journals
├── dnsmasq.service
├── docker.service
└── systemd-journald.service

0 directories, 3 files
+ exit 0
[workspace] $ /bin/bash /tmp/jenkins7670636293000881571.sh
########## STARTING STAGE: ASSEMBLE GCS OUTPUT ##########
+ [[ -s /var/lib/jenkins/jobs/test_branch_origin_extended_conformance_k8s_310/workspace/activate ]]
+ source /var/lib/jenkins/jobs/test_branch_origin_extended_conformance_k8s_310/workspace/activate
++ export VIRTUAL_ENV=/var/lib/jenkins/origin-ci-tool/95a472392910104fc805c4ab8af39791105c956d
++ VIRTUAL_ENV=/var/lib/jenkins/origin-ci-tool/95a472392910104fc805c4ab8af39791105c956d
++ export PATH=/var/lib/jenkins/origin-ci-tool/95a472392910104fc805c4ab8af39791105c956d/bin:/sbin:/usr/sbin:/bin:/usr/bin
++ PATH=/var/lib/jenkins/origin-ci-tool/95a472392910104fc805c4ab8af39791105c956d/bin:/sbin:/usr/sbin:/bin:/usr/bin
++ unset PYTHON_HOME
++ export OCT_CONFIG_HOME=/var/lib/jenkins/jobs/test_branch_origin_extended_conformance_k8s_310/workspace/.config
++ OCT_CONFIG_HOME=/var/lib/jenkins/jobs/test_branch_origin_extended_conformance_k8s_310/workspace/.config
+ trap 'exit 0' EXIT
+ mkdir -p gcs/artifacts gcs/artifacts/generated gcs/artifacts/journals gcs/artifacts/gathered
++ python -c 'import json; import urllib; print json.load(urllib.urlopen('\''https://ci.openshift.redhat.com/jenkins/job/test_branch_origin_extended_conformance_k8s_310/1071/api/json'\''))['\''result'\'']'
+ result=FAILURE
+ cat
++ date +%s
+ cat /var/lib/jenkins/jobs/test_branch_origin_extended_conformance_k8s_310/builds/1071/log
+ cp artifacts/generated/avc_denials.log artifacts/generated/containers.log artifacts/generated/dmesg.log artifacts/generated/docker.config artifacts/generated/docker.info artifacts/generated/filesystem.info artifacts/generated/installed_packages.log artifacts/generated/master-metrics.log artifacts/generated/node-metrics.log artifacts/generated/pid1.journal gcs/artifacts/generated/
+ cp artifacts/journals/dnsmasq.service artifacts/journals/docker.service artifacts/journals/systemd-journald.service gcs/artifacts/journals/
+ cp -r artifacts/gathered/scripts gcs/artifacts/
++ pwd
+ scp -F /var/lib/jenkins/jobs/test_branch_origin_extended_conformance_k8s_310/workspace/.config/origin-ci-tool/inventory/.ssh_config -r /var/lib/jenkins/jobs/test_branch_origin_extended_conformance_k8s_310/workspace/gcs openshiftdevel:/data
+ scp -F /var/lib/jenkins/jobs/test_branch_origin_extended_conformance_k8s_310/workspace/.config/origin-ci-tool/inventory/.ssh_config /var/lib/jenkins/.config/gcloud/gcs-publisher-credentials.json openshiftdevel:/data/credentials.json
+ exit 0
[workspace] $ /bin/bash /tmp/jenkins2476881939636325403.sh
########## STARTING STAGE: PUSH THE ARTIFACTS AND METADATA ##########
+ [[ -s /var/lib/jenkins/jobs/test_branch_origin_extended_conformance_k8s_310/workspace/activate ]]
+ source /var/lib/jenkins/jobs/test_branch_origin_extended_conformance_k8s_310/workspace/activate
++ export VIRTUAL_ENV=/var/lib/jenkins/origin-ci-tool/95a472392910104fc805c4ab8af39791105c956d
++ VIRTUAL_ENV=/var/lib/jenkins/origin-ci-tool/95a472392910104fc805c4ab8af39791105c956d
++ export PATH=/var/lib/jenkins/origin-ci-tool/95a472392910104fc805c4ab8af39791105c956d/bin:/sbin:/usr/sbin:/bin:/usr/bin
++ PATH=/var/lib/jenkins/origin-ci-tool/95a472392910104fc805c4ab8af39791105c956d/bin:/sbin:/usr/sbin:/bin:/usr/bin
++ unset PYTHON_HOME
++ export OCT_CONFIG_HOME=/var/lib/jenkins/jobs/test_branch_origin_extended_conformance_k8s_310/workspace/.config
++ OCT_CONFIG_HOME=/var/lib/jenkins/jobs/test_branch_origin_extended_conformance_k8s_310/workspace/.config
++ mktemp
+ script=/tmp/tmp.PNJjIQjgD7
+ cat
+ chmod +x /tmp/tmp.PNJjIQjgD7
+ scp -F /var/lib/jenkins/jobs/test_branch_origin_extended_conformance_k8s_310/workspace/.config/origin-ci-tool/inventory/.ssh_config /tmp/tmp.PNJjIQjgD7 openshiftdevel:/tmp/tmp.PNJjIQjgD7
+ ssh -F /var/lib/jenkins/jobs/test_branch_origin_extended_conformance_k8s_310/workspace/.config/origin-ci-tool/inventory/.ssh_config -t openshiftdevel 'bash -l -c "timeout 300 /tmp/tmp.PNJjIQjgD7"'
+ cd /home/origin
+ trap 'exit 0' EXIT
+ [[ -n {"type":"periodic","job":"test_branch_origin_extended_conformance_k8s_310","buildid":"1464974026395881472","prowjobid":"b5a0e80b-505c-11ec-8d29-0a580a8010a7"} ]]
++ jq --compact-output '.buildid |= "1071"'
+ JOB_SPEC='{"type":"periodic","job":"test_branch_origin_extended_conformance_k8s_310","buildid":"1071","prowjobid":"b5a0e80b-505c-11ec-8d29-0a580a8010a7"}'
+ docker run -e 'JOB_SPEC={"type":"periodic","job":"test_branch_origin_extended_conformance_k8s_310","buildid":"1071","prowjobid":"b5a0e80b-505c-11ec-8d29-0a580a8010a7"}' -v /data:/data:z registry.ci.openshift.org/ci/gcsupload:latest --dry-run=false --gcs-path=gs://origin-ci-test --gcs-credentials-file=/data/credentials.json --path-strategy=single --default-org=openshift --default-repo=origin /data/gcs/artifacts /data/gcs/build-log.txt /data/gcs/finished.json
Unable to find image 'registry.ci.openshift.org/ci/gcsupload:latest' locally
Trying to pull repository registry.ci.openshift.org/ci/gcsupload ... 
latest: Pulling from registry.ci.openshift.org/ci/gcsupload
df20fa9351a1: Already exists
809b39f1848e: Already exists
519c3f86e24c: Pulling fs layer
85cea451eec0: Pulling fs layer
85cea451eec0: Verifying Checksum
85cea451eec0: Download complete
519c3f86e24c: Verifying Checksum
519c3f86e24c: Download complete
519c3f86e24c: Pull complete
85cea451eec0: Pull complete
Digest: sha256:6132e0c8d93238d437b7af5d3e116c4a125424dafbe8529a205939df135b8536
Status: Downloaded newer image for registry.ci.openshift.org/ci/gcsupload:latest
{"component":"gcsupload","file":"prow/gcsupload/run.go:194","func":"k8s.io/test-infra/prow/gcsupload.gatherArtifacts","level":"info","msg":"Gathering artifacts from artifact directory: /data/gcs/artifacts","severity":"info","time":"2021-11-28T15:35:36Z"}
{"component":"gcsupload","file":"prow/gcsupload/run.go:212","func":"k8s.io/test-infra/prow/gcsupload.gatherArtifacts.func1","level":"info","msg":"Found /data/gcs/artifacts/generated/avc_denials.log in artifact directory. Uploading as logs/test_branch_origin_extended_conformance_k8s_310/1071/artifacts/generated/avc_denials.log\n","severity":"info","time":"2021-11-28T15:35:36Z"}
{"component":"gcsupload","file":"prow/gcsupload/run.go:212","func":"k8s.io/test-infra/prow/gcsupload.gatherArtifacts.func1","level":"info","msg":"Found /data/gcs/artifacts/generated/containers.log in artifact directory. Uploading as logs/test_branch_origin_extended_conformance_k8s_310/1071/artifacts/generated/containers.log\n","severity":"info","time":"2021-11-28T15:35:36Z"}
{"component":"gcsupload","file":"prow/gcsupload/run.go:212","func":"k8s.io/test-infra/prow/gcsupload.gatherArtifacts.func1","level":"info","msg":"Found /data/gcs/artifacts/generated/dmesg.log in artifact directory. Uploading as logs/test_branch_origin_extended_conformance_k8s_310/1071/artifacts/generated/dmesg.log\n","severity":"info","time":"2021-11-28T15:35:36Z"}
{"component":"gcsupload","file":"prow/gcsupload/run.go:212","func":"k8s.io/test-infra/prow/gcsupload.gatherArtifacts.func1","level":"info","msg":"Found /data/gcs/artifacts/generated/docker.config in artifact directory. Uploading as logs/test_branch_origin_extended_conformance_k8s_310/1071/artifacts/generated/docker.config\n","severity":"info","time":"2021-11-28T15:35:36Z"}
{"component":"gcsupload","file":"prow/gcsupload/run.go:212","func":"k8s.io/test-infra/prow/gcsupload.gatherArtifacts.func1","level":"info","msg":"Found /data/gcs/artifacts/generated/docker.info in artifact directory. Uploading as logs/test_branch_origin_extended_conformance_k8s_310/1071/artifacts/generated/docker.info\n","severity":"info","time":"2021-11-28T15:35:36Z"}
{"component":"gcsupload","file":"prow/gcsupload/run.go:212","func":"k8s.io/test-infra/prow/gcsupload.gatherArtifacts.func1","level":"info","msg":"Found /data/gcs/artifacts/generated/filesystem.info in artifact directory. Uploading as logs/test_branch_origin_extended_conformance_k8s_310/1071/artifacts/generated/filesystem.info\n","severity":"info","time":"2021-11-28T15:35:36Z"}
{"component":"gcsupload","file":"prow/gcsupload/run.go:212","func":"k8s.io/test-infra/prow/gcsupload.gatherArtifacts.func1","level":"info","msg":"Found /data/gcs/artifacts/generated/installed_packages.log in artifact directory. Uploading as logs/test_branch_origin_extended_conformance_k8s_310/1071/artifacts/generated/installed_packages.log\n","severity":"info","time":"2021-11-28T15:35:36Z"}
{"component":"gcsupload","file":"prow/gcsupload/run.go:212","func":"k8s.io/test-infra/prow/gcsupload.gatherArtifacts.func1","level":"info","msg":"Found /data/gcs/artifacts/generated/master-metrics.log in artifact directory. Uploading as logs/test_branch_origin_extended_conformance_k8s_310/1071/artifacts/generated/master-metrics.log\n","severity":"info","time":"2021-11-28T15:35:36Z"}
{"component":"gcsupload","file":"prow/gcsupload/run.go:212","func":"k8s.io/test-infra/prow/gcsupload.gatherArtifacts.func1","level":"info","msg":"Found /data/gcs/artifacts/generated/node-metrics.log in artifact directory. Uploading as logs/test_branch_origin_extended_conformance_k8s_310/1071/artifacts/generated/node-metrics.log\n","severity":"info","time":"2021-11-28T15:35:36Z"}
{"component":"gcsupload","file":"prow/gcsupload/run.go:212","func":"k8s.io/test-infra/prow/gcsupload.gatherArtifacts.func1","level":"info","msg":"Found /data/gcs/artifacts/generated/pid1.journal in artifact directory. Uploading as logs/test_branch_origin_extended_conformance_k8s_310/1071/artifacts/generated/pid1.journal\n","severity":"info","time":"2021-11-28T15:35:36Z"}
{"component":"gcsupload","file":"prow/gcsupload/run.go:212","func":"k8s.io/test-infra/prow/gcsupload.gatherArtifacts.func1","level":"info","msg":"Found /data/gcs/artifacts/journals/dnsmasq.service in artifact directory. Uploading as logs/test_branch_origin_extended_conformance_k8s_310/1071/artifacts/journals/dnsmasq.service\n","severity":"info","time":"2021-11-28T15:35:36Z"}
{"component":"gcsupload","file":"prow/gcsupload/run.go:212","func":"k8s.io/test-infra/prow/gcsupload.gatherArtifacts.func1","level":"info","msg":"Found /data/gcs/artifacts/journals/docker.service in artifact directory. Uploading as logs/test_branch_origin_extended_conformance_k8s_310/1071/artifacts/journals/docker.service\n","severity":"info","time":"2021-11-28T15:35:36Z"}
{"component":"gcsupload","file":"prow/gcsupload/run.go:212","func":"k8s.io/test-infra/prow/gcsupload.gatherArtifacts.func1","level":"info","msg":"Found /data/gcs/artifacts/journals/systemd-journald.service in artifact directory. Uploading as logs/test_branch_origin_extended_conformance_k8s_310/1071/artifacts/journals/systemd-journald.service\n","severity":"info","time":"2021-11-28T15:35:36Z"}
{"component":"gcsupload","file":"prow/gcsupload/run.go:212","func":"k8s.io/test-infra/prow/gcsupload.gatherArtifacts.func1","level":"info","msg":"Found /data/gcs/artifacts/scripts/push-release/logs/scripts.log in artifact directory. Uploading as logs/test_branch_origin_extended_conformance_k8s_310/1071/artifacts/scripts/push-release/logs/scripts.log\n","severity":"info","time":"2021-11-28T15:35:36Z"}
{"component":"gcsupload","file":"prow/gcsupload/run.go:212","func":"k8s.io/test-infra/prow/gcsupload.gatherArtifacts.func1","level":"info","msg":"Found /data/gcs/artifacts/scripts/shell/logs/3e1da5333b23d4143c1d5583959f962dee384983c41e356a87cc415440a6257b.json in artifact directory. Uploading as logs/test_branch_origin_extended_conformance_k8s_310/1071/artifacts/scripts/shell/logs/3e1da5333b23d4143c1d5583959f962dee384983c41e356a87cc415440a6257b.json\n","severity":"info","time":"2021-11-28T15:35:36Z"}
{"component":"gcsupload","file":"prow/gcsupload/run.go:212","func":"k8s.io/test-infra/prow/gcsupload.gatherArtifacts.func1","level":"info","msg":"Found /data/gcs/artifacts/scripts/shell/logs/scripts.log in artifact directory. Uploading as logs/test_branch_origin_extended_conformance_k8s_310/1071/artifacts/scripts/shell/logs/scripts.log\n","severity":"info","time":"2021-11-28T15:35:36Z"}
{"component":"gcsupload","dest":"logs/test_branch_origin_extended_conformance_k8s_310/1071/artifacts/generated/docker.config","file":"prow/pod-utils/gcs/upload.go:86","func":"k8s.io/test-infra/prow/pod-utils/gcs.upload","level":"info","msg":"Queued for upload","severity":"info","time":"2021-11-28T15:35:36Z"}
{"component":"gcsupload","dest":"logs/test_branch_origin_extended_conformance_k8s_310/1071/artifacts/generated/master-metrics.log","file":"prow/pod-utils/gcs/upload.go:86","func":"k8s.io/test-infra/prow/pod-utils/gcs.upload","level":"info","msg":"Queued for upload","severity":"info","time":"2021-11-28T15:35:36Z"}
{"component":"gcsupload","dest":"logs/test_branch_origin_extended_conformance_k8s_310/1071/artifacts/generated/node-metrics.log","file":"prow/pod-utils/gcs/upload.go:86","func":"k8s.io/test-infra/prow/pod-utils/gcs.upload","level":"info","msg":"Queued for upload","severity":"info","time":"2021-11-28T15:35:36Z"}
{"component":"gcsupload","dest":"logs/test_branch_origin_extended_conformance_k8s_310/1071/artifacts/generated/pid1.journal","file":"prow/pod-utils/gcs/upload.go:86","func":"k8s.io/test-infra/prow/pod-utils/gcs.upload","level":"info","msg":"Queued for upload","severity":"info","time":"2021-11-28T15:35:36Z"}
{"component":"gcsupload","dest":"logs/test_branch_origin_extended_conformance_k8s_310/1071/artifacts/scripts/push-release/logs/scripts.log","file":"prow/pod-utils/gcs/upload.go:86","func":"k8s.io/test-infra/prow/pod-utils/gcs.upload","level":"info","msg":"Queued for upload","severity":"info","time":"2021-11-28T15:35:36Z"}
{"component":"gcsupload","dest":"logs/test_branch_origin_extended_conformance_k8s_310/1071/artifacts/scripts/shell/logs/scripts.log","file":"prow/pod-utils/gcs/upload.go:86","func":"k8s.io/test-infra/prow/pod-utils/gcs.upload","level":"info","msg":"Queued for upload","severity":"info","time":"2021-11-28T15:35:36Z"}
{"component":"gcsupload","dest":"logs/test_branch_origin_extended_conformance_k8s_310/1071/finished.json","file":"prow/pod-utils/gcs/upload.go:86","func":"k8s.io/test-infra/prow/pod-utils/gcs.upload","level":"info","msg":"Queued for upload","severity":"info","time":"2021-11-28T15:35:36Z"}
{"component":"gcsupload","dest":"logs/test_branch_origin_extended_conformance_k8s_310/1071/artifacts/generated/avc_denials.log","file":"prow/pod-utils/gcs/upload.go:86","func":"k8s.io/test-infra/prow/pod-utils/gcs.upload","level":"info","msg":"Queued for upload","severity":"info","time":"2021-11-28T15:35:36Z"}
{"component":"gcsupload","dest":"logs/test_branch_origin_extended_conformance_k8s_310/1071/artifacts/generated/dmesg.log","file":"prow/pod-utils/gcs/upload.go:86","func":"k8s.io/test-infra/prow/pod-utils/gcs.upload","level":"info","msg":"Queued for upload","severity":"info","time":"2021-11-28T15:35:36Z"}
{"component":"gcsupload","dest":"logs/test_branch_origin_extended_conformance_k8s_310/1071/artifacts/generated/docker.info","file":"prow/pod-utils/gcs/upload.go:86","func":"k8s.io/test-infra/prow/pod-utils/gcs.upload","level":"info","msg":"Queued for upload","severity":"info","time":"2021-11-28T15:35:36Z"}
{"component":"gcsupload","dest":"logs/test_branch_origin_extended_conformance_k8s_310/1071/artifacts/generated/filesystem.info","file":"prow/pod-utils/gcs/upload.go:86","func":"k8s.io/test-infra/prow/pod-utils/gcs.upload","level":"info","msg":"Queued for upload","severity":"info","time":"2021-11-28T15:35:36Z"}
{"component":"gcsupload","dest":"logs/test_branch_origin_extended_conformance_k8s_310/1071/artifacts/generated/installed_packages.log","file":"prow/pod-utils/gcs/upload.go:86","func":"k8s.io/test-infra/prow/pod-utils/gcs.upload","level":"info","msg":"Queued for upload","severity":"info","time":"2021-11-28T15:35:36Z"}
{"component":"gcsupload","dest":"logs/test_branch_origin_extended_conformance_k8s_310/1071/artifacts/journals/docker.service","file":"prow/pod-utils/gcs/upload.go:86","func":"k8s.io/test-infra/prow/pod-utils/gcs.upload","level":"info","msg":"Queued for upload","severity":"info","time":"2021-11-28T15:35:36Z"}
{"component":"gcsupload","dest":"logs/test_branch_origin_extended_conformance_k8s_310/latest-build.txt","file":"prow/pod-utils/gcs/upload.go:86","func":"k8s.io/test-infra/prow/pod-utils/gcs.upload","level":"info","msg":"Queued for upload","severity":"info","time":"2021-11-28T15:35:36Z"}
{"component":"gcsupload","dest":"logs/test_branch_origin_extended_conformance_k8s_310/1071/artifacts/generated/containers.log","file":"prow/pod-utils/gcs/upload.go:86","func":"k8s.io/test-infra/prow/pod-utils/gcs.upload","level":"info","msg":"Queued for upload","severity":"info","time":"2021-11-28T15:35:36Z"}
{"component":"gcsupload","dest":"logs/test_branch_origin_extended_conformance_k8s_310/1071/artifacts/journals/dnsmasq.service","file":"prow/pod-utils/gcs/upload.go:86","func":"k8s.io/test-infra/prow/pod-utils/gcs.upload","level":"info","msg":"Queued for upload","severity":"info","time":"2021-11-28T15:35:36Z"}
{"component":"gcsupload","dest":"logs/test_branch_origin_extended_conformance_k8s_310/1071/artifacts/journals/systemd-journald.service","file":"prow/pod-utils/gcs/upload.go:86","func":"k8s.io/test-infra/prow/pod-utils/gcs.upload","level":"info","msg":"Queued for upload","severity":"info","time":"2021-11-28T15:35:36Z"}
{"component":"gcsupload","dest":"logs/test_branch_origin_extended_conformance_k8s_310/1071/artifacts/scripts/shell/logs/3e1da5333b23d4143c1d5583959f962dee384983c41e356a87cc415440a6257b.json","file":"prow/pod-utils/gcs/upload.go:86","func":"k8s.io/test-infra/prow/pod-utils/gcs.upload","level":"info","msg":"Queued for upload","severity":"info","time":"2021-11-28T15:35:36Z"}
{"component":"gcsupload","dest":"logs/test_branch_origin_extended_conformance_k8s_310/1071/build-log.txt","file":"prow/pod-utils/gcs/upload.go:86","func":"k8s.io/test-infra/prow/pod-utils/gcs.upload","level":"info","msg":"Queued for upload","severity":"info","time":"2021-11-28T15:35:36Z"}
{"component":"gcsupload","dest":"logs/test_branch_origin_extended_conformance_k8s_310/1071/artifacts/generated/docker.config","file":"prow/pod-utils/gcs/upload.go:114","func":"k8s.io/test-infra/prow/pod-utils/gcs.upload.func1","level":"info","msg":"Finished upload","severity":"info","time":"2021-11-28T15:35:36Z"}
{"component":"gcsupload","dest":"logs/test_branch_origin_extended_conformance_k8s_310/1071/artifacts/generated/master-metrics.log","file":"prow/pod-utils/gcs/upload.go:114","func":"k8s.io/test-infra/prow/pod-utils/gcs.upload.func1","level":"info","msg":"Finished upload","severity":"info","time":"2021-11-28T15:35:36Z"}
{"component":"gcsupload","dest":"logs/test_branch_origin_extended_conformance_k8s_310/1071/build-log.txt","file":"prow/pod-utils/gcs/upload.go:114","func":"k8s.io/test-infra/prow/pod-utils/gcs.upload.func1","level":"info","msg":"Finished upload","severity":"info","time":"2021-11-28T15:35:36Z"}
{"component":"gcsupload","dest":"logs/test_branch_origin_extended_conformance_k8s_310/1071/artifacts/generated/node-metrics.log","file":"prow/pod-utils/gcs/upload.go:114","func":"k8s.io/test-infra/prow/pod-utils/gcs.upload.func1","level":"info","msg":"Finished upload","severity":"info","time":"2021-11-28T15:35:36Z"}
{"component":"gcsupload","dest":"logs/test_branch_origin_extended_conformance_k8s_310/1071/artifacts/scripts/push-release/logs/scripts.log","file":"prow/pod-utils/gcs/upload.go:114","func":"k8s.io/test-infra/prow/pod-utils/gcs.upload.func1","level":"info","msg":"Finished upload","severity":"info","time":"2021-11-28T15:35:36Z"}
{"component":"gcsupload","dest":"logs/test_branch_origin_extended_conformance_k8s_310/1071/artifacts/scripts/shell/logs/scripts.log","file":"prow/pod-utils/gcs/upload.go:114","func":"k8s.io/test-infra/prow/pod-utils/gcs.upload.func1","level":"info","msg":"Finished upload","severity":"info","time":"2021-11-28T15:35:36Z"}
{"component":"gcsupload","dest":"logs/test_branch_origin_extended_conformance_k8s_310/1071/finished.json","file":"prow/pod-utils/gcs/upload.go:114","func":"k8s.io/test-infra/prow/pod-utils/gcs.upload.func1","level":"info","msg":"Finished upload","severity":"info","time":"2021-11-28T15:35:36Z"}
{"component":"gcsupload","dest":"logs/test_branch_origin_extended_conformance_k8s_310/1071/artifacts/generated/pid1.journal","file":"prow/pod-utils/gcs/upload.go:114","func":"k8s.io/test-infra/prow/pod-utils/gcs.upload.func1","level":"info","msg":"Finished upload","severity":"info","time":"2021-11-28T15:35:36Z"}
{"component":"gcsupload","dest":"logs/test_branch_origin_extended_conformance_k8s_310/1071/artifacts/generated/avc_denials.log","file":"prow/pod-utils/gcs/upload.go:114","func":"k8s.io/test-infra/prow/pod-utils/gcs.upload.func1","level":"info","msg":"Finished upload","severity":"info","time":"2021-11-28T15:35:36Z"}
{"component":"gcsupload","dest":"logs/test_branch_origin_extended_conformance_k8s_310/1071/artifacts/generated/dmesg.log","file":"prow/pod-utils/gcs/upload.go:114","func":"k8s.io/test-infra/prow/pod-utils/gcs.upload.func1","level":"info","msg":"Finished upload","severity":"info","time":"2021-11-28T15:35:36Z"}
{"component":"gcsupload","dest":"logs/test_branch_origin_extended_conformance_k8s_310/1071/artifacts/generated/docker.info","file":"prow/pod-utils/gcs/upload.go:114","func":"k8s.io/test-infra/prow/pod-utils/gcs.upload.func1","level":"info","msg":"Finished upload","severity":"info","time":"2021-11-28T15:35:37Z"}
{"component":"gcsupload","dest":"logs/test_branch_origin_extended_conformance_k8s_310/1071/artifacts/generated/filesystem.info","file":"prow/pod-utils/gcs/upload.go:114","func":"k8s.io/test-infra/prow/pod-utils/gcs.upload.func1","level":"info","msg":"Finished upload","severity":"info","time":"2021-11-28T15:35:37Z"}
{"component":"gcsupload","dest":"logs/test_branch_origin_extended_conformance_k8s_310/1071/artifacts/generated/installed_packages.log","file":"prow/pod-utils/gcs/upload.go:114","func":"k8s.io/test-infra/prow/pod-utils/gcs.upload.func1","level":"info","msg":"Finished upload","severity":"info","time":"2021-11-28T15:35:37Z"}
{"component":"gcsupload","dest":"logs/test_branch_origin_extended_conformance_k8s_310/1071/artifacts/journals/docker.service","file":"prow/pod-utils/gcs/upload.go:114","func":"k8s.io/test-infra/prow/pod-utils/gcs.upload.func1","level":"info","msg":"Finished upload","severity":"info","time":"2021-11-28T15:35:37Z"}
{"component":"gcsupload","dest":"logs/test_branch_origin_extended_conformance_k8s_310/1071/artifacts/generated/containers.log","file":"prow/pod-utils/gcs/upload.go:114","func":"k8s.io/test-infra/prow/pod-utils/gcs.upload.func1","level":"info","msg":"Finished upload","severity":"info","time":"2021-11-28T15:35:37Z"}
{"component":"gcsupload","dest":"logs/test_branch_origin_extended_conformance_k8s_310/latest-build.txt","file":"prow/pod-utils/gcs/upload.go:114","func":"k8s.io/test-infra/prow/pod-utils/gcs.upload.func1","level":"info","msg":"Finished upload","severity":"info","time":"2021-11-28T15:35:37Z"}
{"component":"gcsupload","dest":"logs/test_branch_origin_extended_conformance_k8s_310/1071/artifacts/journals/dnsmasq.service","file":"prow/pod-utils/gcs/upload.go:114","func":"k8s.io/test-infra/prow/pod-utils/gcs.upload.func1","level":"info","msg":"Finished upload","severity":"info","time":"2021-11-28T15:35:37Z"}
{"component":"gcsupload","dest":"logs/test_branch_origin_extended_conformance_k8s_310/1071/artifacts/journals/systemd-journald.service","file":"prow/pod-utils/gcs/upload.go:114","func":"k8s.io/test-infra/prow/pod-utils/gcs.upload.func1","level":"info","msg":"Finished upload","severity":"info","time":"2021-11-28T15:35:37Z"}
{"component":"gcsupload","dest":"logs/test_branch_origin_extended_conformance_k8s_310/1071/artifacts/scripts/shell/logs/3e1da5333b23d4143c1d5583959f962dee384983c41e356a87cc415440a6257b.json","file":"prow/pod-utils/gcs/upload.go:114","func":"k8s.io/test-infra/prow/pod-utils/gcs.upload.func1","level":"info","msg":"Finished upload","severity":"info","time":"2021-11-28T15:35:37Z"}
{"component":"gcsupload","file":"prow/gcsupload/run.go:78","func":"k8s.io/test-infra/prow/gcsupload.completeUpload","level":"info","msg":"Finished upload to blob storage","severity":"info","time":"2021-11-28T15:35:37Z"}
{"component":"gcsupload","file":"prow/gcsupload/run.go:78","func":"k8s.io/test-infra/prow/gcsupload.completeUpload","level":"info","msg":"Finished upload to blob storage","severity":"info","time":"2021-11-28T15:35:37Z"}
+ exit 0
+ set +o xtrace
########## FINISHED STAGE: SUCCESS: PUSH THE ARTIFACTS AND METADATA [00h 00m 08s] ##########
[workspace] $ /bin/bash /tmp/jenkins898998972657436670.sh
########## STARTING STAGE: GATHER ARTIFACTS FROM TEST CLUSTER ##########
+ [[ -s /var/lib/jenkins/jobs/test_branch_origin_extended_conformance_k8s_310/workspace/activate ]]
+ source /var/lib/jenkins/jobs/test_branch_origin_extended_conformance_k8s_310/workspace/activate
++ export VIRTUAL_ENV=/var/lib/jenkins/origin-ci-tool/95a472392910104fc805c4ab8af39791105c956d
++ VIRTUAL_ENV=/var/lib/jenkins/origin-ci-tool/95a472392910104fc805c4ab8af39791105c956d
++ export PATH=/var/lib/jenkins/origin-ci-tool/95a472392910104fc805c4ab8af39791105c956d/bin:/sbin:/usr/sbin:/bin:/usr/bin
++ PATH=/var/lib/jenkins/origin-ci-tool/95a472392910104fc805c4ab8af39791105c956d/bin:/sbin:/usr/sbin:/bin:/usr/bin
++ unset PYTHON_HOME
++ export OCT_CONFIG_HOME=/var/lib/jenkins/jobs/test_branch_origin_extended_conformance_k8s_310/workspace/.config
++ OCT_CONFIG_HOME=/var/lib/jenkins/jobs/test_branch_origin_extended_conformance_k8s_310/workspace/.config
+ trap 'exit 0' EXIT
++ pwd
+ base_artifact_dir=/var/lib/jenkins/jobs/test_branch_origin_extended_conformance_k8s_310/workspace/artifacts
+ source ./INSTANCE_PREFIX
++ INSTANCE_PREFIX=prtest-7ef3e0b-1071
++ OS_TAG=d4ca19f
++ OS_PUSH_BASE_REPO=ci-pr-images/prtest-7ef3e0b-1071-
++ gcloud compute instances list --regexp '.*prtest-7ef3e0b-1071.*' --uri
WARNING: Flag `--regexp` is deprecated. Use `--filter="name~'REGEXP'"` instead.
ERROR: (gcloud.compute.instances.list) Your current active account [aos-serviceaccount@openshift-gce-devel.iam.gserviceaccount.com] does not have any valid credentials
Please run:

  $ gcloud auth login

to obtain new credentials.

For service account, please activate it first:

  $ gcloud auth activate-service-account ACCOUNT
+ exit 0
[workspace] $ /bin/bash /tmp/jenkins1466616855794319313.sh
########## STARTING STAGE: DEPROVISION TEST CLUSTER ##########
+ [[ -s /var/lib/jenkins/jobs/test_branch_origin_extended_conformance_k8s_310/workspace/activate ]]
+ source /var/lib/jenkins/jobs/test_branch_origin_extended_conformance_k8s_310/workspace/activate
++ export VIRTUAL_ENV=/var/lib/jenkins/origin-ci-tool/95a472392910104fc805c4ab8af39791105c956d
++ VIRTUAL_ENV=/var/lib/jenkins/origin-ci-tool/95a472392910104fc805c4ab8af39791105c956d
++ export PATH=/var/lib/jenkins/origin-ci-tool/95a472392910104fc805c4ab8af39791105c956d/bin:/sbin:/usr/sbin:/bin:/usr/bin
++ PATH=/var/lib/jenkins/origin-ci-tool/95a472392910104fc805c4ab8af39791105c956d/bin:/sbin:/usr/sbin:/bin:/usr/bin
++ unset PYTHON_HOME
++ export OCT_CONFIG_HOME=/var/lib/jenkins/jobs/test_branch_origin_extended_conformance_k8s_310/workspace/.config
++ OCT_CONFIG_HOME=/var/lib/jenkins/jobs/test_branch_origin_extended_conformance_k8s_310/workspace/.config
++ mktemp
+ script=/tmp/tmp.gj5Tel277y
+ cat
+ chmod +x /tmp/tmp.gj5Tel277y
+ scp -F /var/lib/jenkins/jobs/test_branch_origin_extended_conformance_k8s_310/workspace/.config/origin-ci-tool/inventory/.ssh_config /tmp/tmp.gj5Tel277y openshiftdevel:/tmp/tmp.gj5Tel277y
+ ssh -F /var/lib/jenkins/jobs/test_branch_origin_extended_conformance_k8s_310/workspace/.config/origin-ci-tool/inventory/.ssh_config -t openshiftdevel 'bash -l -c "timeout 900 /tmp/tmp.gj5Tel277y"'
+ cd /data/src/github.com/openshift/release
+ trap 'exit 0' EXIT
+ cd cluster/test-deploy/
+ make down WHAT=prtest-7ef3e0b-1071 PROFILE=gcp
cat: gcp/.type: No such file or directory
cd gcp/ && ../../bin/ansible.sh ansible-playbook playbooks//openshift-cluster/deprovision.yml
cat: gcp/.type: No such file or directory
No service account file found at /usr/share/ansible/openshift-ansible/inventory/dynamic/injected/gce.json, bypassing login
ERROR! the playbook: playbooks//openshift-cluster/deprovision.yml could not be found
make: *** [down] Error 1
+ exit 0
+ set +o xtrace
########## FINISHED STAGE: SUCCESS: DEPROVISION TEST CLUSTER [00h 00m 03s] ##########
[workspace] $ /bin/bash /tmp/jenkins3461833867184900203.sh
########## STARTING STAGE: DELETE PR IMAGES ##########
+ [[ -s /var/lib/jenkins/jobs/test_branch_origin_extended_conformance_k8s_310/workspace/activate ]]
+ source /var/lib/jenkins/jobs/test_branch_origin_extended_conformance_k8s_310/workspace/activate
++ export VIRTUAL_ENV=/var/lib/jenkins/origin-ci-tool/95a472392910104fc805c4ab8af39791105c956d
++ VIRTUAL_ENV=/var/lib/jenkins/origin-ci-tool/95a472392910104fc805c4ab8af39791105c956d
++ export PATH=/var/lib/jenkins/origin-ci-tool/95a472392910104fc805c4ab8af39791105c956d/bin:/sbin:/usr/sbin:/bin:/usr/bin
++ PATH=/var/lib/jenkins/origin-ci-tool/95a472392910104fc805c4ab8af39791105c956d/bin:/sbin:/usr/sbin:/bin:/usr/bin
++ unset PYTHON_HOME
++ export OCT_CONFIG_HOME=/var/lib/jenkins/jobs/test_branch_origin_extended_conformance_k8s_310/workspace/.config
++ OCT_CONFIG_HOME=/var/lib/jenkins/jobs/test_branch_origin_extended_conformance_k8s_310/workspace/.config
+ trap 'exit 0' EXIT
+ source ./INSTANCE_PREFIX
++ INSTANCE_PREFIX=prtest-7ef3e0b-1071
++ OS_TAG=d4ca19f
++ OS_PUSH_BASE_REPO=ci-pr-images/prtest-7ef3e0b-1071-
+ export KUBECONFIG=/var/lib/jenkins/secrets/image-pr-push.kubeconfig
+ KUBECONFIG=/var/lib/jenkins/secrets/image-pr-push.kubeconfig
+ oc get is -o name -n ci-pr-images
+ grep prtest-7ef3e0b-1071
+ xargs -r oc delete
the server doesn't have a resource type "is"
++ export status=FAILURE
++ status=FAILURE
+ exit 0
[workspace] $ /bin/bash /tmp/jenkins1992264772580692444.sh
########## STARTING STAGE: DEPROVISION CLOUD RESOURCES ##########
+ [[ -s /var/lib/jenkins/jobs/test_branch_origin_extended_conformance_k8s_310/workspace/activate ]]
+ source /var/lib/jenkins/jobs/test_branch_origin_extended_conformance_k8s_310/workspace/activate
++ export VIRTUAL_ENV=/var/lib/jenkins/origin-ci-tool/95a472392910104fc805c4ab8af39791105c956d
++ VIRTUAL_ENV=/var/lib/jenkins/origin-ci-tool/95a472392910104fc805c4ab8af39791105c956d
++ export PATH=/var/lib/jenkins/origin-ci-tool/95a472392910104fc805c4ab8af39791105c956d/bin:/sbin:/usr/sbin:/bin:/usr/bin
++ PATH=/var/lib/jenkins/origin-ci-tool/95a472392910104fc805c4ab8af39791105c956d/bin:/sbin:/usr/sbin:/bin:/usr/bin
++ unset PYTHON_HOME
++ export OCT_CONFIG_HOME=/var/lib/jenkins/jobs/test_branch_origin_extended_conformance_k8s_310/workspace/.config
++ OCT_CONFIG_HOME=/var/lib/jenkins/jobs/test_branch_origin_extended_conformance_k8s_310/workspace/.config
+ oct deprovision

PLAYBOOK: main.yml *************************************************************
4 plays in /var/lib/jenkins/origin-ci-tool/95a472392910104fc805c4ab8af39791105c956d/lib/python2.7/site-packages/oct/ansible/oct/playbooks/deprovision/main.yml

PLAY [ensure we have the parameters necessary to deprovision virtual hosts] ****

TASK [ensure all required variables are set] ***********************************
task path: /var/lib/jenkins/origin-ci-tool/95a472392910104fc805c4ab8af39791105c956d/lib/python2.7/site-packages/oct/ansible/oct/playbooks/deprovision/main.yml:9
skipping: [localhost] => (item=origin_ci_inventory_dir)  => {
    "changed": false, 
    "generated_timestamp": "2021-11-28 10:35:42.708888", 
    "item": "origin_ci_inventory_dir", 
    "skip_reason": "Conditional check failed", 
    "skipped": true
}
skipping: [localhost] => (item=origin_ci_aws_region)  => {
    "changed": false, 
    "generated_timestamp": "2021-11-28 10:35:42.713528", 
    "item": "origin_ci_aws_region", 
    "skip_reason": "Conditional check failed", 
    "skipped": true
}

PLAY [deprovision virtual hosts in EC2] ****************************************

TASK [Gathering Facts] *********************************************************
ok: [localhost]

TASK [deprovision a virtual EC2 host] ******************************************
task path: /var/lib/jenkins/origin-ci-tool/95a472392910104fc805c4ab8af39791105c956d/lib/python2.7/site-packages/oct/ansible/oct/playbooks/deprovision/main.yml:28
included: /var/lib/jenkins/origin-ci-tool/95a472392910104fc805c4ab8af39791105c956d/lib/python2.7/site-packages/oct/ansible/oct/playbooks/deprovision/roles/aws-down/tasks/main.yml for localhost

TASK [update the SSH configuration to remove AWS EC2 specifics] ****************
task path: /var/lib/jenkins/origin-ci-tool/95a472392910104fc805c4ab8af39791105c956d/lib/python2.7/site-packages/oct/ansible/oct/playbooks/deprovision/roles/aws-down/tasks/main.yml:2
ok: [localhost] => {
    "changed": false, 
    "generated_timestamp": "2021-11-28 10:35:43.581311", 
    "msg": ""
}

TASK [rename EC2 instance for termination reaper] ******************************
task path: /var/lib/jenkins/origin-ci-tool/95a472392910104fc805c4ab8af39791105c956d/lib/python2.7/site-packages/oct/ansible/oct/playbooks/deprovision/roles/aws-down/tasks/main.yml:8
changed: [localhost] => {
    "changed": true, 
    "generated_timestamp": "2021-11-28 10:35:44.283677", 
    "msg": "Tags {'Name': 'oct-terminate'} created for resource i-0011dce153d5c212e."
}

TASK [tear down the EC2 instance] **********************************************
task path: /var/lib/jenkins/origin-ci-tool/95a472392910104fc805c4ab8af39791105c956d/lib/python2.7/site-packages/oct/ansible/oct/playbooks/deprovision/roles/aws-down/tasks/main.yml:15
changed: [localhost] => {
    "changed": true, 
    "generated_timestamp": "2021-11-28 10:35:45.562093", 
    "instance_ids": [
        "i-0011dce153d5c212e"
    ], 
    "instances": [
        {
            "ami_launch_index": "0", 
            "architecture": "x86_64", 
            "block_device_mapping": {
                "/dev/sda1": {
                    "delete_on_termination": true, 
                    "status": "attached", 
                    "volume_id": "vol-02d197be2170d1910"
                }, 
                "/dev/sdb": {
                    "delete_on_termination": true, 
                    "status": "attached", 
                    "volume_id": "vol-0d985baa3ebbaf503"
                }
            }, 
            "dns_name": "ec2-3-81-108-81.compute-1.amazonaws.com", 
            "ebs_optimized": false, 
            "groups": {
                "sg-7e73221a": "default"
            }, 
            "hypervisor": "xen", 
            "id": "i-0011dce153d5c212e", 
            "image_id": "ami-0be3a2afbcd35d3f1", 
            "instance_type": "m4.xlarge", 
            "kernel": null, 
            "key_name": "openshift-dev", 
            "launch_time": "2021-11-28T15:07:00.000Z", 
            "placement": "us-east-1d", 
            "private_dns_name": "ip-172-18-12-151.ec2.internal", 
            "private_ip": "172.18.12.151", 
            "public_dns_name": "ec2-3-81-108-81.compute-1.amazonaws.com", 
            "public_ip": "3.81.108.81", 
            "ramdisk": null, 
            "region": "us-east-1", 
            "root_device_name": "/dev/sda1", 
            "root_device_type": "ebs", 
            "state": "running", 
            "state_code": 16, 
            "tags": {
                "Name": "oct-terminate", 
                "openshift_etcd": "", 
                "openshift_master": "", 
                "openshift_node": ""
            }, 
            "tenancy": "default", 
            "virtualization_type": "hvm"
        }
    ], 
    "tagged_instances": []
}

TASK [remove the serialized host variables] ************************************
task path: /var/lib/jenkins/origin-ci-tool/95a472392910104fc805c4ab8af39791105c956d/lib/python2.7/site-packages/oct/ansible/oct/playbooks/deprovision/roles/aws-down/tasks/main.yml:22
changed: [localhost] => {
    "changed": true, 
    "generated_timestamp": "2021-11-28 10:35:45.837303", 
    "path": "/var/lib/jenkins/jobs/test_branch_origin_extended_conformance_k8s_310/workspace/.config/origin-ci-tool/inventory/host_vars/172.18.12.151.yml", 
    "state": "absent"
}

PLAY [deprovision virtual hosts locally manged by Vagrant] *********************

TASK [Gathering Facts] *********************************************************
ok: [localhost]

PLAY [clean up local configuration for deprovisioned instances] ****************

TASK [remove inventory configuration directory] ********************************
task path: /var/lib/jenkins/origin-ci-tool/95a472392910104fc805c4ab8af39791105c956d/lib/python2.7/site-packages/oct/ansible/oct/playbooks/deprovision/main.yml:61
changed: [localhost] => {
    "changed": true, 
    "generated_timestamp": "2021-11-28 10:35:46.379700", 
    "path": "/var/lib/jenkins/jobs/test_branch_origin_extended_conformance_k8s_310/workspace/.config/origin-ci-tool/inventory", 
    "state": "absent"
}

PLAY RECAP *********************************************************************
localhost                  : ok=8    changed=4    unreachable=0    failed=0   

+ set +o xtrace
########## FINISHED STAGE: SUCCESS: DEPROVISION CLOUD RESOURCES [00h 00m 05s] ##########
Archiving artifacts
Recording test results
[Checks API] No suitable checks publisher found.
Sending e-mails to: ccoleman@redhat.com
sent [/var/lib/jenkins/jobs/test_branch_origin_extended_conformance_k8s_310/workspace/artifacts/gathered/scripts/push-release/logs/scripts.log, /var/lib/jenkins/jobs/test_branch_origin_extended_conformance_k8s_310/workspace/artifacts/gathered/scripts/shell/logs/scripts.log, /var/lib/jenkins/jobs/test_branch_origin_extended_conformance_k8s_310/workspace/artifacts/generated/avc_denials.log, /var/lib/jenkins/jobs/test_branch_origin_extended_conformance_k8s_310/workspace/artifacts/generated/containers.log, /var/lib/jenkins/jobs/test_branch_origin_extended_conformance_k8s_310/workspace/artifacts/generated/dmesg.log, /var/lib/jenkins/jobs/test_branch_origin_extended_conformance_k8s_310/workspace/artifacts/generated/installed_packages.log, /var/lib/jenkins/jobs/test_branch_origin_extended_conformance_k8s_310/workspace/artifacts/generated/master-metrics.log, /var/lib/jenkins/jobs/test_branch_origin_extended_conformance_k8s_310/workspace/artifacts/generated/node-metrics.log, /var/lib/jenkins/jobs/test_branch_origin_extended_conformance_k8s_310/workspace/gcs/artifacts/generated/avc_denials.log, /var/lib/jenkins/jobs/test_branch_origin_extended_conformance_k8s_310/workspace/gcs/artifacts/generated/containers.log, /var/lib/jenkins/jobs/test_branch_origin_extended_conformance_k8s_310/workspace/gcs/artifacts/generated/dmesg.log, /var/lib/jenkins/jobs/test_branch_origin_extended_conformance_k8s_310/workspace/gcs/artifacts/generated/installed_packages.log, /var/lib/jenkins/jobs/test_branch_origin_extended_conformance_k8s_310/workspace/gcs/artifacts/generated/master-metrics.log, /var/lib/jenkins/jobs/test_branch_origin_extended_conformance_k8s_310/workspace/gcs/artifacts/generated/node-metrics.log, /var/lib/jenkins/jobs/test_branch_origin_extended_conformance_k8s_310/workspace/gcs/artifacts/scripts/push-release/logs/scripts.log, /var/lib/jenkins/jobs/test_branch_origin_extended_conformance_k8s_310/workspace/gcs/artifacts/scripts/shell/logs/scripts.log] to splunk in 16 events
[WS-CLEANUP] Deleting project workspace...
[WS-CLEANUP] Deferred wipeout is used...
[WS-CLEANUP] done
Finished: FAILURE