FailedConsole Output

Skipping 12,317 KB.. Full Log
 currently Running - Ready=true
STEP: Verifying that stateful set ss was scaled up in order
STEP: Scale down will halt with unhealthy stateful pod
Oct 31 00:11:52.343: INFO: Running '/data/src/github.com/openshift/origin/_output/local/bin/linux/amd64/kubectl --server=https://internal-api.primg540.origin-ci-int-gce.dev.rhcloud.com:8443 --kubeconfig=/tmp/cluster-admin.kubeconfig exec --namespace=e2e-tests-statefulset-w9t85 ss-0 -- /bin/sh -c mv -v /usr/share/nginx/html/index.html /tmp/ || true'
Oct 31 00:11:52.857: INFO: stderr: ""
Oct 31 00:11:52.857: INFO: stdout of mv -v /usr/share/nginx/html/index.html /tmp/ || true on ss-0: '/usr/share/nginx/html/index.html' -> '/tmp/index.html'

Oct 31 00:11:52.857: INFO: Running '/data/src/github.com/openshift/origin/_output/local/bin/linux/amd64/kubectl --server=https://internal-api.primg540.origin-ci-int-gce.dev.rhcloud.com:8443 --kubeconfig=/tmp/cluster-admin.kubeconfig exec --namespace=e2e-tests-statefulset-w9t85 ss-1 -- /bin/sh -c mv -v /usr/share/nginx/html/index.html /tmp/ || true'
Oct 31 00:11:53.404: INFO: stderr: ""
Oct 31 00:11:53.404: INFO: stdout of mv -v /usr/share/nginx/html/index.html /tmp/ || true on ss-1: '/usr/share/nginx/html/index.html' -> '/tmp/index.html'

Oct 31 00:11:53.405: INFO: Running '/data/src/github.com/openshift/origin/_output/local/bin/linux/amd64/kubectl --server=https://internal-api.primg540.origin-ci-int-gce.dev.rhcloud.com:8443 --kubeconfig=/tmp/cluster-admin.kubeconfig exec --namespace=e2e-tests-statefulset-w9t85 ss-2 -- /bin/sh -c mv -v /usr/share/nginx/html/index.html /tmp/ || true'
Oct 31 00:11:54.005: INFO: stderr: ""
Oct 31 00:11:54.005: INFO: stdout of mv -v /usr/share/nginx/html/index.html /tmp/ || true on ss-2: '/usr/share/nginx/html/index.html' -> '/tmp/index.html'

Oct 31 00:11:54.005: INFO: Waiting for statefulset status.replicas updated to 0
Oct 31 00:11:54.022: INFO: Waiting for stateful set status to become 0, currently 3
Oct 31 00:12:04.063: INFO: Waiting for pod ss-0 to enter Running - Ready=false, currently Running - Ready=false
Oct 31 00:12:04.063: INFO: Waiting for pod ss-1 to enter Running - Ready=false, currently Running - Ready=false
Oct 31 00:12:04.063: INFO: Waiting for pod ss-2 to enter Running - Ready=false, currently Running - Ready=false
Oct 31 00:12:04.124: INFO: Verifying statefulset ss doesn't scale past 3 for another 9.999999539s
Oct 31 00:12:05.140: INFO: Verifying statefulset ss doesn't scale past 3 for another 8.979563675s
Oct 31 00:12:06.195: INFO: Verifying statefulset ss doesn't scale past 3 for another 7.963738397s
Oct 31 00:12:07.212: INFO: Verifying statefulset ss doesn't scale past 3 for another 6.909132643s
Oct 31 00:12:08.229: INFO: Verifying statefulset ss doesn't scale past 3 for another 5.892272464s
Oct 31 00:12:09.247: INFO: Verifying statefulset ss doesn't scale past 3 for another 4.875441571s
Oct 31 00:12:10.265: INFO: Verifying statefulset ss doesn't scale past 3 for another 3.857277996s
Oct 31 00:12:11.281: INFO: Verifying statefulset ss doesn't scale past 3 for another 2.838902568s
Oct 31 00:12:12.298: INFO: Verifying statefulset ss doesn't scale past 3 for another 1.822531525s
Oct 31 00:12:13.314: INFO: Verifying statefulset ss doesn't scale past 3 for another 806.363822ms
STEP: Scaling down stateful set ss to 0 replicas and waiting until none of pods will run in namespacee2e-tests-statefulset-w9t85
Oct 31 00:12:14.330: INFO: Running '/data/src/github.com/openshift/origin/_output/local/bin/linux/amd64/kubectl --server=https://internal-api.primg540.origin-ci-int-gce.dev.rhcloud.com:8443 --kubeconfig=/tmp/cluster-admin.kubeconfig exec --namespace=e2e-tests-statefulset-w9t85 ss-0 -- /bin/sh -c mv -v /tmp/index.html /usr/share/nginx/html/ || true'
Oct 31 00:12:14.910: INFO: stderr: ""
Oct 31 00:12:14.910: INFO: stdout of mv -v /tmp/index.html /usr/share/nginx/html/ || true on ss-0: '/tmp/index.html' -> '/usr/share/nginx/html/index.html'

Oct 31 00:12:14.910: INFO: Running '/data/src/github.com/openshift/origin/_output/local/bin/linux/amd64/kubectl --server=https://internal-api.primg540.origin-ci-int-gce.dev.rhcloud.com:8443 --kubeconfig=/tmp/cluster-admin.kubeconfig exec --namespace=e2e-tests-statefulset-w9t85 ss-1 -- /bin/sh -c mv -v /tmp/index.html /usr/share/nginx/html/ || true'
Oct 31 00:12:15.402: INFO: stderr: ""
Oct 31 00:12:15.402: INFO: stdout of mv -v /tmp/index.html /usr/share/nginx/html/ || true on ss-1: '/tmp/index.html' -> '/usr/share/nginx/html/index.html'

Oct 31 00:12:15.402: INFO: Running '/data/src/github.com/openshift/origin/_output/local/bin/linux/amd64/kubectl --server=https://internal-api.primg540.origin-ci-int-gce.dev.rhcloud.com:8443 --kubeconfig=/tmp/cluster-admin.kubeconfig exec --namespace=e2e-tests-statefulset-w9t85 ss-2 -- /bin/sh -c mv -v /tmp/index.html /usr/share/nginx/html/ || true'
Oct 31 00:12:15.983: INFO: rc: 127
Oct 31 00:12:15.983: INFO: Waiting 10s to retry failed RunHostCmd: error running &{/data/src/github.com/openshift/origin/_output/local/bin/linux/amd64/kubectl [kubectl --server=https://internal-api.primg540.origin-ci-int-gce.dev.rhcloud.com:8443 --kubeconfig=/tmp/cluster-admin.kubeconfig exec --namespace=e2e-tests-statefulset-w9t85 ss-2 -- /bin/sh -c mv -v /tmp/index.html /usr/share/nginx/html/ || true] []  <nil>  error: unable to upgrade connection: container not found ("nginx")
 [] <nil> 0xc420ee9a40 exit status 1 <nil> <nil> true [0xc4202f15e8 0xc4202f1630 0xc4202f1678] [0xc4202f15e8 0xc4202f1630 0xc4202f1678] [0xc4202f1620 0xc4202f1668] [0x17c2860 0x17c2860] 0xc420ee76e0 <nil>}:
Command stdout:

stderr:
error: unable to upgrade connection: container not found ("nginx")

error:
exit status 1

Oct 31 00:12:25.983: INFO: Running '/data/src/github.com/openshift/origin/_output/local/bin/linux/amd64/kubectl --server=https://internal-api.primg540.origin-ci-int-gce.dev.rhcloud.com:8443 --kubeconfig=/tmp/cluster-admin.kubeconfig exec --namespace=e2e-tests-statefulset-w9t85 ss-2 -- /bin/sh -c mv -v /tmp/index.html /usr/share/nginx/html/ || true'
Oct 31 00:12:26.267: INFO: rc: 127
Oct 31 00:12:26.267: INFO: Waiting 10s to retry failed RunHostCmd: error running &{/data/src/github.com/openshift/origin/_output/local/bin/linux/amd64/kubectl [kubectl --server=https://internal-api.primg540.origin-ci-int-gce.dev.rhcloud.com:8443 --kubeconfig=/tmp/cluster-admin.kubeconfig exec --namespace=e2e-tests-statefulset-w9t85 ss-2 -- /bin/sh -c mv -v /tmp/index.html /usr/share/nginx/html/ || true] []  <nil>  Error from server (NotFound): pods "ss-2" not found
 [] <nil> 0xc420abce10 exit status 1 <nil> <nil> true [0xc420f7ea40 0xc420f7ea60 0xc420f7ea80] [0xc420f7ea40 0xc420f7ea60 0xc420f7ea80] [0xc420f7ea50 0xc420f7ea78] [0x17c2860 0x17c2860] 0xc420dfd0e0 <nil>}:
Command stdout:

stderr:
Error from server (NotFound): pods "ss-2" not found

error:
exit status 1

Oct 31 00:12:36.268: INFO: Running '/data/src/github.com/openshift/origin/_output/local/bin/linux/amd64/kubectl --server=https://internal-api.primg540.origin-ci-int-gce.dev.rhcloud.com:8443 --kubeconfig=/tmp/cluster-admin.kubeconfig exec --namespace=e2e-tests-statefulset-w9t85 ss-2 -- /bin/sh -c mv -v /tmp/index.html /usr/share/nginx/html/ || true'
Oct 31 00:12:36.612: INFO: rc: 127
Oct 31 00:12:36.612: INFO: Waiting 10s to retry failed RunHostCmd: error running &{/data/src/github.com/openshift/origin/_output/local/bin/linux/amd64/kubectl [kubectl --server=https://internal-api.primg540.origin-ci-int-gce.dev.rhcloud.com:8443 --kubeconfig=/tmp/cluster-admin.kubeconfig exec --namespace=e2e-tests-statefulset-w9t85 ss-2 -- /bin/sh -c mv -v /tmp/index.html /usr/share/nginx/html/ || true] []  <nil>  Error from server (NotFound): pods "ss-2" not found
 [] <nil> 0xc420ee9ec0 exit status 1 <nil> <nil> true [0xc4202f1680 0xc4202f16b0 0xc4202f16c8] [0xc4202f1680 0xc4202f16b0 0xc4202f16c8] [0xc4202f16a0 0xc4202f16c0] [0x17c2860 0x17c2860] 0xc420ee7980 <nil>}:
Command stdout:

stderr:
Error from server (NotFound): pods "ss-2" not found

error:
exit status 1

Oct 31 00:12:46.612: INFO: Running '/data/src/github.com/openshift/origin/_output/local/bin/linux/amd64/kubectl --server=https://internal-api.primg540.origin-ci-int-gce.dev.rhcloud.com:8443 --kubeconfig=/tmp/cluster-admin.kubeconfig exec --namespace=e2e-tests-statefulset-w9t85 ss-2 -- /bin/sh -c mv -v /tmp/index.html /usr/share/nginx/html/ || true'
Oct 31 00:12:46.895: INFO: rc: 127
Oct 31 00:12:46.895: INFO: Waiting 10s to retry failed RunHostCmd: error running &{/data/src/github.com/openshift/origin/_output/local/bin/linux/amd64/kubectl [kubectl --server=https://internal-api.primg540.origin-ci-int-gce.dev.rhcloud.com:8443 --kubeconfig=/tmp/cluster-admin.kubeconfig exec --namespace=e2e-tests-statefulset-w9t85 ss-2 -- /bin/sh -c mv -v /tmp/index.html /usr/share/nginx/html/ || true] []  <nil>  Error from server (NotFound): pods "ss-2" not found
 [] <nil> 0xc420abd2c0 exit status 1 <nil> <nil> true [0xc420f7ea88 0xc420f7eab0 0xc420f7eac8] [0xc420f7ea88 0xc420f7eab0 0xc420f7eac8] [0xc420f7eaa0 0xc420f7eac0] [0x17c2860 0x17c2860] 0xc420dfd440 <nil>}:
Command stdout:

stderr:
Error from server (NotFound): pods "ss-2" not found

error:
exit status 1

Oct 31 00:12:56.895: INFO: Running '/data/src/github.com/openshift/origin/_output/local/bin/linux/amd64/kubectl --server=https://internal-api.primg540.origin-ci-int-gce.dev.rhcloud.com:8443 --kubeconfig=/tmp/cluster-admin.kubeconfig exec --namespace=e2e-tests-statefulset-w9t85 ss-2 -- /bin/sh -c mv -v /tmp/index.html /usr/share/nginx/html/ || true'
Oct 31 00:12:57.191: INFO: rc: 127
Oct 31 00:12:57.191: INFO: Waiting 10s to retry failed RunHostCmd: error running &{/data/src/github.com/openshift/origin/_output/local/bin/linux/amd64/kubectl [kubectl --server=https://internal-api.primg540.origin-ci-int-gce.dev.rhcloud.com:8443 --kubeconfig=/tmp/cluster-admin.kubeconfig exec --namespace=e2e-tests-statefulset-w9t85 ss-2 -- /bin/sh -c mv -v /tmp/index.html /usr/share/nginx/html/ || true] []  <nil>  Error from server (NotFound): pods "ss-2" not found
 [] <nil> 0xc420abd710 exit status 1 <nil> <nil> true [0xc420f7ead0 0xc420f7eaf0 0xc420f7eb58] [0xc420f7ead0 0xc420f7eaf0 0xc420f7eb58] [0xc420f7eae8 0xc420f7eb48] [0x17c2860 0x17c2860] 0xc420dfd860 <nil>}:
Command stdout:

stderr:
Error from server (NotFound): pods "ss-2" not found

error:
exit status 1

Oct 31 00:13:07.192: INFO: Running '/data/src/github.com/openshift/origin/_output/local/bin/linux/amd64/kubectl --server=https://internal-api.primg540.origin-ci-int-gce.dev.rhcloud.com:8443 --kubeconfig=/tmp/cluster-admin.kubeconfig exec --namespace=e2e-tests-statefulset-w9t85 ss-2 -- /bin/sh -c mv -v /tmp/index.html /usr/share/nginx/html/ || true'
Oct 31 00:13:07.516: INFO: rc: 127
Oct 31 00:13:07.516: INFO: Waiting 10s to retry failed RunHostCmd: error running &{/data/src/github.com/openshift/origin/_output/local/bin/linux/amd64/kubectl [kubectl --server=https://internal-api.primg540.origin-ci-int-gce.dev.rhcloud.com:8443 --kubeconfig=/tmp/cluster-admin.kubeconfig exec --namespace=e2e-tests-statefulset-w9t85 ss-2 -- /bin/sh -c mv -v /tmp/index.html /usr/share/nginx/html/ || true] []  <nil>  Error from server (NotFound): pods "ss-2" not found
 [] <nil> 0xc4218ea960 exit status 1 <nil> <nil> true [0xc42000e6a0 0xc42000e6c0 0xc42000e6e8] [0xc42000e6a0 0xc42000e6c0 0xc42000e6e8] [0xc42000e6b8 0xc42000e6d0] [0x17c2860 0x17c2860] 0xc420be2480 <nil>}:
Command stdout:

stderr:
Error from server (NotFound): pods "ss-2" not found

error:
exit status 1

Oct 31 00:13:17.516: INFO: Running '/data/src/github.com/openshift/origin/_output/local/bin/linux/amd64/kubectl --server=https://internal-api.primg540.origin-ci-int-gce.dev.rhcloud.com:8443 --kubeconfig=/tmp/cluster-admin.kubeconfig exec --namespace=e2e-tests-statefulset-w9t85 ss-2 -- /bin/sh -c mv -v /tmp/index.html /usr/share/nginx/html/ || true'
Oct 31 00:13:17.807: INFO: rc: 127
Oct 31 00:13:17.807: INFO: Waiting 10s to retry failed RunHostCmd: error running &{/data/src/github.com/openshift/origin/_output/local/bin/linux/amd64/kubectl [kubectl --server=https://internal-api.primg540.origin-ci-int-gce.dev.rhcloud.com:8443 --kubeconfig=/tmp/cluster-admin.kubeconfig exec --namespace=e2e-tests-statefulset-w9t85 ss-2 -- /bin/sh -c mv -v /tmp/index.html /usr/share/nginx/html/ || true] []  <nil>  Error from server (NotFound): pods "ss-2" not found
 [] <nil> 0xc420b0acc0 exit status 1 <nil> <nil> true [0xc421690010 0xc421690048 0xc421690060] [0xc421690010 0xc421690048 0xc421690060] [0xc421690040 0xc421690058] [0x17c2860 0x17c2860] 0xc420b8d5c0 <nil>}:
Command stdout:

stderr:
Error from server (NotFound): pods "ss-2" not found

error:
exit status 1

Oct 31 00:13:27.807: INFO: Running '/data/src/github.com/openshift/origin/_output/local/bin/linux/amd64/kubectl --server=https://internal-api.primg540.origin-ci-int-gce.dev.rhcloud.com:8443 --kubeconfig=/tmp/cluster-admin.kubeconfig exec --namespace=e2e-tests-statefulset-w9t85 ss-2 -- /bin/sh -c mv -v /tmp/index.html /usr/share/nginx/html/ || true'
Oct 31 00:13:28.087: INFO: rc: 127
Oct 31 00:13:28.087: INFO: Waiting 10s to retry failed RunHostCmd: error running &{/data/src/github.com/openshift/origin/_output/local/bin/linux/amd64/kubectl [kubectl --server=https://internal-api.primg540.origin-ci-int-gce.dev.rhcloud.com:8443 --kubeconfig=/tmp/cluster-admin.kubeconfig exec --namespace=e2e-tests-statefulset-w9t85 ss-2 -- /bin/sh -c mv -v /tmp/index.html /usr/share/nginx/html/ || true] []  <nil>  Error from server (NotFound): pods "ss-2" not found
 [] <nil> 0xc420d62420 exit status 1 <nil> <nil> true [0xc4202f0000 0xc4202f01d0 0xc4202f02e8] [0xc4202f0000 0xc4202f01d0 0xc4202f02e8] [0xc4202f00f0 0xc4202f02d0] [0x17c2860 0x17c2860] 0xc420ea4300 <nil>}:
Command stdout:

stderr:
Error from server (NotFound): pods "ss-2" not found

error:
exit status 1

Oct 31 00:13:38.088: INFO: Running '/data/src/github.com/openshift/origin/_output/local/bin/linux/amd64/kubectl --server=https://internal-api.primg540.origin-ci-int-gce.dev.rhcloud.com:8443 --kubeconfig=/tmp/cluster-admin.kubeconfig exec --namespace=e2e-tests-statefulset-w9t85 ss-2 -- /bin/sh -c mv -v /tmp/index.html /usr/share/nginx/html/ || true'
Oct 31 00:13:38.367: INFO: rc: 127
Oct 31 00:13:38.367: INFO: Waiting 10s to retry failed RunHostCmd: error running &{/data/src/github.com/openshift/origin/_output/local/bin/linux/amd64/kubectl [kubectl --server=https://internal-api.primg540.origin-ci-int-gce.dev.rhcloud.com:8443 --kubeconfig=/tmp/cluster-admin.kubeconfig exec --namespace=e2e-tests-statefulset-w9t85 ss-2 -- /bin/sh -c mv -v /tmp/index.html /usr/share/nginx/html/ || true] []  <nil>  Error from server (NotFound): pods "ss-2" not found
 [] <nil> 0xc420dc8420 exit status 1 <nil> <nil> true [0xc420f7e000 0xc420f7e030 0xc420f7e058] [0xc420f7e000 0xc420f7e030 0xc420f7e058] [0xc420f7e018 0xc420f7e050] [0x17c2860 0x17c2860] 0xc421a741e0 <nil>}:
Command stdout:

stderr:
Error from server (NotFound): pods "ss-2" not found

error:
exit status 1

Oct 31 00:13:48.367: INFO: Running '/data/src/github.com/openshift/origin/_output/local/bin/linux/amd64/kubectl --server=https://internal-api.primg540.origin-ci-int-gce.dev.rhcloud.com:8443 --kubeconfig=/tmp/cluster-admin.kubeconfig exec --namespace=e2e-tests-statefulset-w9t85 ss-2 -- /bin/sh -c mv -v /tmp/index.html /usr/share/nginx/html/ || true'
Oct 31 00:13:48.712: INFO: rc: 127
Oct 31 00:13:48.713: INFO: Waiting 10s to retry failed RunHostCmd: error running &{/data/src/github.com/openshift/origin/_output/local/bin/linux/amd64/kubectl [kubectl --server=https://internal-api.primg540.origin-ci-int-gce.dev.rhcloud.com:8443 --kubeconfig=/tmp/cluster-admin.kubeconfig exec --namespace=e2e-tests-statefulset-w9t85 ss-2 -- /bin/sh -c mv -v /tmp/index.html /usr/share/nginx/html/ || true] []  <nil>  Error from server (NotFound): pods "ss-2" not found
 [] <nil> 0xc420b0b830 exit status 1 <nil> <nil> true [0xc421690068 0xc421690080 0xc421690098] [0xc421690068 0xc421690080 0xc421690098] [0xc421690078 0xc421690090] [0x17c2860 0x17c2860] 0xc420b8daa0 <nil>}:
Command stdout:

stderr:
Error from server (NotFound): pods "ss-2" not found

error:
exit status 1

Oct 31 00:13:58.713: INFO: Running '/data/src/github.com/openshift/origin/_output/local/bin/linux/amd64/kubectl --server=https://internal-api.primg540.origin-ci-int-gce.dev.rhcloud.com:8443 --kubeconfig=/tmp/cluster-admin.kubeconfig exec --namespace=e2e-tests-statefulset-w9t85 ss-2 -- /bin/sh -c mv -v /tmp/index.html /usr/share/nginx/html/ || true'
Oct 31 00:13:59.055: INFO: rc: 127
Oct 31 00:13:59.055: INFO: Waiting 10s to retry failed RunHostCmd: error running &{/data/src/github.com/openshift/origin/_output/local/bin/linux/amd64/kubectl [kubectl --server=https://internal-api.primg540.origin-ci-int-gce.dev.rhcloud.com:8443 --kubeconfig=/tmp/cluster-admin.kubeconfig exec --namespace=e2e-tests-statefulset-w9t85 ss-2 -- /bin/sh -c mv -v /tmp/index.html /usr/share/nginx/html/ || true] []  <nil>  Error from server (NotFound): pods "ss-2" not found
 [] <nil> 0xc420bfa1e0 exit status 1 <nil> <nil> true [0xc4216900a0 0xc4216900b8 0xc4216900d0] [0xc4216900a0 0xc4216900b8 0xc4216900d0] [0xc4216900b0 0xc4216900c8] [0x17c2860 0x17c2860] 0xc420b8de60 <nil>}:
Command stdout:

stderr:
Error from server (NotFound): pods "ss-2" not found

error:
exit status 1

Oct 31 00:14:09.055: INFO: Running '/data/src/github.com/openshift/origin/_output/local/bin/linux/amd64/kubectl --server=https://internal-api.primg540.origin-ci-int-gce.dev.rhcloud.com:8443 --kubeconfig=/tmp/cluster-admin.kubeconfig exec --namespace=e2e-tests-statefulset-w9t85 ss-2 -- /bin/sh -c mv -v /tmp/index.html /usr/share/nginx/html/ || true'
Oct 31 00:14:09.372: INFO: rc: 127
Oct 31 00:14:09.372: INFO: Waiting 10s to retry failed RunHostCmd: error running &{/data/src/github.com/openshift/origin/_output/local/bin/linux/amd64/kubectl [kubectl --server=https://internal-api.primg540.origin-ci-int-gce.dev.rhcloud.com:8443 --kubeconfig=/tmp/cluster-admin.kubeconfig exec --namespace=e2e-tests-statefulset-w9t85 ss-2 -- /bin/sh -c mv -v /tmp/index.html /usr/share/nginx/html/ || true] []  <nil>  Error from server (NotFound): pods "ss-2" not found
 [] <nil> 0xc420f2e450 exit status 1 <nil> <nil> true [0xc42000e0e8 0xc42000e120 0xc42000e138] [0xc42000e0e8 0xc42000e120 0xc42000e138] [0xc42000e110 0xc42000e130] [0x17c2860 0x17c2860] 0xc4218a83c0 <nil>}:
Command stdout:

stderr:
Error from server (NotFound): pods "ss-2" not found

error:
exit status 1

Oct 31 00:14:19.372: INFO: Running '/data/src/github.com/openshift/origin/_output/local/bin/linux/amd64/kubectl --server=https://internal-api.primg540.origin-ci-int-gce.dev.rhcloud.com:8443 --kubeconfig=/tmp/cluster-admin.kubeconfig exec --namespace=e2e-tests-statefulset-w9t85 ss-2 -- /bin/sh -c mv -v /tmp/index.html /usr/share/nginx/html/ || true'
Oct 31 00:14:19.672: INFO: rc: 127
Oct 31 00:14:19.672: INFO: Waiting 10s to retry failed RunHostCmd: error running &{/data/src/github.com/openshift/origin/_output/local/bin/linux/amd64/kubectl [kubectl --server=https://internal-api.primg540.origin-ci-int-gce.dev.rhcloud.com:8443 --kubeconfig=/tmp/cluster-admin.kubeconfig exec --namespace=e2e-tests-statefulset-w9t85 ss-2 -- /bin/sh -c mv -v /tmp/index.html /usr/share/nginx/html/ || true] []  <nil>  Error from server (NotFound): pods "ss-2" not found
 [] <nil> 0xc420f2e8a0 exit status 1 <nil> <nil> true [0xc42000e1a8 0xc42000e2d8 0xc42000e318] [0xc42000e1a8 0xc42000e2d8 0xc42000e318] [0xc42000e2d0 0xc42000e2f0] [0x17c2860 0x17c2860] 0xc4218a89c0 <nil>}:
Command stdout:

stderr:
Error from server (NotFound): pods "ss-2" not found

error:
exit status 1

Oct 31 00:14:29.673: INFO: Running '/data/src/github.com/openshift/origin/_output/local/bin/linux/amd64/kubectl --server=https://internal-api.primg540.origin-ci-int-gce.dev.rhcloud.com:8443 --kubeconfig=/tmp/cluster-admin.kubeconfig exec --namespace=e2e-tests-statefulset-w9t85 ss-2 -- /bin/sh -c mv -v /tmp/index.html /usr/share/nginx/html/ || true'
Oct 31 00:14:29.944: INFO: rc: 127
Oct 31 00:14:29.944: INFO: Waiting 10s to retry failed RunHostCmd: error running &{/data/src/github.com/openshift/origin/_output/local/bin/linux/amd64/kubectl [kubectl --server=https://internal-api.primg540.origin-ci-int-gce.dev.rhcloud.com:8443 --kubeconfig=/tmp/cluster-admin.kubeconfig exec --namespace=e2e-tests-statefulset-w9t85 ss-2 -- /bin/sh -c mv -v /tmp/index.html /usr/share/nginx/html/ || true] []  <nil>  Error from server (NotFound): pods "ss-2" not found
 [] <nil> 0xc420d62810 exit status 1 <nil> <nil> true [0xc4202f02f0 0xc4202f03c0 0xc4202f0448] [0xc4202f02f0 0xc4202f03c0 0xc4202f0448] [0xc4202f03a0 0xc4202f0440] [0x17c2860 0x17c2860] 0xc420ea4600 <nil>}:
Command stdout:

stderr:
Error from server (NotFound): pods "ss-2" not found

error:
exit status 1

Oct 31 00:14:39.944: INFO: Running '/data/src/github.com/openshift/origin/_output/local/bin/linux/amd64/kubectl --server=https://internal-api.primg540.origin-ci-int-gce.dev.rhcloud.com:8443 --kubeconfig=/tmp/cluster-admin.kubeconfig exec --namespace=e2e-tests-statefulset-w9t85 ss-2 -- /bin/sh -c mv -v /tmp/index.html /usr/share/nginx/html/ || true'
Oct 31 00:14:40.244: INFO: rc: 127
Oct 31 00:14:40.244: INFO: Waiting 10s to retry failed RunHostCmd: error running &{/data/src/github.com/openshift/origin/_output/local/bin/linux/amd64/kubectl [kubectl --server=https://internal-api.primg540.origin-ci-int-gce.dev.rhcloud.com:8443 --kubeconfig=/tmp/cluster-admin.kubeconfig exec --namespace=e2e-tests-statefulset-w9t85 ss-2 -- /bin/sh -c mv -v /tmp/index.html /usr/share/nginx/html/ || true] []  <nil>  Error from server (NotFound): pods "ss-2" not found
 [] <nil> 0xc420dc87e0 exit status 1 <nil> <nil> true [0xc420f7e078 0xc420f7e0f0 0xc420f7e108] [0xc420f7e078 0xc420f7e0f0 0xc420f7e108] [0xc420f7e0e0 0xc420f7e100] [0x17c2860 0x17c2860] 0xc421a744e0 <nil>}:
Command stdout:

stderr:
Error from server (NotFound): pods "ss-2" not found

error:
exit status 1

Oct 31 00:14:50.244: INFO: Running '/data/src/github.com/openshift/origin/_output/local/bin/linux/amd64/kubectl --server=https://internal-api.primg540.origin-ci-int-gce.dev.rhcloud.com:8443 --kubeconfig=/tmp/cluster-admin.kubeconfig exec --namespace=e2e-tests-statefulset-w9t85 ss-2 -- /bin/sh -c mv -v /tmp/index.html /usr/share/nginx/html/ || true'
Oct 31 00:14:50.524: INFO: rc: 127
Oct 31 00:14:50.524: INFO: Waiting 10s to retry failed RunHostCmd: error running &{/data/src/github.com/openshift/origin/_output/local/bin/linux/amd64/kubectl [kubectl --server=https://internal-api.primg540.origin-ci-int-gce.dev.rhcloud.com:8443 --kubeconfig=/tmp/cluster-admin.kubeconfig exec --namespace=e2e-tests-statefulset-w9t85 ss-2 -- /bin/sh -c mv -v /tmp/index.html /usr/share/nginx/html/ || true] []  <nil>  Error from server (NotFound): pods "ss-2" not found
 [] <nil> 0xc420bfa5a0 exit status 1 <nil> <nil> true [0xc4216900d8 0xc4216900f0 0xc421690108] [0xc4216900d8 0xc4216900f0 0xc421690108] [0xc4216900e8 0xc421690100] [0x17c2860 0x17c2860] 0xc4217e0240 <nil>}:
Command stdout:

stderr:
Error from server (NotFound): pods "ss-2" not found

error:
exit status 1

Oct 31 00:15:00.524: INFO: Running '/data/src/github.com/openshift/origin/_output/local/bin/linux/amd64/kubectl --server=https://internal-api.primg540.origin-ci-int-gce.dev.rhcloud.com:8443 --kubeconfig=/tmp/cluster-admin.kubeconfig exec --namespace=e2e-tests-statefulset-w9t85 ss-2 -- /bin/sh -c mv -v /tmp/index.html /usr/share/nginx/html/ || true'
Oct 31 00:15:00.791: INFO: rc: 127
Oct 31 00:15:00.791: INFO: Waiting 10s to retry failed RunHostCmd: error running &{/data/src/github.com/openshift/origin/_output/local/bin/linux/amd64/kubectl [kubectl --server=https://internal-api.primg540.origin-ci-int-gce.dev.rhcloud.com:8443 --kubeconfig=/tmp/cluster-admin.kubeconfig exec --namespace=e2e-tests-statefulset-w9t85 ss-2 -- /bin/sh -c mv -v /tmp/index.html /usr/share/nginx/html/ || true] []  <nil>  Error from server (NotFound): pods "ss-2" not found
 [] <nil> 0xc420bfa930 exit status 1 <nil> <nil> true [0xc421690110 0xc421690128 0xc421690140] [0xc421690110 0xc421690128 0xc421690140] [0xc421690120 0xc421690138] [0x17c2860 0x17c2860] 0xc4217e0600 <nil>}:
Command stdout:

stderr:
Error from server (NotFound): pods "ss-2" not found

error:
exit status 1

Oct 31 00:15:10.791: INFO: Running '/data/src/github.com/openshift/origin/_output/local/bin/linux/amd64/kubectl --server=https://internal-api.primg540.origin-ci-int-gce.dev.rhcloud.com:8443 --kubeconfig=/tmp/cluster-admin.kubeconfig exec --namespace=e2e-tests-statefulset-w9t85 ss-2 -- /bin/sh -c mv -v /tmp/index.html /usr/share/nginx/html/ || true'
Oct 31 00:15:11.152: INFO: rc: 127
Oct 31 00:15:11.152: INFO: Waiting 10s to retry failed RunHostCmd: error running &{/data/src/github.com/openshift/origin/_output/local/bin/linux/amd64/kubectl [kubectl --server=https://internal-api.primg540.origin-ci-int-gce.dev.rhcloud.com:8443 --kubeconfig=/tmp/cluster-admin.kubeconfig exec --namespace=e2e-tests-statefulset-w9t85 ss-2 -- /bin/sh -c mv -v /tmp/index.html /usr/share/nginx/html/ || true] []  <nil>  Error from server (NotFound): pods "ss-2" not found
 [] <nil> 0xc420b0ad80 exit status 1 <nil> <nil> true [0xc42000e108 0xc42000e128 0xc42000e1a8] [0xc42000e108 0xc42000e128 0xc42000e1a8] [0xc42000e120 0xc42000e138] [0x17c2860 0x17c2860] 0xc420b8d5c0 <nil>}:
Command stdout:

stderr:
Error from server (NotFound): pods "ss-2" not found

error:
exit status 1

Oct 31 00:15:21.152: INFO: Running '/data/src/github.com/openshift/origin/_output/local/bin/linux/amd64/kubectl --server=https://internal-api.primg540.origin-ci-int-gce.dev.rhcloud.com:8443 --kubeconfig=/tmp/cluster-admin.kubeconfig exec --namespace=e2e-tests-statefulset-w9t85 ss-2 -- /bin/sh -c mv -v /tmp/index.html /usr/share/nginx/html/ || true'
Oct 31 00:15:21.423: INFO: rc: 127
Oct 31 00:15:21.423: INFO: Waiting 10s to retry failed RunHostCmd: error running &{/data/src/github.com/openshift/origin/_output/local/bin/linux/amd64/kubectl [kubectl --server=https://internal-api.primg540.origin-ci-int-gce.dev.rhcloud.com:8443 --kubeconfig=/tmp/cluster-admin.kubeconfig exec --namespace=e2e-tests-statefulset-w9t85 ss-2 -- /bin/sh -c mv -v /tmp/index.html /usr/share/nginx/html/ || true] []  <nil>  Error from server (NotFound): pods "ss-2" not found
 [] <nil> 0xc420f2e3f0 exit status 1 <nil> <nil> true [0xc420f7e000 0xc420f7e030 0xc420f7e058] [0xc420f7e000 0xc420f7e030 0xc420f7e058] [0xc420f7e018 0xc420f7e050] [0x17c2860 0x17c2860] 0xc4218a83c0 <nil>}:
Command stdout:

stderr:
Error from server (NotFound): pods "ss-2" not found

error:
exit status 1

Oct 31 00:15:31.424: INFO: Running '/data/src/github.com/openshift/origin/_output/local/bin/linux/amd64/kubectl --server=https://internal-api.primg540.origin-ci-int-gce.dev.rhcloud.com:8443 --kubeconfig=/tmp/cluster-admin.kubeconfig exec --namespace=e2e-tests-statefulset-w9t85 ss-2 -- /bin/sh -c mv -v /tmp/index.html /usr/share/nginx/html/ || true'
Oct 31 00:15:31.693: INFO: rc: 127
Oct 31 00:15:31.693: INFO: Waiting 10s to retry failed RunHostCmd: error running &{/data/src/github.com/openshift/origin/_output/local/bin/linux/amd64/kubectl [kubectl --server=https://internal-api.primg540.origin-ci-int-gce.dev.rhcloud.com:8443 --kubeconfig=/tmp/cluster-admin.kubeconfig exec --namespace=e2e-tests-statefulset-w9t85 ss-2 -- /bin/sh -c mv -v /tmp/index.html /usr/share/nginx/html/ || true] []  <nil>  Error from server (NotFound): pods "ss-2" not found
 [] <nil> 0xc420f2e870 exit status 1 <nil> <nil> true [0xc420f7e078 0xc420f7e0f0 0xc420f7e108] [0xc420f7e078 0xc420f7e0f0 0xc420f7e108] [0xc420f7e0e0 0xc420f7e100] [0x17c2860 0x17c2860] 0xc4218a89c0 <nil>}:
Command stdout:

stderr:
Error from server (NotFound): pods "ss-2" not found

error:
exit status 1

Oct 31 00:15:41.693: INFO: Running '/data/src/github.com/openshift/origin/_output/local/bin/linux/amd64/kubectl --server=https://internal-api.primg540.origin-ci-int-gce.dev.rhcloud.com:8443 --kubeconfig=/tmp/cluster-admin.kubeconfig exec --namespace=e2e-tests-statefulset-w9t85 ss-2 -- /bin/sh -c mv -v /tmp/index.html /usr/share/nginx/html/ || true'
Oct 31 00:15:41.971: INFO: rc: 127
Oct 31 00:15:41.972: INFO: Waiting 10s to retry failed RunHostCmd: error running &{/data/src/github.com/openshift/origin/_output/local/bin/linux/amd64/kubectl [kubectl --server=https://internal-api.primg540.origin-ci-int-gce.dev.rhcloud.com:8443 --kubeconfig=/tmp/cluster-admin.kubeconfig exec --namespace=e2e-tests-statefulset-w9t85 ss-2 -- /bin/sh -c mv -v /tmp/index.html /usr/share/nginx/html/ || true] []  <nil>  Error from server (NotFound): pods "ss-2" not found
 [] <nil> 0xc420b0bb00 exit status 1 <nil> <nil> true [0xc42000e2c8 0xc42000e2e8 0xc42000e320] [0xc42000e2c8 0xc42000e2e8 0xc42000e320] [0xc42000e2d8 0xc42000e318] [0x17c2860 0x17c2860] 0xc420b8daa0 <nil>}:
Command stdout:

stderr:
Error from server (NotFound): pods "ss-2" not found

error:
exit status 1

Oct 31 00:15:51.972: INFO: Running '/data/src/github.com/openshift/origin/_output/local/bin/linux/amd64/kubectl --server=https://internal-api.primg540.origin-ci-int-gce.dev.rhcloud.com:8443 --kubeconfig=/tmp/cluster-admin.kubeconfig exec --namespace=e2e-tests-statefulset-w9t85 ss-2 -- /bin/sh -c mv -v /tmp/index.html /usr/share/nginx/html/ || true'
Oct 31 00:15:52.245: INFO: rc: 127
Oct 31 00:15:52.245: INFO: Waiting 10s to retry failed RunHostCmd: error running &{/data/src/github.com/openshift/origin/_output/local/bin/linux/amd64/kubectl [kubectl --server=https://internal-api.primg540.origin-ci-int-gce.dev.rhcloud.com:8443 --kubeconfig=/tmp/cluster-admin.kubeconfig exec --namespace=e2e-tests-statefulset-w9t85 ss-2 -- /bin/sh -c mv -v /tmp/index.html /usr/share/nginx/html/ || true] []  <nil>  Error from server (NotFound): pods "ss-2" not found
 [] <nil> 0xc420f2ecf0 exit status 1 <nil> <nil> true [0xc420f7e110 0xc420f7e158 0xc420f7e190] [0xc420f7e110 0xc420f7e158 0xc420f7e190] [0xc420f7e128 0xc420f7e188] [0x17c2860 0x17c2860] 0xc4218a8d80 <nil>}:
Command stdout:

stderr:
Error from server (NotFound): pods "ss-2" not found

error:
exit status 1

Oct 31 00:16:02.246: INFO: Running '/data/src/github.com/openshift/origin/_output/local/bin/linux/amd64/kubectl --server=https://internal-api.primg540.origin-ci-int-gce.dev.rhcloud.com:8443 --kubeconfig=/tmp/cluster-admin.kubeconfig exec --namespace=e2e-tests-statefulset-w9t85 ss-2 -- /bin/sh -c mv -v /tmp/index.html /usr/share/nginx/html/ || true'
Oct 31 00:16:02.532: INFO: rc: 127
Oct 31 00:16:02.533: INFO: Waiting 10s to retry failed RunHostCmd: error running &{/data/src/github.com/openshift/origin/_output/local/bin/linux/amd64/kubectl [kubectl --server=https://internal-api.primg540.origin-ci-int-gce.dev.rhcloud.com:8443 --kubeconfig=/tmp/cluster-admin.kubeconfig exec --namespace=e2e-tests-statefulset-w9t85 ss-2 -- /bin/sh -c mv -v /tmp/index.html /usr/share/nginx/html/ || true] []  <nil>  Error from server (NotFound): pods "ss-2" not found
 [] <nil> 0xc420dc8360 exit status 1 <nil> <nil> true [0xc42000e338 0xc42000e3d8 0xc42000e400] [0xc42000e338 0xc42000e3d8 0xc42000e400] [0xc42000e360 0xc42000e3f8] [0x17c2860 0x17c2860] 0xc420b8de60 <nil>}:
Command stdout:

stderr:
Error from server (NotFound): pods "ss-2" not found

error:
exit status 1

Oct 31 00:16:12.533: INFO: Running '/data/src/github.com/openshift/origin/_output/local/bin/linux/amd64/kubectl --server=https://internal-api.primg540.origin-ci-int-gce.dev.rhcloud.com:8443 --kubeconfig=/tmp/cluster-admin.kubeconfig exec --namespace=e2e-tests-statefulset-w9t85 ss-2 -- /bin/sh -c mv -v /tmp/index.html /usr/share/nginx/html/ || true'
Oct 31 00:16:12.889: INFO: rc: 127
Oct 31 00:16:12.889: INFO: Waiting 10s to retry failed RunHostCmd: error running &{/data/src/github.com/openshift/origin/_output/local/bin/linux/amd64/kubectl [kubectl --server=https://internal-api.primg540.origin-ci-int-gce.dev.rhcloud.com:8443 --kubeconfig=/tmp/cluster-admin.kubeconfig exec --namespace=e2e-tests-statefulset-w9t85 ss-2 -- /bin/sh -c mv -v /tmp/index.html /usr/share/nginx/html/ || true] []  <nil>  Error from server (NotFound): pods "ss-2" not found
 [] <nil> 0xc420dc86f0 exit status 1 <nil> <nil> true [0xc42000e408 0xc42000e430 0xc42000e450] [0xc42000e408 0xc42000e430 0xc42000e450] [0xc42000e420 0xc42000e448] [0x17c2860 0x17c2860] 0xc421a74180 <nil>}:
Command stdout:

stderr:
Error from server (NotFound): pods "ss-2" not found

error:
exit status 1

Oct 31 00:16:22.889: INFO: Running '/data/src/github.com/openshift/origin/_output/local/bin/linux/amd64/kubectl --server=https://internal-api.primg540.origin-ci-int-gce.dev.rhcloud.com:8443 --kubeconfig=/tmp/cluster-admin.kubeconfig exec --namespace=e2e-tests-statefulset-w9t85 ss-2 -- /bin/sh -c mv -v /tmp/index.html /usr/share/nginx/html/ || true'
Oct 31 00:16:23.154: INFO: rc: 127
Oct 31 00:16:23.155: INFO: Waiting 10s to retry failed RunHostCmd: error running &{/data/src/github.com/openshift/origin/_output/local/bin/linux/amd64/kubectl [kubectl --server=https://internal-api.primg540.origin-ci-int-gce.dev.rhcloud.com:8443 --kubeconfig=/tmp/cluster-admin.kubeconfig exec --namespace=e2e-tests-statefulset-w9t85 ss-2 -- /bin/sh -c mv -v /tmp/index.html /usr/share/nginx/html/ || true] []  <nil>  Error from server (NotFound): pods "ss-2" not found
 [] <nil> 0xc420dc8b10 exit status 1 <nil> <nil> true [0xc42000e468 0xc42000e688 0xc42000e6b8] [0xc42000e468 0xc42000e688 0xc42000e6b8] [0xc42000e678 0xc42000e6a8] [0x17c2860 0x17c2860] 0xc421a74480 <nil>}:
Command stdout:

stderr:
Error from server (NotFound): pods "ss-2" not found

error:
exit status 1

Oct 31 00:16:33.155: INFO: Running '/data/src/github.com/openshift/origin/_output/local/bin/linux/amd64/kubectl --server=https://internal-api.primg540.origin-ci-int-gce.dev.rhcloud.com:8443 --kubeconfig=/tmp/cluster-admin.kubeconfig exec --namespace=e2e-tests-statefulset-w9t85 ss-2 -- /bin/sh -c mv -v /tmp/index.html /usr/share/nginx/html/ || true'
Oct 31 00:16:33.423: INFO: rc: 127
Oct 31 00:16:33.423: INFO: Waiting 10s to retry failed RunHostCmd: error running &{/data/src/github.com/openshift/origin/_output/local/bin/linux/amd64/kubectl [kubectl --server=https://internal-api.primg540.origin-ci-int-gce.dev.rhcloud.com:8443 --kubeconfig=/tmp/cluster-admin.kubeconfig exec --namespace=e2e-tests-statefulset-w9t85 ss-2 -- /bin/sh -c mv -v /tmp/index.html /usr/share/nginx/html/ || true] []  <nil>  Error from server (NotFound): pods "ss-2" not found
 [] <nil> 0xc420f2f140 exit status 1 <nil> <nil> true [0xc420f7e198 0xc420f7e1b0 0xc420f7e1e0] [0xc420f7e198 0xc420f7e1b0 0xc420f7e1e0] [0xc420f7e1a8 0xc420f7e1c0] [0x17c2860 0x17c2860] 0xc4218a9440 <nil>}:
Command stdout:

stderr:
Error from server (NotFound): pods "ss-2" not found

error:
exit status 1

Oct 31 00:16:43.423: INFO: Running '/data/src/github.com/openshift/origin/_output/local/bin/linux/amd64/kubectl --server=https://internal-api.primg540.origin-ci-int-gce.dev.rhcloud.com:8443 --kubeconfig=/tmp/cluster-admin.kubeconfig exec --namespace=e2e-tests-statefulset-w9t85 ss-2 -- /bin/sh -c mv -v /tmp/index.html /usr/share/nginx/html/ || true'
Oct 31 00:16:43.698: INFO: rc: 127
Oct 31 00:16:43.698: INFO: Waiting 10s to retry failed RunHostCmd: error running &{/data/src/github.com/openshift/origin/_output/local/bin/linux/amd64/kubectl [kubectl --server=https://internal-api.primg540.origin-ci-int-gce.dev.rhcloud.com:8443 --kubeconfig=/tmp/cluster-admin.kubeconfig exec --namespace=e2e-tests-statefulset-w9t85 ss-2 -- /bin/sh -c mv -v /tmp/index.html /usr/share/nginx/html/ || true] []  <nil>  Error from server (NotFound): pods "ss-2" not found
 [] <nil> 0xc420dc9020 exit status 1 <nil> <nil> true [0xc42000e6c0 0xc42000e6e8 0xc42000e720] [0xc42000e6c0 0xc42000e6e8 0xc42000e720] [0xc42000e6d0 0xc42000e708] [0x17c2860 0x17c2860] 0xc421a74780 <nil>}:
Command stdout:

stderr:
Error from server (NotFound): pods "ss-2" not found

error:
exit status 1

Oct 31 00:16:53.698: INFO: Running '/data/src/github.com/openshift/origin/_output/local/bin/linux/amd64/kubectl --server=https://internal-api.primg540.origin-ci-int-gce.dev.rhcloud.com:8443 --kubeconfig=/tmp/cluster-admin.kubeconfig exec --namespace=e2e-tests-statefulset-w9t85 ss-2 -- /bin/sh -c mv -v /tmp/index.html /usr/share/nginx/html/ || true'
Oct 31 00:16:53.969: INFO: rc: 127
Oct 31 00:16:53.969: INFO: Waiting 10s to retry failed RunHostCmd: error running &{/data/src/github.com/openshift/origin/_output/local/bin/linux/amd64/kubectl [kubectl --server=https://internal-api.primg540.origin-ci-int-gce.dev.rhcloud.com:8443 --kubeconfig=/tmp/cluster-admin.kubeconfig exec --namespace=e2e-tests-statefulset-w9t85 ss-2 -- /bin/sh -c mv -v /tmp/index.html /usr/share/nginx/html/ || true] []  <nil>  Error from server (NotFound): pods "ss-2" not found
 [] <nil> 0xc420f2f5c0 exit status 1 <nil> <nil> true [0xc420f7e1f8 0xc420f7e230 0xc420f7e250] [0xc420f7e1f8 0xc420f7e230 0xc420f7e250] [0xc420f7e210 0xc420f7e248] [0x17c2860 0x17c2860] 0xc4218a98c0 <nil>}:
Command stdout:

stderr:
Error from server (NotFound): pods "ss-2" not found

error:
exit status 1

Oct 31 00:17:03.969: INFO: Running '/data/src/github.com/openshift/origin/_output/local/bin/linux/amd64/kubectl --server=https://internal-api.primg540.origin-ci-int-gce.dev.rhcloud.com:8443 --kubeconfig=/tmp/cluster-admin.kubeconfig exec --namespace=e2e-tests-statefulset-w9t85 ss-2 -- /bin/sh -c mv -v /tmp/index.html /usr/share/nginx/html/ || true'
Oct 31 00:17:04.241: INFO: rc: 127
Oct 31 00:17:04.241: INFO: Waiting 10s to retry failed RunHostCmd: error running &{/data/src/github.com/openshift/origin/_output/local/bin/linux/amd64/kubectl [kubectl --server=https://internal-api.primg540.origin-ci-int-gce.dev.rhcloud.com:8443 --kubeconfig=/tmp/cluster-admin.kubeconfig exec --namespace=e2e-tests-statefulset-w9t85 ss-2 -- /bin/sh -c mv -v /tmp/index.html /usr/share/nginx/html/ || true] []  <nil>  Error from server (NotFound): pods "ss-2" not found
 [] <nil> 0xc420dc93b0 exit status 1 <nil> <nil> true [0xc42000e728 0xc42000e778 0xc42000e7d8] [0xc42000e728 0xc42000e778 0xc42000e7d8] [0xc42000e748 0xc42000e7d0] [0x17c2860 0x17c2860] 0xc421a74ae0 <nil>}:
Command stdout:

stderr:
Error from server (NotFound): pods "ss-2" not found

error:
exit status 1

Oct 31 00:17:14.241: INFO: Running '/data/src/github.com/openshift/origin/_output/local/bin/linux/amd64/kubectl --server=https://internal-api.primg540.origin-ci-int-gce.dev.rhcloud.com:8443 --kubeconfig=/tmp/cluster-admin.kubeconfig exec --namespace=e2e-tests-statefulset-w9t85 ss-2 -- /bin/sh -c mv -v /tmp/index.html /usr/share/nginx/html/ || true'
Oct 31 00:17:14.527: INFO: rc: 127
Oct 31 00:17:14.528: INFO: Waiting 10s to retry failed RunHostCmd: error running &{/data/src/github.com/openshift/origin/_output/local/bin/linux/amd64/kubectl [kubectl --server=https://internal-api.primg540.origin-ci-int-gce.dev.rhcloud.com:8443 --kubeconfig=/tmp/cluster-admin.kubeconfig exec --namespace=e2e-tests-statefulset-w9t85 ss-2 -- /bin/sh -c mv -v /tmp/index.html /usr/share/nginx/html/ || true] []  <nil>  Error from server (NotFound): pods "ss-2" not found
 [] <nil> 0xc420b0acc0 exit status 1 <nil> <nil> true [0xc42000e108 0xc42000e128 0xc42000e1a8] [0xc42000e108 0xc42000e128 0xc42000e1a8] [0xc42000e120 0xc42000e138] [0x17c2860 0x17c2860] 0xc420b8d5c0 <nil>}:
Command stdout:

stderr:
Error from server (NotFound): pods "ss-2" not found

error:
exit status 1

Oct 31 00:17:24.528: INFO: Running '/data/src/github.com/openshift/origin/_output/local/bin/linux/amd64/kubectl --server=https://internal-api.primg540.origin-ci-int-gce.dev.rhcloud.com:8443 --kubeconfig=/tmp/cluster-admin.kubeconfig exec --namespace=e2e-tests-statefulset-w9t85 ss-2 -- /bin/sh -c mv -v /tmp/index.html /usr/share/nginx/html/ || true'
Oct 31 00:17:24.796: INFO: rc: 127
Oct 31 00:17:24.796: INFO: stdout of mv -v /tmp/index.html /usr/share/nginx/html/ || true on ss-2: 
Oct 31 00:17:24.796: INFO: Scaling statefulset ss to 0
STEP: Verifying that stateful set ss was scaled down in reverse order
[AfterEach] [k8s.io] Basic StatefulSet functionality [StatefulSetBasic]
  /go/src/github.com/openshift/origin/vendor/k8s.io/kubernetes/test/e2e/statefulset.go:90
Oct 31 00:17:24.844: INFO: Deleting all statefulset in ns e2e-tests-statefulset-w9t85
Oct 31 00:17:24.860: INFO: Scaling statefulset ss to 0
Oct 31 00:17:24.907: INFO: Waiting for statefulset status.replicas updated to 0
Oct 31 00:17:24.922: INFO: Deleting statefulset ss
[AfterEach] [k8s.io] StatefulSet
  /go/src/github.com/openshift/origin/vendor/k8s.io/kubernetes/test/e2e/framework/framework.go:131
Oct 31 00:17:24.970: INFO: Waiting up to 3m0s for all (but 0) nodes to be ready
STEP: Destroying namespace "e2e-tests-statefulset-w9t85" for this suite.
Oct 31 00:17:31.814: INFO: namespace: e2e-tests-statefulset-w9t85, resource: bindings, ignored listing per whitelist
Oct 31 00:17:32.362: INFO: namespace e2e-tests-statefulset-w9t85 deletion completed in 7.361553284s


• [SLOW TEST:385.519 seconds]
[k8s.io] StatefulSet
/go/src/github.com/openshift/origin/vendor/k8s.io/kubernetes/test/e2e/framework/framework.go:620
  [k8s.io] Basic StatefulSet functionality [StatefulSetBasic]
  /go/src/github.com/openshift/origin/vendor/k8s.io/kubernetes/test/e2e/framework/framework.go:620
    Scaling should happen in predictable order and halt if any stateful pod is unhealthy [Suite:openshift/conformance/parallel] [Suite:k8s]
    /go/src/github.com/openshift/origin/vendor/k8s.io/kubernetes/test/e2e/statefulset.go:724
------------------------------
Oct 31 00:17:32.364: INFO: Running AfterSuite actions on all node


Oct 31 00:14:35.593: INFO: Running AfterSuite actions on all node
Oct 31 00:17:32.377: INFO: Running AfterSuite actions on node 1



Summarizing 1 Failure:

[Fail] [Conformance][templates] templateinstance readiness test  [It] should report ready soon after all annotated objects are ready [Suite:openshift/conformance/parallel] 
/go/src/github.com/openshift/origin/test/extended/templates/templateinstance_readiness.go:165

Ran 240 of 804 Specs in 574.324 seconds
FAIL! -- 239 Passed | 1 Failed | 0 Pending | 564 Skipped 

Ginkgo ran 1 suite in 9m44.107020466s
Test Suite Failed
[INFO] Running serial tests
I1031 00:17:32.800811   18412 test.go:94] Extended test version v3.7.0-rc.0+c4d53a2-46
Oct 31 00:17:35.682: INFO: Overriding default scale value of zero to 1
Oct 31 00:17:35.682: INFO: Overriding default milliseconds value of zero to 5000
I1031 00:17:35.855207   20070 test.go:94] Extended test version v3.7.0-rc.0+c4d53a2-46
Running Suite: Extended
=======================
Random Seed: 1509409055 - Will randomize all specs
Will run 5 of 804 specs

Oct 31 00:17:36.127: INFO: Fetching cloud provider for "gce"

I1031 00:17:36.127824   20070 gce.go:459] Using DefaultTokenSource &oauth2.reuseTokenSource{new:jwt.jwtSource{ctx:(*context.emptyCtx)(0xc420016ed0), conf:(*jwt.Config)(0xc421925180)}, mu:sync.Mutex{state:0, sema:0x0}, t:(*oauth2.Token)(nil)}
I1031 00:17:36.210459   20070 gce.go:459] Using DefaultTokenSource &oauth2.reuseTokenSource{new:jwt.jwtSource{ctx:(*context.emptyCtx)(0xc420016ed0), conf:(*jwt.Config)(0xc421925d80)}, mu:sync.Mutex{state:0, sema:0x0}, t:(*oauth2.Token)(nil)}
Oct 31 00:17:36.480: INFO: lookupDiskImageSources: gcloud error with [[]string{"instance-groups", "list-instances", "", "--format=get(instance)"}]; err:exec: "gcloud": executable file not found in $PATH
Oct 31 00:17:36.480: INFO:  > 
Oct 31 00:17:36.480: INFO: Cluster image sources lookup failed: exec: "gcloud": executable file not found in $PATH

Oct 31 00:17:36.480: INFO: >>> kubeConfig: /tmp/cluster-admin.kubeconfig
Oct 31 00:17:36.482: INFO: Waiting up to 4h0m0s for all (but 0) nodes to be schedulable
Oct 31 00:17:36.562: INFO: Waiting up to 10m0s for all pods (need at least 0) in namespace 'kube-system' to be running and ready
Oct 31 00:17:36.610: INFO: 1 / 1 pods in namespace 'kube-system' are running and ready (0 seconds elapsed)
Oct 31 00:17:36.610: INFO: expected 0 pod replicas in namespace 'kube-system', 0 are Running and Ready.
Oct 31 00:17:36.626: INFO: Waiting for pods to enter Success, but no pods in "kube-system" match label map[name:e2e-image-puller]
Oct 31 00:17:36.626: INFO: Dumping network health container logs from all nodes...
SSSSSSSSSSSSSSSSSSSSSSSSSSSSSSSSSSSSSSSSSSSSSSSSSSSSSSSSSSSSSSSSSSSSSS
------------------------------
[k8s.io] SchedulerPredicates [Serial] 
  validates that NodeSelector is respected if not matching [Conformance] [Suite:openshift/conformance/serial] [Suite:k8s]
  /go/src/github.com/openshift/origin/vendor/k8s.io/kubernetes/test/e2e/scheduling/predicates.go:242
[BeforeEach] [Top Level]
  /go/src/github.com/openshift/origin/test/extended/util/test.go:53
[BeforeEach] [k8s.io] SchedulerPredicates [Serial]
  /go/src/github.com/openshift/origin/vendor/k8s.io/kubernetes/test/e2e/framework/framework.go:130
STEP: Creating a kubernetes client
Oct 31 00:17:36.642: INFO: >>> kubeConfig: /tmp/cluster-admin.kubeconfig
STEP: Building a namespace api object
Oct 31 00:17:36.770: INFO: About to run a Kube e2e test, ensuring namespace is privileged
STEP: Waiting for a default service account to be provisioned in namespace
[BeforeEach] [k8s.io] SchedulerPredicates [Serial]
  /go/src/github.com/openshift/origin/vendor/k8s.io/kubernetes/test/e2e/scheduling/predicates.go:109
Oct 31 00:17:36.954: INFO: Waiting up to 1m0s for all (but 0) nodes to be ready
Oct 31 00:17:36.987: INFO: Waiting for terminating namespaces to be deleted...
Oct 31 00:17:37.018: INFO: 
Logging pods the kubelet thinks is on node ci-primg540-ig-m-gdck before test
Oct 31 00:17:37.050: INFO: router-1-hb8mq from default started at 2017-10-30 23:53:52 +0000 UTC (1 container statuses recorded)
Oct 31 00:17:37.050: INFO: 	Container router ready: true, restart count 0
Oct 31 00:17:37.050: INFO: docker-registry-1-zc4xc from default started at 2017-10-30 23:55:01 +0000 UTC (1 container statuses recorded)
Oct 31 00:17:37.050: INFO: 	Container registry ready: true, restart count 0
Oct 31 00:17:37.050: INFO: 
Logging pods the kubelet thinks is on node ci-primg540-ig-n-h8q0 before test
Oct 31 00:17:37.082: INFO: registry-console-1-jv7rh from default started at 2017-10-30 23:56:04 +0000 UTC (1 container statuses recorded)
Oct 31 00:17:37.082: INFO: 	Container registry-console ready: true, restart count 0
Oct 31 00:17:37.082: INFO: 
Logging pods the kubelet thinks is on node ci-primg540-ig-n-jq8k before test
Oct 31 00:17:37.113: INFO: 
Logging pods the kubelet thinks is on node ci-primg540-ig-n-qlb9 before test
Oct 31 00:17:37.145: INFO: prometheus-0 from kube-system started at 2017-10-31 00:12:53 +0000 UTC (5 container statuses recorded)
Oct 31 00:17:37.145: INFO: 	Container alert-buffer ready: true, restart count 0
Oct 31 00:17:37.146: INFO: 	Container alertmanager ready: true, restart count 0
Oct 31 00:17:37.146: INFO: 	Container alerts-proxy ready: true, restart count 0
Oct 31 00:17:37.146: INFO: 	Container prom-proxy ready: true, restart count 0
Oct 31 00:17:37.146: INFO: 	Container prometheus ready: true, restart count 0
[It] validates that NodeSelector is respected if not matching [Conformance] [Suite:openshift/conformance/serial] [Suite:k8s]
  /go/src/github.com/openshift/origin/vendor/k8s.io/kubernetes/test/e2e/scheduling/predicates.go:242
STEP: Trying to schedule Pod with nonempty NodeSelector.
I1031 00:17:37.162530   20070 reflector.go:213] Starting reflector *v1.Event (0s) from github.com/openshift/origin/vendor/k8s.io/kubernetes/test/e2e/common/events.go:135
I1031 00:17:37.162588   20070 reflector.go:251] Listing and watching *v1.Event from github.com/openshift/origin/vendor/k8s.io/kubernetes/test/e2e/common/events.go:135
STEP: Considering event: 
Type = [Warning], Name = [restricted-pod.14f27f8a546d2ee8], Reason = [FailedScheduling], Message = [0/4 nodes are available: 4 MatchNodeSelector.]
[AfterEach] [k8s.io] SchedulerPredicates [Serial]
  /go/src/github.com/openshift/origin/vendor/k8s.io/kubernetes/test/e2e/framework/framework.go:131
Oct 31 00:17:38.244: INFO: Waiting up to 3m0s for all (but 0) nodes to be ready
STEP: Destroying namespace "e2e-tests-sched-pred-4fcx9" for this suite.
Oct 31 00:18:01.333: INFO: namespace: e2e-tests-sched-pred-4fcx9, resource: bindings, ignored listing per whitelist
Oct 31 00:18:01.635: INFO: namespace e2e-tests-sched-pred-4fcx9 deletion completed in 23.360957191s
[AfterEach] [k8s.io] SchedulerPredicates [Serial]
  /go/src/github.com/openshift/origin/vendor/k8s.io/kubernetes/test/e2e/scheduling/predicates.go:73
I1031 00:18:01.635987   20070 request.go:785] Error in request: resource name may not be empty

• [SLOW TEST:24.994 seconds]
[k8s.io] SchedulerPredicates [Serial]
/go/src/github.com/openshift/origin/vendor/k8s.io/kubernetes/test/e2e/framework/framework.go:620
  validates that NodeSelector is respected if not matching [Conformance] [Suite:openshift/conformance/serial] [Suite:k8s]
  /go/src/github.com/openshift/origin/vendor/k8s.io/kubernetes/test/e2e/scheduling/predicates.go:242
------------------------------
SSSSSSSSSSSSSSSSSSSSSSSSSSSSSSSSSSSSSSSSSSSSSSSSSSSSSSSSSSSSSSSSSSSSSSSSSSSSSSSSSSSSSSSSSSSSSSSSSSSSSSSSSSSSSSSSSSSSSSSSSSSSSSSSSSSSSSSSSSSSSSSSSSSSSSSSSSSSSSSSSSSSSSSSSSSSSSSSSSSSSSSSSS
------------------------------
[k8s.io] Service endpoints latency 
  should not be very high [Conformance] [Serial] [Suite:openshift/conformance/serial] [Suite:k8s]
  /go/src/github.com/openshift/origin/vendor/k8s.io/kubernetes/test/e2e/service_latency.go:117
[BeforeEach] [Top Level]
  /go/src/github.com/openshift/origin/test/extended/util/test.go:53
[BeforeEach] [k8s.io] Service endpoints latency
  /go/src/github.com/openshift/origin/vendor/k8s.io/kubernetes/test/e2e/framework/framework.go:130
STEP: Creating a kubernetes client
Oct 31 00:18:01.639: INFO: >>> kubeConfig: /tmp/cluster-admin.kubeconfig
STEP: Building a namespace api object
Oct 31 00:18:01.719: INFO: About to run a Kube e2e test, ensuring namespace is privileged
STEP: Waiting for a default service account to be provisioned in namespace
[It] should not be very high [Conformance] [Serial] [Suite:openshift/conformance/serial] [Suite:k8s]
  /go/src/github.com/openshift/origin/vendor/k8s.io/kubernetes/test/e2e/service_latency.go:117
STEP: creating replication controller svc-latency-rc in namespace e2e-tests-svc-latency-2j9j5
I1031 00:18:01.969694   20070 runners.go:176] Created replication controller with name: svc-latency-rc, namespace: e2e-tests-svc-latency-2j9j5, replica count: 1
I1031 00:18:01.969754   20070 reflector.go:213] Starting reflector *v1.Pod (0s) from github.com/openshift/origin/vendor/k8s.io/kubernetes/test/utils/pod_store.go:53
I1031 00:18:01.969796   20070 reflector.go:251] Listing and watching *v1.Pod from github.com/openshift/origin/vendor/k8s.io/kubernetes/test/utils/pod_store.go:53
I1031 00:18:02.970001   20070 runners.go:176] svc-latency-rc Pods: 1 out of 1 created, 0 running, 1 pending, 0 waiting, 0 inactive, 0 terminating, 0 unknown, 0 runningButNotReady 
I1031 00:18:03.970242   20070 runners.go:176] svc-latency-rc Pods: 1 out of 1 created, 1 running, 0 pending, 0 waiting, 0 inactive, 0 terminating, 0 unknown, 0 runningButNotReady 
I1031 00:18:03.970523   20070 reflector.go:213] Starting reflector *v1.Endpoints (0s) from github.com/openshift/origin/vendor/k8s.io/kubernetes/test/e2e/service_latency.go:310
I1031 00:18:03.970548   20070 reflector.go:251] Listing and watching *v1.Endpoints from github.com/openshift/origin/vendor/k8s.io/kubernetes/test/e2e/service_latency.go:310
Oct 31 00:18:04.091: INFO: Created: latency-svc-hc6zj
Oct 31 00:18:04.114: INFO: Got endpoints: latency-svc-hc6zj [43.961371ms]
Oct 31 00:18:04.136: INFO: Created: latency-svc-s2f9v
Oct 31 00:18:04.152: INFO: Created: latency-svc-npl9b
Oct 31 00:18:04.185: INFO: Got endpoints: latency-svc-s2f9v [71.030576ms]
Oct 31 00:18:04.191: INFO: Created: latency-svc-j9w24
Oct 31 00:18:04.191: INFO: Got endpoints: latency-svc-j9w24 [76.687623ms]
Oct 31 00:18:04.196: INFO: Created: latency-svc-5hs2d
Oct 31 00:18:04.196: INFO: Got endpoints: latency-svc-npl9b [81.916954ms]
Oct 31 00:18:04.209: INFO: Created: latency-svc-k47pf
Oct 31 00:18:04.214: INFO: Created: latency-svc-vdztq
Oct 31 00:18:04.216: INFO: Got endpoints: latency-svc-5hs2d [101.989387ms]
Oct 31 00:18:04.219: INFO: Created: latency-svc-ttrcl
Oct 31 00:18:04.220: INFO: Got endpoints: latency-svc-vdztq [105.667029ms]
Oct 31 00:18:04.226: INFO: Got endpoints: latency-svc-k47pf [111.769865ms]
Oct 31 00:18:04.232: INFO: Created: latency-svc-56qf2
Oct 31 00:18:04.232: INFO: Got endpoints: latency-svc-ttrcl [117.833635ms]
Oct 31 00:18:04.234: INFO: Created: latency-svc-xpcdl
Oct 31 00:18:04.237: INFO: Created: latency-svc-n67l7
Oct 31 00:18:04.249: INFO: Got endpoints: latency-svc-xpcdl [135.021092ms]
Oct 31 00:18:04.249: INFO: Got endpoints: latency-svc-n67l7 [135.007462ms]
Oct 31 00:18:04.249: INFO: Got endpoints: latency-svc-56qf2 [135.026902ms]
Oct 31 00:18:04.250: INFO: Created: latency-svc-h79w2
Oct 31 00:18:04.252: INFO: Created: latency-svc-mhbl6
Oct 31 00:18:04.258: INFO: Created: latency-svc-mqfnv
Oct 31 00:18:04.260: INFO: Got endpoints: latency-svc-mhbl6 [146.145191ms]
Oct 31 00:18:04.261: INFO: Got endpoints: latency-svc-h79w2 [146.263978ms]
Oct 31 00:18:04.263: INFO: Created: latency-svc-fcz7g
Oct 31 00:18:04.264: INFO: Got endpoints: latency-svc-mqfnv [149.346669ms]
Oct 31 00:18:04.271: INFO: Got endpoints: latency-svc-fcz7g [156.754809ms]
Oct 31 00:18:04.275: INFO: Created: latency-svc-24gmb
Oct 31 00:18:04.279: INFO: Got endpoints: latency-svc-24gmb [164.702191ms]
Oct 31 00:18:04.282: INFO: Created: latency-svc-4md8p
Oct 31 00:18:04.284: INFO: Got endpoints: latency-svc-4md8p [98.704295ms]
Oct 31 00:18:04.286: INFO: Created: latency-svc-w4m85
Oct 31 00:18:04.291: INFO: Got endpoints: latency-svc-w4m85 [100.03186ms]
Oct 31 00:18:04.294: INFO: Created: latency-svc-hncf2
Oct 31 00:18:04.306: INFO: Got endpoints: latency-svc-hncf2 [109.934119ms]
Oct 31 00:18:04.307: INFO: Created: latency-svc-gwjpb
Oct 31 00:18:04.319: INFO: Created: latency-svc-xpzhf
Oct 31 00:18:04.319: INFO: Created: latency-svc-jjmtt
Oct 31 00:18:04.319: INFO: Got endpoints: latency-svc-gwjpb [103.092876ms]
Oct 31 00:18:04.323: INFO: Got endpoints: latency-svc-xpzhf [102.741109ms]
Oct 31 00:18:04.328: INFO: Got endpoints: latency-svc-jjmtt [101.979186ms]
Oct 31 00:18:04.331: INFO: Created: latency-svc-j7xdk
Oct 31 00:18:04.334: INFO: Created: latency-svc-4hcmr
Oct 31 00:18:04.339: INFO: Got endpoints: latency-svc-4hcmr [90.181853ms]
Oct 31 00:18:04.340: INFO: Got endpoints: latency-svc-j7xdk [107.556157ms]
Oct 31 00:18:04.340: INFO: Created: latency-svc-g7rwz
Oct 31 00:18:04.352: INFO: Created: latency-svc-79bkw
Oct 31 00:18:04.352: INFO: Got endpoints: latency-svc-g7rwz [102.34615ms]
Oct 31 00:18:04.358: INFO: Got endpoints: latency-svc-79bkw [109.085093ms]
Oct 31 00:18:04.361: INFO: Created: latency-svc-pxw9d
Oct 31 00:18:04.368: INFO: Created: latency-svc-vk4gv
Oct 31 00:18:04.368: INFO: Created: latency-svc-69srm
Oct 31 00:18:04.374: INFO: Created: latency-svc-f7pzh
Oct 31 00:18:04.380: INFO: Got endpoints: latency-svc-pxw9d [119.153945ms]
Oct 31 00:18:04.380: INFO: Got endpoints: latency-svc-69srm [119.406909ms]
Oct 31 00:18:04.384: INFO: Created: latency-svc-67nvj
Oct 31 00:18:04.388: INFO: Created: latency-svc-hfj6q
Oct 31 00:18:04.396: INFO: Got endpoints: latency-svc-67nvj [116.757012ms]
Oct 31 00:18:04.396: INFO: Got endpoints: latency-svc-f7pzh [124.631594ms]
Oct 31 00:18:04.396: INFO: Got endpoints: latency-svc-vk4gv [132.05018ms]
Oct 31 00:18:04.400: INFO: Created: latency-svc-nn5cz
Oct 31 00:18:04.403: INFO: Got endpoints: latency-svc-nn5cz [111.789991ms]
Oct 31 00:18:04.403: INFO: Got endpoints: latency-svc-hfj6q [118.859165ms]
Oct 31 00:18:04.410: INFO: Created: latency-svc-zmj99
Oct 31 00:18:04.412: INFO: Created: latency-svc-pgfv8
Oct 31 00:18:04.417: INFO: Created: latency-svc-hbh4f
Oct 31 00:18:04.421: INFO: Created: latency-svc-fznsn
Oct 31 00:18:04.426: INFO: Got endpoints: latency-svc-zmj99 [106.389579ms]
Oct 31 00:18:04.426: INFO: Got endpoints: latency-svc-hbh4f [102.987262ms]
Oct 31 00:18:04.426: INFO: Got endpoints: latency-svc-pgfv8 [119.663972ms]
Oct 31 00:18:04.433: INFO: Got endpoints: latency-svc-fznsn [104.97065ms]
Oct 31 00:18:04.434: INFO: Created: latency-svc-vnqzx
Oct 31 00:18:04.435: INFO: Created: latency-svc-h5fng
Oct 31 00:18:04.440: INFO: Created: latency-svc-pjvpv
Oct 31 00:18:04.445: INFO: Created: latency-svc-2rf24
Oct 31 00:18:04.454: INFO: Created: latency-svc-xsbh2
Oct 31 00:18:04.456: INFO: Created: latency-svc-448x9
Oct 31 00:18:04.461: INFO: Got endpoints: latency-svc-vnqzx [121.205779ms]
Oct 31 00:18:04.462: INFO: Created: latency-svc-84bn5
Oct 31 00:18:04.468: INFO: Created: latency-svc-kzh4l
Oct 31 00:18:04.472: INFO: Created: latency-svc-vbl6c
Oct 31 00:18:04.475: INFO: Created: latency-svc-kpssd
Oct 31 00:18:04.481: INFO: Created: latency-svc-hkgg7
Oct 31 00:18:04.486: INFO: Created: latency-svc-sg488
Oct 31 00:18:04.492: INFO: Created: latency-svc-295c9
Oct 31 00:18:04.500: INFO: Created: latency-svc-7gl7p
Oct 31 00:18:04.501: INFO: Created: latency-svc-dtmq4
Oct 31 00:18:04.505: INFO: Created: latency-svc-97nrc
Oct 31 00:18:04.510: INFO: Got endpoints: latency-svc-h5fng [170.311058ms]
Oct 31 00:18:04.533: INFO: Created: latency-svc-27pqp
Oct 31 00:18:04.560: INFO: Got endpoints: latency-svc-pjvpv [208.123016ms]
Oct 31 00:18:04.580: INFO: Created: latency-svc-b2r6h
Oct 31 00:18:04.610: INFO: Got endpoints: latency-svc-2rf24 [251.457542ms]
Oct 31 00:18:04.630: INFO: Created: latency-svc-z5l9g
Oct 31 00:18:04.660: INFO: Got endpoints: latency-svc-xsbh2 [280.107833ms]
Oct 31 00:18:04.681: INFO: Created: latency-svc-mx9hv
Oct 31 00:18:04.710: INFO: Got endpoints: latency-svc-448x9 [329.841415ms]
Oct 31 00:18:04.730: INFO: Created: latency-svc-9jn7w
Oct 31 00:18:04.760: INFO: Got endpoints: latency-svc-84bn5 [363.947283ms]
Oct 31 00:18:04.778: INFO: Created: latency-svc-fpscb
Oct 31 00:18:04.810: INFO: Got endpoints: latency-svc-kzh4l [413.732888ms]
Oct 31 00:18:04.828: INFO: Created: latency-svc-24lxf
Oct 31 00:18:04.860: INFO: Got endpoints: latency-svc-vbl6c [463.783574ms]
Oct 31 00:18:04.880: INFO: Created: latency-svc-hntc4
Oct 31 00:18:04.910: INFO: Got endpoints: latency-svc-kpssd [507.215431ms]
Oct 31 00:18:04.930: INFO: Created: latency-svc-wnccs
Oct 31 00:18:04.959: INFO: Got endpoints: latency-svc-hkgg7 [556.684431ms]
Oct 31 00:18:04.980: INFO: Created: latency-svc-q586h
Oct 31 00:18:05.010: INFO: Got endpoints: latency-svc-sg488 [584.072431ms]
Oct 31 00:18:05.030: INFO: Created: latency-svc-thkhl
Oct 31 00:18:05.060: INFO: Got endpoints: latency-svc-295c9 [634.468754ms]
Oct 31 00:18:05.081: INFO: Created: latency-svc-2pbcb
Oct 31 00:18:05.109: INFO: Got endpoints: latency-svc-7gl7p [683.489765ms]
Oct 31 00:18:05.130: INFO: Created: latency-svc-8zztr
Oct 31 00:18:05.160: INFO: Got endpoints: latency-svc-dtmq4 [726.834388ms]
Oct 31 00:18:05.178: INFO: Created: latency-svc-cf62q
Oct 31 00:18:05.210: INFO: Got endpoints: latency-svc-97nrc [749.46529ms]
Oct 31 00:18:05.230: INFO: Created: latency-svc-plz22
Oct 31 00:18:05.259: INFO: Got endpoints: latency-svc-27pqp [749.077853ms]
Oct 31 00:18:05.279: INFO: Created: latency-svc-pntk8
Oct 31 00:18:05.310: INFO: Got endpoints: latency-svc-b2r6h [749.684232ms]
Oct 31 00:18:05.329: INFO: Created: latency-svc-p9hc6
Oct 31 00:18:05.361: INFO: Got endpoints: latency-svc-z5l9g [750.778341ms]
Oct 31 00:18:05.381: INFO: Created: latency-svc-vw8hr
Oct 31 00:18:05.410: INFO: Got endpoints: latency-svc-mx9hv [750.063506ms]
Oct 31 00:18:05.430: INFO: Created: latency-svc-z48vj
Oct 31 00:18:05.469: INFO: Got endpoints: latency-svc-9jn7w [759.146846ms]
Oct 31 00:18:05.491: INFO: Created: latency-svc-pkqtz
Oct 31 00:18:05.510: INFO: Got endpoints: latency-svc-fpscb [750.477758ms]
Oct 31 00:18:05.531: INFO: Created: latency-svc-v447p
Oct 31 00:18:05.560: INFO: Got endpoints: latency-svc-24lxf [750.275804ms]
Oct 31 00:18:05.580: INFO: Created: latency-svc-xzprn
Oct 31 00:18:05.611: INFO: Got endpoints: latency-svc-hntc4 [751.727411ms]
Oct 31 00:18:05.631: INFO: Created: latency-svc-bzgq2
Oct 31 00:18:05.661: INFO: Got endpoints: latency-svc-wnccs [750.602739ms]
Oct 31 00:18:05.681: INFO: Created: latency-svc-758q6
Oct 31 00:18:05.711: INFO: Got endpoints: latency-svc-q586h [751.246866ms]
Oct 31 00:18:05.731: INFO: Created: latency-svc-ckn92
Oct 31 00:18:05.760: INFO: Got endpoints: latency-svc-thkhl [750.686199ms]
Oct 31 00:18:05.781: INFO: Created: latency-svc-tfvsl
Oct 31 00:18:05.809: INFO: Got endpoints: latency-svc-2pbcb [748.7635ms]
Oct 31 00:18:05.827: INFO: Created: latency-svc-fvjpj
Oct 31 00:18:05.860: INFO: Got endpoints: latency-svc-8zztr [750.876906ms]
Oct 31 00:18:05.879: INFO: Created: latency-svc-79xhj
Oct 31 00:18:05.910: INFO: Got endpoints: latency-svc-cf62q [749.786068ms]
Oct 31 00:18:05.931: INFO: Created: latency-svc-z5752
Oct 31 00:18:05.960: INFO: Got endpoints: latency-svc-plz22 [749.269576ms]
Oct 31 00:18:05.982: INFO: Created: latency-svc-q5tk4
Oct 31 00:18:06.009: INFO: Got endpoints: latency-svc-pntk8 [750.021011ms]
Oct 31 00:18:06.028: INFO: Created: latency-svc-jspp4
Oct 31 00:18:06.060: INFO: Got endpoints: latency-svc-p9hc6 [750.396348ms]
Oct 31 00:18:06.085: INFO: Created: latency-svc-bt7qx
Oct 31 00:18:06.112: INFO: Got endpoints: latency-svc-vw8hr [750.75238ms]
Oct 31 00:18:06.135: INFO: Created: latency-svc-6d8g8
Oct 31 00:18:06.160: INFO: Got endpoints: latency-svc-z48vj [750.165478ms]
Oct 31 00:18:06.180: INFO: Created: latency-svc-gb7xg
Oct 31 00:18:06.210: INFO: Got endpoints: latency-svc-pkqtz [740.694242ms]
Oct 31 00:18:06.229: INFO: Created: latency-svc-k84rj
Oct 31 00:18:06.260: INFO: Got endpoints: latency-svc-v447p [750.152724ms]
Oct 31 00:18:06.281: INFO: Created: latency-svc-msln9
Oct 31 00:18:06.311: INFO: Got endpoints: latency-svc-xzprn [750.938138ms]
Oct 31 00:18:06.330: INFO: Created: latency-svc-pbjxs
Oct 31 00:18:06.361: INFO: Got endpoints: latency-svc-bzgq2 [749.881153ms]
Oct 31 00:18:06.384: INFO: Created: latency-svc-fmf6z
Oct 31 00:18:06.411: INFO: Got endpoints: latency-svc-758q6 [750.44595ms]
Oct 31 00:18:06.433: INFO: Created: latency-svc-zhqg4
Oct 31 00:18:06.460: INFO: Got endpoints: latency-svc-ckn92 [749.43622ms]
Oct 31 00:18:06.486: INFO: Created: latency-svc-v7ftw
Oct 31 00:18:06.511: INFO: Got endpoints: latency-svc-tfvsl [750.387723ms]
Oct 31 00:18:06.532: INFO: Created: latency-svc-r7r99
Oct 31 00:18:06.563: INFO: Got endpoints: latency-svc-fvjpj [754.36312ms]
Oct 31 00:18:06.585: INFO: Created: latency-svc-rd427
Oct 31 00:18:06.611: INFO: Got endpoints: latency-svc-79xhj [751.178333ms]
Oct 31 00:18:06.634: INFO: Created: latency-svc-t2kpx
Oct 31 00:18:06.661: INFO: Got endpoints: latency-svc-z5752 [751.567868ms]
Oct 31 00:18:06.683: INFO: Created: latency-svc-nqx66
Oct 31 00:18:06.711: INFO: Got endpoints: latency-svc-q5tk4 [751.695114ms]
Oct 31 00:18:06.733: INFO: Created: latency-svc-2n6rz
Oct 31 00:18:06.759: INFO: Got endpoints: latency-svc-jspp4 [750.278315ms]
Oct 31 00:18:06.780: INFO: Created: latency-svc-llmgs
Oct 31 00:18:06.811: INFO: Got endpoints: latency-svc-bt7qx [750.820294ms]
Oct 31 00:18:06.831: INFO: Created: latency-svc-kl4wp
Oct 31 00:18:06.860: INFO: Got endpoints: latency-svc-6d8g8 [748.821336ms]
Oct 31 00:18:06.884: INFO: Created: latency-svc-s7gpr
Oct 31 00:18:06.911: INFO: Got endpoints: latency-svc-gb7xg [750.477736ms]
Oct 31 00:18:06.931: INFO: Created: latency-svc-j5vwt
Oct 31 00:18:06.961: INFO: Got endpoints: latency-svc-k84rj [751.571727ms]
Oct 31 00:18:06.982: INFO: Created: latency-svc-bgbqr
Oct 31 00:18:07.010: INFO: Got endpoints: latency-svc-msln9 [749.972808ms]
Oct 31 00:18:07.030: INFO: Created: latency-svc-h5r5f
Oct 31 00:18:07.061: INFO: Got endpoints: latency-svc-pbjxs [750.131168ms]
Oct 31 00:18:07.084: INFO: Created: latency-svc-vcl4x
Oct 31 00:18:07.110: INFO: Got endpoints: latency-svc-fmf6z [748.878552ms]
Oct 31 00:18:07.132: INFO: Created: latency-svc-v96fp
Oct 31 00:18:07.160: INFO: Got endpoints: latency-svc-zhqg4 [749.343722ms]
Oct 31 00:18:07.180: INFO: Created: latency-svc-58828
Oct 31 00:18:07.211: INFO: Got endpoints: latency-svc-v7ftw [750.42569ms]
Oct 31 00:18:07.230: INFO: Created: latency-svc-sns5g
Oct 31 00:18:07.261: INFO: Got endpoints: latency-svc-r7r99 [750.319524ms]
Oct 31 00:18:07.284: INFO: Created: latency-svc-gsjfl
Oct 31 00:18:07.311: INFO: Got endpoints: latency-svc-rd427 [747.27637ms]
Oct 31 00:18:07.333: INFO: Created: latency-svc-z7ddn
Oct 31 00:18:07.360: INFO: Got endpoints: latency-svc-t2kpx [748.69327ms]
Oct 31 00:18:07.382: INFO: Created: latency-svc-845w9
Oct 31 00:18:07.410: INFO: Got endpoints: latency-svc-nqx66 [749.011933ms]
Oct 31 00:18:07.433: INFO: Created: latency-svc-tpvf9
Oct 31 00:18:07.462: INFO: Got endpoints: latency-svc-2n6rz [750.260367ms]
Oct 31 00:18:07.483: INFO: Created: latency-svc-sfln8
Oct 31 00:18:07.511: INFO: Got endpoints: latency-svc-llmgs [751.306515ms]
Oct 31 00:18:07.533: INFO: Created: latency-svc-8xqsh
Oct 31 00:18:07.561: INFO: Got endpoints: latency-svc-kl4wp [749.686424ms]
Oct 31 00:18:07.581: INFO: Created: latency-svc-wbrqq
Oct 31 00:18:07.610: INFO: Got endpoints: latency-svc-s7gpr [749.861284ms]
Oct 31 00:18:07.634: INFO: Created: latency-svc-4knxs
Oct 31 00:18:07.661: INFO: Got endpoints: latency-svc-j5vwt [749.794451ms]
Oct 31 00:18:07.682: INFO: Created: latency-svc-8zkgx
Oct 31 00:18:07.710: INFO: Got endpoints: latency-svc-bgbqr [749.098782ms]
Oct 31 00:18:07.736: INFO: Created: latency-svc-b4z7l
Oct 31 00:18:07.763: INFO: Got endpoints: latency-svc-h5r5f [752.64316ms]
Oct 31 00:18:07.782: INFO: Created: latency-svc-zlwft
Oct 31 00:18:07.811: INFO: Got endpoints: latency-svc-vcl4x [749.693165ms]
Oct 31 00:18:07.832: INFO: Created: latency-svc-bwd7z
Oct 31 00:18:07.861: INFO: Got endpoints: latency-svc-v96fp [750.392521ms]
Oct 31 00:18:07.880: INFO: Created: latency-svc-8m7kw
Oct 31 00:18:07.909: INFO: Got endpoints: latency-svc-58828 [748.896684ms]
Oct 31 00:18:07.933: INFO: Created: latency-svc-4csgt
Oct 31 00:18:07.960: INFO: Got endpoints: latency-svc-sns5g [749.796269ms]
Oct 31 00:18:07.981: INFO: Created: latency-svc-85jjv
Oct 31 00:18:08.011: INFO: Got endpoints: latency-svc-gsjfl [750.101486ms]
Oct 31 00:18:08.032: INFO: Created: latency-svc-btzkt
Oct 31 00:18:08.061: INFO: Got endpoints: latency-svc-z7ddn [750.110337ms]
Oct 31 00:18:08.084: INFO: Created: latency-svc-t9rlt
Oct 31 00:18:08.111: INFO: Got endpoints: latency-svc-845w9 [750.869602ms]
Oct 31 00:18:08.132: INFO: Created: latency-svc-tmvtq
Oct 31 00:18:08.160: INFO: Got endpoints: latency-svc-tpvf9 [749.736483ms]
Oct 31 00:18:08.183: INFO: Created: latency-svc-bgd8h
Oct 31 00:18:08.212: INFO: Got endpoints: latency-svc-sfln8 [750.198934ms]
Oct 31 00:18:08.235: INFO: Created: latency-svc-jpsr2
Oct 31 00:18:08.262: INFO: Got endpoints: latency-svc-8xqsh [751.193268ms]
Oct 31 00:18:08.281: INFO: Created: latency-svc-4ggqk
Oct 31 00:18:08.310: INFO: Got endpoints: latency-svc-wbrqq [749.615005ms]
Oct 31 00:18:08.329: INFO: Created: latency-svc-65rqk
Oct 31 00:18:08.360: INFO: Got endpoints: latency-svc-4knxs [750.167116ms]
Oct 31 00:18:08.380: INFO: Created: latency-svc-rszs2
Oct 31 00:18:08.412: INFO: Got endpoints: latency-svc-8zkgx [750.925738ms]
Oct 31 00:18:08.433: INFO: Created: latency-svc-zn77s
Oct 31 00:18:08.461: INFO: Got endpoints: latency-svc-b4z7l [750.336502ms]
Oct 31 00:18:08.483: INFO: Created: latency-svc-49c4d
Oct 31 00:18:08.510: INFO: Got endpoints: latency-svc-zlwft [747.128059ms]
Oct 31 00:18:08.531: INFO: Created: latency-svc-hp85s
Oct 31 00:18:08.561: INFO: Got endpoints: latency-svc-bwd7z [750.488611ms]
Oct 31 00:18:08.585: INFO: Created: latency-svc-2gwqq
Oct 31 00:18:08.611: INFO: Got endpoints: latency-svc-8m7kw [750.190904ms]
Oct 31 00:18:08.634: INFO: Created: latency-svc-4n647
Oct 31 00:18:08.660: INFO: Got endpoints: latency-svc-4csgt [750.986118ms]
Oct 31 00:18:08.683: INFO: Created: latency-svc-gxwrn
Oct 31 00:18:08.711: INFO: Got endpoints: latency-svc-85jjv [750.363386ms]
Oct 31 00:18:08.730: INFO: Created: latency-svc-g9sbb
Oct 31 00:18:08.762: INFO: Got endpoints: latency-svc-btzkt [750.357763ms]
Oct 31 00:18:08.782: INFO: Created: latency-svc-w9bnw
Oct 31 00:18:08.810: INFO: Got endpoints: latency-svc-t9rlt [749.307842ms]
Oct 31 00:18:08.832: INFO: Created: latency-svc-d6q2w
Oct 31 00:18:08.861: INFO: Got endpoints: latency-svc-tmvtq [749.765424ms]
Oct 31 00:18:08.883: INFO: Created: latency-svc-nxspr
Oct 31 00:18:08.910: INFO: Got endpoints: latency-svc-bgd8h [749.547759ms]
Oct 31 00:18:08.930: INFO: Created: latency-svc-q2d2f
Oct 31 00:18:08.963: INFO: Got endpoints: latency-svc-jpsr2 [751.427743ms]
Oct 31 00:18:08.987: INFO: Created: latency-svc-fttd4
Oct 31 00:18:09.010: INFO: Got endpoints: latency-svc-4ggqk [748.253111ms]
Oct 31 00:18:09.032: INFO: Created: latency-svc-zdv6q
Oct 31 00:18:09.060: INFO: Got endpoints: latency-svc-65rqk [749.723712ms]
Oct 31 00:18:09.083: INFO: Created: latency-svc-bx4vc
Oct 31 00:18:09.111: INFO: Got endpoints: latency-svc-rszs2 [750.092125ms]
Oct 31 00:18:09.131: INFO: Created: latency-svc-8nhlt
Oct 31 00:18:09.160: INFO: Got endpoints: latency-svc-zn77s [748.566204ms]
Oct 31 00:18:09.182: INFO: Created: latency-svc-fzxpl
Oct 31 00:18:09.211: INFO: Got endpoints: latency-svc-49c4d [750.44694ms]
Oct 31 00:18:09.234: INFO: Created: latency-svc-4bk9p
Oct 31 00:18:09.261: INFO: Got endpoints: latency-svc-hp85s [750.876214ms]
Oct 31 00:18:09.280: INFO: Created: latency-svc-wmztd
Oct 31 00:18:09.310: INFO: Got endpoints: latency-svc-2gwqq [749.194574ms]
Oct 31 00:18:09.333: INFO: Created: latency-svc-t6ktl
Oct 31 00:18:09.361: INFO: Got endpoints: latency-svc-4n647 [749.693209ms]
Oct 31 00:18:09.382: INFO: Created: latency-svc-svpsd
Oct 31 00:18:09.411: INFO: Got endpoints: latency-svc-gxwrn [750.675818ms]
Oct 31 00:18:09.431: INFO: Created: latency-svc-7b7s7
Oct 31 00:18:09.460: INFO: Got endpoints: latency-svc-g9sbb [749.199374ms]
Oct 31 00:18:09.481: INFO: Created: latency-svc-rr82d
Oct 31 00:18:09.511: INFO: Got endpoints: latency-svc-w9bnw [748.783977ms]
Oct 31 00:18:09.535: INFO: Created: latency-svc-f8ccj
Oct 31 00:18:09.562: INFO: Got endpoints: latency-svc-d6q2w [751.613457ms]
Oct 31 00:18:09.585: INFO: Created: latency-svc-klmwc
Oct 31 00:18:09.611: INFO: Got endpoints: latency-svc-nxspr [750.011695ms]
Oct 31 00:18:09.632: INFO: Created: latency-svc-vhddh
Oct 31 00:18:09.662: INFO: Got endpoints: latency-svc-q2d2f [752.438926ms]
Oct 31 00:18:09.684: INFO: Created: latency-svc-pmksz
Oct 31 00:18:09.712: INFO: Got endpoints: latency-svc-fttd4 [748.426569ms]
Oct 31 00:18:09.731: INFO: Created: latency-svc-vfmww
Oct 31 00:18:09.762: INFO: Got endpoints: latency-svc-zdv6q [751.594007ms]
Oct 31 00:18:09.782: INFO: Created: latency-svc-4j78k
Oct 31 00:18:09.811: INFO: Got endpoints: latency-svc-bx4vc [750.920903ms]
Oct 31 00:18:09.833: INFO: Created: latency-svc-666cg
Oct 31 00:18:09.860: INFO: Got endpoints: latency-svc-8nhlt [749.309963ms]
Oct 31 00:18:09.880: INFO: Created: latency-svc-9jqqz
Oct 31 00:18:09.911: INFO: Got endpoints: latency-svc-fzxpl [751.057351ms]
Oct 31 00:18:09.933: INFO: Created: latency-svc-k4wtt
Oct 31 00:18:09.961: INFO: Got endpoints: latency-svc-4bk9p [749.419244ms]
Oct 31 00:18:09.982: INFO: Created: latency-svc-7lj6x
Oct 31 00:18:10.013: INFO: Got endpoints: latency-svc-wmztd [751.557027ms]
Oct 31 00:18:10.034: INFO: Created: latency-svc-gvqld
Oct 31 00:18:10.060: INFO: Got endpoints: latency-svc-t6ktl [749.091516ms]
Oct 31 00:18:10.079: INFO: Created: latency-svc-dnzrp
Oct 31 00:18:10.111: INFO: Got endpoints: latency-svc-svpsd [750.715123ms]
Oct 31 00:18:10.132: INFO: Created: latency-svc-9twlg
Oct 31 00:18:10.161: INFO: Got endpoints: latency-svc-7b7s7 [750.164597ms]
Oct 31 00:18:10.183: INFO: Created: latency-svc-7xzr9
Oct 31 00:18:10.210: INFO: Got endpoints: latency-svc-rr82d [749.738786ms]
Oct 31 00:18:10.232: INFO: Created: latency-svc-dkj4f
Oct 31 00:18:10.261: INFO: Got endpoints: latency-svc-f8ccj [750.356522ms]
Oct 31 00:18:10.283: INFO: Created: latency-svc-968gt
Oct 31 00:18:10.311: INFO: Got endpoints: latency-svc-klmwc [748.864511ms]
Oct 31 00:18:10.333: INFO: Created: latency-svc-5qbk2
Oct 31 00:18:10.363: INFO: Got endpoints: latency-svc-vhddh [751.674058ms]
Oct 31 00:18:10.390: INFO: Created: latency-svc-sp9mm
Oct 31 00:18:10.410: INFO: Got endpoints: latency-svc-pmksz [748.035258ms]
Oct 31 00:18:10.430: INFO: Created: latency-svc-kzrxq
Oct 31 00:18:10.460: INFO: Got endpoints: latency-svc-vfmww [748.65173ms]
Oct 31 00:18:10.495: INFO: Created: latency-svc-frgf7
Oct 31 00:18:10.542: INFO: Got endpoints: latency-svc-4j78k [780.05988ms]
Oct 31 00:18:10.584: INFO: Got endpoints: latency-svc-666cg [772.730547ms]
Oct 31 00:18:10.591: INFO: Created: latency-svc-2d6gn
Oct 31 00:18:10.620: INFO: Created: latency-svc-2ts2x
Oct 31 00:18:10.623: INFO: Got endpoints: latency-svc-9jqqz [762.820146ms]
Oct 31 00:18:10.655: INFO: Created: latency-svc-rhj4j
Oct 31 00:18:10.666: INFO: Got endpoints: latency-svc-k4wtt [754.416978ms]
Oct 31 00:18:10.695: INFO: Created: latency-svc-6swd9
Oct 31 00:18:10.715: INFO: Got endpoints: latency-svc-7lj6x [754.11304ms]
Oct 31 00:18:10.744: INFO: Created: latency-svc-74c98
Oct 31 00:18:10.774: INFO: Got endpoints: latency-svc-gvqld [761.109667ms]
Oct 31 00:18:10.804: INFO: Created: latency-svc-fstxg
Oct 31 00:18:10.811: INFO: Got endpoints: latency-svc-dnzrp [751.629504ms]
Oct 31 00:18:10.838: INFO: Created: latency-svc-5g47q
Oct 31 00:18:10.864: INFO: Got endpoints: latency-svc-9twlg [752.684448ms]
Oct 31 00:18:10.905: INFO: Created: latency-svc-hfx5f
Oct 31 00:18:10.920: INFO: Got endpoints: latency-svc-7xzr9 [758.391679ms]
Oct 31 00:18:10.954: INFO: Created: latency-svc-8p7vq
Oct 31 00:18:10.975: INFO: Got endpoints: latency-svc-dkj4f [764.685361ms]
Oct 31 00:18:11.000: INFO: Created: latency-svc-5gzjc
Oct 31 00:18:11.011: INFO: Got endpoints: latency-svc-968gt [749.878632ms]
Oct 31 00:18:11.030: INFO: Created: latency-svc-5tw74
Oct 31 00:18:11.063: INFO: Got endpoints: latency-svc-5qbk2 [751.939041ms]
Oct 31 00:18:11.082: INFO: Created: latency-svc-fwbh8
Oct 31 00:18:11.112: INFO: Got endpoints: latency-svc-sp9mm [748.9991ms]
Oct 31 00:18:11.134: INFO: Created: latency-svc-nnsdw
Oct 31 00:18:11.162: INFO: Got endpoints: latency-svc-kzrxq [751.293622ms]
Oct 31 00:18:11.183: INFO: Created: latency-svc-8hcsd
Oct 31 00:18:11.210: INFO: Got endpoints: latency-svc-frgf7 [749.656001ms]
Oct 31 00:18:11.231: INFO: Created: latency-svc-fm9bf
Oct 31 00:18:11.261: INFO: Got endpoints: latency-svc-2d6gn [718.675575ms]
Oct 31 00:18:11.286: INFO: Created: latency-svc-w7vp6
Oct 31 00:18:11.311: INFO: Got endpoints: latency-svc-2ts2x [726.827763ms]
Oct 31 00:18:11.332: INFO: Created: latency-svc-fqsd4
Oct 31 00:18:11.361: INFO: Got endpoints: latency-svc-rhj4j [737.992328ms]
Oct 31 00:18:11.382: INFO: Created: latency-svc-qt8sh
Oct 31 00:18:11.413: INFO: Got endpoints: latency-svc-6swd9 [747.151357ms]
Oct 31 00:18:11.436: INFO: Created: latency-svc-7g6zm
Oct 31 00:18:11.460: INFO: Got endpoints: latency-svc-74c98 [745.098953ms]
Oct 31 00:18:11.482: INFO: Created: latency-svc-np97q
Oct 31 00:18:11.513: INFO: Got endpoints: latency-svc-fstxg [739.540546ms]
Oct 31 00:18:11.536: INFO: Created: latency-svc-csrrt
Oct 31 00:18:11.566: INFO: Got endpoints: latency-svc-5g47q [754.76149ms]
Oct 31 00:18:11.597: INFO: Created: latency-svc-gtsvv
Oct 31 00:18:11.614: INFO: Got endpoints: latency-svc-hfx5f [749.954526ms]
Oct 31 00:18:11.638: INFO: Created: latency-svc-qmddg
Oct 31 00:18:11.660: INFO: Got endpoints: latency-svc-8p7vq [740.619159ms]
Oct 31 00:18:11.683: INFO: Created: latency-svc-ckczj
Oct 31 00:18:11.711: INFO: Got endpoints: latency-svc-5gzjc [736.265425ms]
Oct 31 00:18:11.731: INFO: Created: latency-svc-c2tdd
Oct 31 00:18:11.761: INFO: Got endpoints: latency-svc-5tw74 [750.476192ms]
Oct 31 00:18:11.783: INFO: Created: latency-svc-dqrmx
Oct 31 00:18:11.810: INFO: Got endpoints: latency-svc-fwbh8 [747.637804ms]
Oct 31 00:18:11.832: INFO: Created: latency-svc-m9fj7
Oct 31 00:18:11.864: INFO: Got endpoints: latency-svc-nnsdw [752.344342ms]
Oct 31 00:18:11.886: INFO: Created: latency-svc-n6qf7
Oct 31 00:18:11.911: INFO: Got endpoints: latency-svc-8hcsd [749.122242ms]
Oct 31 00:18:11.960: INFO: Got endpoints: latency-svc-fm9bf [749.608408ms]
Oct 31 00:18:12.010: INFO: Got endpoints: latency-svc-w7vp6 [749.005792ms]
Oct 31 00:18:12.060: INFO: Got endpoints: latency-svc-fqsd4 [749.681931ms]
Oct 31 00:18:12.110: INFO: Got endpoints: latency-svc-qt8sh [749.595949ms]
Oct 31 00:18:12.162: INFO: Got endpoints: latency-svc-7g6zm [748.713786ms]
Oct 31 00:18:12.211: INFO: Got endpoints: latency-svc-np97q [750.520232ms]
Oct 31 00:18:12.261: INFO: Got endpoints: latency-svc-csrrt [747.444851ms]
Oct 31 00:18:12.311: INFO: Got endpoints: latency-svc-gtsvv [744.525268ms]
Oct 31 00:18:12.361: INFO: Got endpoints: latency-svc-qmddg [746.493841ms]
Oct 31 00:18:12.411: INFO: Got endpoints: latency-svc-ckczj [750.958311ms]
Oct 31 00:18:12.463: INFO: Got endpoints: latency-svc-c2tdd [751.566406ms]
Oct 31 00:18:12.510: INFO: Got endpoints: latency-svc-dqrmx [748.749315ms]
Oct 31 00:18:12.560: INFO: Got endpoints: latency-svc-m9fj7 [749.109815ms]
Oct 31 00:18:12.610: INFO: Got endpoints: latency-svc-n6qf7 [746.15269ms]
Oct 31 00:18:12.610: INFO: Latencies: [71.030576ms 76.687623ms 81.916954ms 90.181853ms 98.704295ms 100.03186ms 101.979186ms 101.989387ms 102.34615ms 102.741109ms 102.987262ms 103.092876ms 104.97065ms 105.667029ms 106.389579ms 107.556157ms 109.085093ms 109.934119ms 111.769865ms 111.789991ms 116.757012ms 117.833635ms 118.859165ms 119.153945ms 119.406909ms 119.663972ms 121.205779ms 124.631594ms 132.05018ms 135.007462ms 135.021092ms 135.026902ms 146.145191ms 146.263978ms 149.346669ms 156.754809ms 164.702191ms 170.311058ms 208.123016ms 251.457542ms 280.107833ms 329.841415ms 363.947283ms 413.732888ms 463.783574ms 507.215431ms 556.684431ms 584.072431ms 634.468754ms 683.489765ms 718.675575ms 726.827763ms 726.834388ms 736.265425ms 737.992328ms 739.540546ms 740.619159ms 740.694242ms 744.525268ms 745.098953ms 746.15269ms 746.493841ms 747.128059ms 747.151357ms 747.27637ms 747.444851ms 747.637804ms 748.035258ms 748.253111ms 748.426569ms 748.566204ms 748.65173ms 748.69327ms 748.713786ms 748.749315ms 748.7635ms 748.783977ms 748.821336ms 748.864511ms 748.878552ms 748.896684ms 748.9991ms 749.005792ms 749.011933ms 749.077853ms 749.091516ms 749.098782ms 749.109815ms 749.122242ms 749.194574ms 749.199374ms 749.269576ms 749.307842ms 749.309963ms 749.343722ms 749.419244ms 749.43622ms 749.46529ms 749.547759ms 749.595949ms 749.608408ms 749.615005ms 749.656001ms 749.681931ms 749.684232ms 749.686424ms 749.693165ms 749.693209ms 749.723712ms 749.736483ms 749.738786ms 749.765424ms 749.786068ms 749.794451ms 749.796269ms 749.861284ms 749.878632ms 749.881153ms 749.954526ms 749.972808ms 750.011695ms 750.021011ms 750.063506ms 750.092125ms 750.101486ms 750.110337ms 750.131168ms 750.152724ms 750.164597ms 750.165478ms 750.167116ms 750.190904ms 750.198934ms 750.260367ms 750.275804ms 750.278315ms 750.319524ms 750.336502ms 750.356522ms 750.357763ms 750.363386ms 750.387723ms 750.392521ms 750.396348ms 750.42569ms 750.44595ms 750.44694ms 750.476192ms 750.477736ms 750.477758ms 750.488611ms 750.520232ms 750.602739ms 750.675818ms 750.686199ms 750.715123ms 750.75238ms 750.778341ms 750.820294ms 750.869602ms 750.876214ms 750.876906ms 750.920903ms 750.925738ms 750.938138ms 750.958311ms 750.986118ms 751.057351ms 751.178333ms 751.193268ms 751.246866ms 751.293622ms 751.306515ms 751.427743ms 751.557027ms 751.566406ms 751.567868ms 751.571727ms 751.594007ms 751.613457ms 751.629504ms 751.674058ms 751.695114ms 751.727411ms 751.939041ms 752.344342ms 752.438926ms 752.64316ms 752.684448ms 754.11304ms 754.36312ms 754.416978ms 754.76149ms 758.391679ms 759.146846ms 761.109667ms 762.820146ms 764.685361ms 772.730547ms 780.05988ms]
Oct 31 00:18:12.610: INFO: 50 %ile: 749.608408ms
Oct 31 00:18:12.610: INFO: 90 %ile: 751.629504ms
Oct 31 00:18:12.610: INFO: 99 %ile: 772.730547ms
Oct 31 00:18:12.610: INFO: Total sample count: 200
[AfterEach] [k8s.io] Service endpoints latency
  /go/src/github.com/openshift/origin/vendor/k8s.io/kubernetes/test/e2e/framework/framework.go:131
Oct 31 00:18:12.610: INFO: Waiting up to 3m0s for all (but 0) nodes to be ready
STEP: Destroying namespace "e2e-tests-svc-latency-2j9j5" for this suite.
Oct 31 00:18:31.323: INFO: namespace: e2e-tests-svc-latency-2j9j5, resource: bindings, ignored listing per whitelist
Oct 31 00:18:32.039: INFO: namespace e2e-tests-svc-latency-2j9j5 deletion completed in 19.410825521s

• [SLOW TEST:30.401 seconds]
[k8s.io] Service endpoints latency
/go/src/github.com/openshift/origin/vendor/k8s.io/kubernetes/test/e2e/framework/framework.go:620
  should not be very high [Conformance] [Serial] [Suite:openshift/conformance/serial] [Suite:k8s]
  /go/src/github.com/openshift/origin/vendor/k8s.io/kubernetes/test/e2e/service_latency.go:117
------------------------------
SSSSSSSSSSSSSSSSSSS
------------------------------
[k8s.io] SchedulerPredicates [Serial] 
  validates that NodeSelector is respected if matching [Conformance] [Suite:openshift/conformance/serial] [Suite:k8s]
  /go/src/github.com/openshift/origin/vendor/k8s.io/kubernetes/test/e2e/scheduling/predicates.go:296
[BeforeEach] [Top Level]
  /go/src/github.com/openshift/origin/test/extended/util/test.go:53
[BeforeEach] [k8s.io] SchedulerPredicates [Serial]
  /go/src/github.com/openshift/origin/vendor/k8s.io/kubernetes/test/e2e/framework/framework.go:130
STEP: Creating a kubernetes client
Oct 31 00:18:32.040: INFO: >>> kubeConfig: /tmp/cluster-admin.kubeconfig
STEP: Building a namespace api object
Oct 31 00:18:32.112: INFO: About to run a Kube e2e test, ensuring namespace is privileged
STEP: Waiting for a default service account to be provisioned in namespace
[BeforeEach] [k8s.io] SchedulerPredicates [Serial]
  /go/src/github.com/openshift/origin/vendor/k8s.io/kubernetes/test/e2e/scheduling/predicates.go:109
Oct 31 00:18:32.378: INFO: Waiting up to 1m0s for all (but 0) nodes to be ready
Oct 31 00:18:32.438: INFO: Waiting for terminating namespaces to be deleted...
Oct 31 00:18:32.469: INFO: 
Logging pods the kubelet thinks is on node ci-primg540-ig-m-gdck before test
Oct 31 00:18:32.500: INFO: router-1-hb8mq from default started at 2017-10-30 23:53:52 +0000 UTC (1 container statuses recorded)
Oct 31 00:18:32.500: INFO: 	Container router ready: true, restart count 0
Oct 31 00:18:32.500: INFO: docker-registry-1-zc4xc from default started at 2017-10-30 23:55:01 +0000 UTC (1 container statuses recorded)
Oct 31 00:18:32.500: INFO: 	Container registry ready: true, restart count 0
Oct 31 00:18:32.500: INFO: 
Logging pods the kubelet thinks is on node ci-primg540-ig-n-h8q0 before test
Oct 31 00:18:32.534: INFO: registry-console-1-jv7rh from default started at 2017-10-30 23:56:04 +0000 UTC (1 container statuses recorded)
Oct 31 00:18:32.534: INFO: 	Container registry-console ready: true, restart count 0
Oct 31 00:18:32.534: INFO: 
Logging pods the kubelet thinks is on node ci-primg540-ig-n-jq8k before test
Oct 31 00:18:32.567: INFO: 
Logging pods the kubelet thinks is on node ci-primg540-ig-n-qlb9 before test
Oct 31 00:18:32.601: INFO: prometheus-0 from kube-system started at 2017-10-31 00:12:53 +0000 UTC (5 container statuses recorded)
Oct 31 00:18:32.601: INFO: 	Container alert-buffer ready: true, restart count 0
Oct 31 00:18:32.601: INFO: 	Container alertmanager ready: true, restart count 0
Oct 31 00:18:32.601: INFO: 	Container alerts-proxy ready: true, restart count 0
Oct 31 00:18:32.601: INFO: 	Container prom-proxy ready: true, restart count 0
Oct 31 00:18:32.601: INFO: 	Container prometheus ready: true, restart count 0
[It] validates that NodeSelector is respected if matching [Conformance] [Suite:openshift/conformance/serial] [Suite:k8s]
  /go/src/github.com/openshift/origin/vendor/k8s.io/kubernetes/test/e2e/scheduling/predicates.go:296
STEP: Trying to launch a pod without a label to get a node which can launch it.
STEP: Explicitly delete pod here to free the resource it takes.
STEP: Trying to apply a random label on the found node.
STEP: verifying the node has the label kubernetes.io/e2e-0888eb05-bdd1-11e7-af95-0e8fb7189634 42
STEP: Trying to relaunch the pod, now with labels.
STEP: removing the label kubernetes.io/e2e-0888eb05-bdd1-11e7-af95-0e8fb7189634 off the node ci-primg540-ig-n-h8q0
STEP: verifying the node doesn't have the label kubernetes.io/e2e-0888eb05-bdd1-11e7-af95-0e8fb7189634
[AfterEach] [k8s.io] SchedulerPredicates [Serial]
  /go/src/github.com/openshift/origin/vendor/k8s.io/kubernetes/test/e2e/framework/framework.go:131
Oct 31 00:18:36.869: INFO: Waiting up to 3m0s for all (but 0) nodes to be ready
STEP: Destroying namespace "e2e-tests-sched-pred-vtkvq" for this suite.
Oct 31 00:18:59.712: INFO: namespace: e2e-tests-sched-pred-vtkvq, resource: bindings, ignored listing per whitelist
Oct 31 00:19:00.255: INFO: namespace e2e-tests-sched-pred-vtkvq deletion completed in 23.356594559s
[AfterEach] [k8s.io] SchedulerPredicates [Serial]
  /go/src/github.com/openshift/origin/vendor/k8s.io/kubernetes/test/e2e/scheduling/predicates.go:73
I1031 00:19:00.256024   20070 request.go:785] Error in request: resource name may not be empty

• [SLOW TEST:28.216 seconds]
[k8s.io] SchedulerPredicates [Serial]
/go/src/github.com/openshift/origin/vendor/k8s.io/kubernetes/test/e2e/framework/framework.go:620
  validates that NodeSelector is respected if matching [Conformance] [Suite:openshift/conformance/serial] [Suite:k8s]
  /go/src/github.com/openshift/origin/vendor/k8s.io/kubernetes/test/e2e/scheduling/predicates.go:296
------------------------------
SSSSSSSSSSSSSSSSSSSSSSSSSSSSSSSSSSSSSSSSSSSSSSSSSSSSSSSSSSSSSSSSSSSSSSSSSSSSSSSSSSSSSSSSSSSSSSSSSSSSSSSSSSSSSSSSSSSSSSSSSSSSSSSSSSSSSSSSSSSSSSSSSSSSSSSSSSSSSSSSSSSSSSSSSSSSSSSSSSSSSSSSSSSSSSSSSSSSSSSSSSSSSSSSSSSSSSSSSSSSSSSSSSSSSSSSSSSSSSSSSSSSSSSSSSSSSSSSSSSSSSSSSSSSSSSSSSSSSSSSSSSSSSSSSSSSSSSSSSSSSSSSSSSSSSSSSSSSSSSS
------------------------------
[k8s.io] kubelet [k8s.io] Clean up pods on node 
  kubelet should be able to delete 10 pods per node in 1m0s. [Serial] [Suite:openshift/conformance/serial] [Suite:k8s]
  /go/src/github.com/openshift/origin/vendor/k8s.io/kubernetes/test/e2e/kubelet.go:394
[BeforeEach] [Top Level]
  /go/src/github.com/openshift/origin/test/extended/util/test.go:53
[BeforeEach] [k8s.io] kubelet
  /go/src/github.com/openshift/origin/vendor/k8s.io/kubernetes/test/e2e/framework/framework.go:130
STEP: Creating a kubernetes client
Oct 31 00:19:00.260: INFO: >>> kubeConfig: /tmp/cluster-admin.kubeconfig
STEP: Building a namespace api object
Oct 31 00:19:00.342: INFO: About to run a Kube e2e test, ensuring namespace is privileged
STEP: Waiting for a default service account to be provisioned in namespace
[BeforeEach] [k8s.io] kubelet
  /go/src/github.com/openshift/origin/vendor/k8s.io/kubernetes/test/e2e/kubelet.go:296
[BeforeEach] [k8s.io] Clean up pods on node
  /go/src/github.com/openshift/origin/vendor/k8s.io/kubernetes/test/e2e/kubelet.go:340
[It] kubelet should be able to delete 10 pods per node in 1m0s. [Serial] [Suite:openshift/conformance/serial] [Suite:k8s]
  /go/src/github.com/openshift/origin/vendor/k8s.io/kubernetes/test/e2e/kubelet.go:394
STEP: Creating a RC of 40 pods and wait until all pods of this RC are running
STEP: creating replication controller cleanup40-18161380-bdd1-11e7-af95-0e8fb7189634 in namespace e2e-tests-kubelet-6jtpf
I1031 00:19:00.834259   20070 runners.go:176] Created replication controller with name: cleanup40-18161380-bdd1-11e7-af95-0e8fb7189634, namespace: e2e-tests-kubelet-6jtpf, replica count: 40
I1031 00:19:00.834311   20070 reflector.go:213] Starting reflector *v1.Pod (0s) from github.com/openshift/origin/vendor/k8s.io/kubernetes/test/utils/pod_store.go:53
I1031 00:19:00.834338   20070 reflector.go:251] Listing and watching *v1.Pod from github.com/openshift/origin/vendor/k8s.io/kubernetes/test/utils/pod_store.go:53
I1031 00:19:10.834588   20070 runners.go:176] cleanup40-18161380-bdd1-11e7-af95-0e8fb7189634 Pods: 40 out of 40 created, 35 running, 5 pending, 0 waiting, 0 inactive, 0 terminating, 0 unknown, 0 runningButNotReady 
I1031 00:19:20.834878   20070 runners.go:176] cleanup40-18161380-bdd1-11e7-af95-0e8fb7189634 Pods: 40 out of 40 created, 40 running, 0 pending, 0 waiting, 0 inactive, 0 terminating, 0 unknown, 0 runningButNotReady 
Oct 31 00:19:21.835: INFO: Checking pods on node ci-primg540-ig-n-qlb9 via /runningpods endpoint
Oct 31 00:19:21.835: INFO: Checking pods on node ci-primg540-ig-m-gdck via /runningpods endpoint
Oct 31 00:19:21.835: INFO: Checking pods on node ci-primg540-ig-n-h8q0 via /runningpods endpoint
Oct 31 00:19:21.835: INFO: Checking pods on node ci-primg540-ig-n-jq8k via /runningpods endpoint
Oct 31 00:19:21.966: INFO: Resource usage on node "ci-primg540-ig-n-h8q0":
container cpu(cores) memory_working_set(MB) memory_rss(MB)
"kubelet" 0.218      137.64                 137.25
"/"       0.552      1775.05                383.07
"runtime" 0.139      607.61                 120.29

Resource usage on node "ci-primg540-ig-n-jq8k":
container cpu(cores) memory_working_set(MB) memory_rss(MB)
"/"       0.635      2020.69                379.06
"runtime" 0.126      858.48                 120.00
"kubelet" 0.111      139.61                 139.16

Resource usage on node "ci-primg540-ig-n-qlb9":
container cpu(cores) memory_working_set(MB) memory_rss(MB)
"/"       0.385      2322.36                579.02
"runtime" 0.029      970.24                 129.16
"kubelet" 0.401      127.13                 126.78

Resource usage on node "ci-primg540-ig-m-gdck":
container cpu(cores) memory_working_set(MB) memory_rss(MB)
"/"       0.451      2531.41                1317.50
"runtime" 0.202      269.43                 87.88
"kubelet" 0.051      79.04                  78.63

STEP: Deleting the RC
STEP: deleting { ReplicationController} cleanup40-18161380-bdd1-11e7-af95-0e8fb7189634 in namespace e2e-tests-kubelet-6jtpf
I1031 00:19:21.981832   20070 reflector.go:213] Starting reflector *v1.Pod (0s) from github.com/openshift/origin/vendor/k8s.io/kubernetes/test/utils/pod_store.go:53
I1031 00:19:21.981884   20070 reflector.go:251] Listing and watching *v1.Pod from github.com/openshift/origin/vendor/k8s.io/kubernetes/test/utils/pod_store.go:53
Oct 31 00:19:22.692: INFO: Deleting { ReplicationController} cleanup40-18161380-bdd1-11e7-af95-0e8fb7189634 took: 610.754647ms
Oct 31 00:19:22.692: INFO: Terminating { ReplicationController} cleanup40-18161380-bdd1-11e7-af95-0e8fb7189634 pods took: 36.594µs
Oct 31 00:19:35.793: INFO: Garbage collecting { ReplicationController} cleanup40-18161380-bdd1-11e7-af95-0e8fb7189634 pods took: 13.710976867s
Oct 31 00:19:36.793: INFO: Checking pods on node ci-primg540-ig-n-qlb9 via /runningpods endpoint
Oct 31 00:19:36.793: INFO: Checking pods on node ci-primg540-ig-n-jq8k via /runningpods endpoint
Oct 31 00:19:36.793: INFO: Checking pods on node ci-primg540-ig-n-h8q0 via /runningpods endpoint
Oct 31 00:19:36.793: INFO: Checking pods on node ci-primg540-ig-m-gdck via /runningpods endpoint
Oct 31 00:19:36.838: INFO: Deleting 40 pods on 4 nodes completed in 1.04586742s after the RC was deleted
Oct 31 00:19:36.839: INFO: CPU usage of containers on node "ci-primg540-ig-n-qlb9"
:container 5th%  20th% 50th% 70th% 90th% 95th% 99th%
"/"       0.000 0.000 0.306 0.385 0.385 0.385 0.385
"runtime" 0.000 0.000 0.029 0.048 0.048 0.048 0.048
"kubelet" 0.000 0.000 0.081 0.081 0.081 0.081 0.081

CPU usage of containers on node "ci-primg540-ig-m-gdck"
:container 5th%  20th% 50th% 70th% 90th% 95th% 99th%
"/"       0.000 0.000 0.388 0.451 0.451 0.451 0.451
"runtime" 0.000 0.000 0.062 0.062 0.062 0.062 0.062
"kubelet" 0.000 0.000 0.051 0.051 0.051 0.051 0.051

CPU usage of containers on node "ci-primg540-ig-n-h8q0"
:container 5th%  20th% 50th% 70th% 90th% 95th% 99th%
"/"       0.000 0.000 0.248 0.248 0.248 0.248 0.248
"runtime" 0.000 0.000 0.061 0.139 0.139 0.139 0.139
"kubelet" 0.000 0.000 0.063 0.063 0.111 0.111 0.111

CPU usage of containers on node "ci-primg540-ig-n-jq8k"
:container 5th%  20th% 50th% 70th% 90th% 95th% 99th%
"/"       0.000 0.000 0.444 0.468 0.468 0.468 0.468
"runtime" 0.000 0.000 0.126 0.126 0.126 0.126 0.126
"kubelet" 0.000 0.000 0.111 0.111 0.111 0.111 0.111

[AfterEach] [k8s.io] Clean up pods on node
  /go/src/github.com/openshift/origin/vendor/k8s.io/kubernetes/test/e2e/kubelet.go:348
[AfterEach] [k8s.io] kubelet
  /go/src/github.com/openshift/origin/vendor/k8s.io/kubernetes/test/e2e/framework/framework.go:131
Oct 31 00:19:36.966: INFO: Waiting up to 3m0s for all (but 0) nodes to be ready
STEP: Destroying namespace "e2e-tests-kubelet-6jtpf" for this suite.
Oct 31 00:19:43.559: INFO: namespace: e2e-tests-kubelet-6jtpf, resource: bindings, ignored listing per whitelist
Oct 31 00:19:44.343: INFO: namespace e2e-tests-kubelet-6jtpf deletion completed in 7.347857409s

• [SLOW TEST:44.083 seconds]
[k8s.io] kubelet
/go/src/github.com/openshift/origin/vendor/k8s.io/kubernetes/test/e2e/framework/framework.go:620
  [k8s.io] Clean up pods on node
  /go/src/github.com/openshift/origin/vendor/k8s.io/kubernetes/test/e2e/framework/framework.go:620
    kubelet should be able to delete 10 pods per node in 1m0s. [Serial] [Suite:openshift/conformance/serial] [Suite:k8s]
    /go/src/github.com/openshift/origin/vendor/k8s.io/kubernetes/test/e2e/kubelet.go:394
------------------------------
SSSSSSSSSSS
------------------------------
[k8s.io] Namespaces [Serial] 
  should delete fast enough (90 percent of 100 namespaces in 150 seconds) [Suite:openshift/conformance/serial] [Suite:k8s]
  /go/src/github.com/openshift/origin/vendor/k8s.io/kubernetes/test/e2e/namespace.go:271
[BeforeEach] [Top Level]
  /go/src/github.com/openshift/origin/test/extended/util/test.go:53
[BeforeEach] [k8s.io] Namespaces [Serial]
  /go/src/github.com/openshift/origin/vendor/k8s.io/kubernetes/test/e2e/framework/framework.go:130
STEP: Creating a kubernetes client
Oct 31 00:19:44.343: INFO: >>> kubeConfig: /tmp/cluster-admin.kubeconfig
STEP: Building a namespace api object
STEP: Waiting for a default service account to be provisioned in namespace
[It] should delete fast enough (90 percent of 100 namespaces in 150 seconds) [Suite:openshift/conformance/serial] [Suite:k8s]
  /go/src/github.com/openshift/origin/vendor/k8s.io/kubernetes/test/e2e/namespace.go:271
STEP: Creating testing namespaces
I1031 00:19:44.595052   20070 request.go:641] Throttling request took 89.470772ms, request: POST:https://internal-api.primg540.origin-ci-int-gce.dev.rhcloud.com:8443/api/v1/namespaces
I1031 00:19:44.645062   20070 request.go:641] Throttling request took 139.485344ms, request: POST:https://internal-api.primg540.origin-ci-int-gce.dev.rhcloud.com:8443/api/v1/namespaces
I1031 00:19:44.695067   20070 request.go:641] Throttling request took 189.476153ms, request: POST:https://internal-api.primg540.origin-ci-int-gce.dev.rhcloud.com:8443/api/v1/namespaces
I1031 00:19:44.745073   20070 request.go:641] Throttling request took 239.45188ms, request: POST:https://internal-api.primg540.origin-ci-int-gce.dev.rhcloud.com:8443/api/v1/namespaces
I1031 00:19:44.795071   20070 request.go:641] Throttling request took 289.445372ms, request: POST:https://internal-api.primg540.origin-ci-int-gce.dev.rhcloud.com:8443/api/v1/namespaces
I1031 00:19:44.845122   20070 request.go:641] Throttling request took 339.489013ms, request: POST:https://internal-api.primg540.origin-ci-int-gce.dev.rhcloud.com:8443/api/v1/namespaces
I1031 00:19:44.895083   20070 request.go:641] Throttling request took 389.441964ms, request: POST:https://internal-api.primg540.origin-ci-int-gce.dev.rhcloud.com:8443/api/v1/namespaces
I1031 00:19:44.945076   20070 request.go:641] Throttling request took 439.414764ms, request: POST:https://internal-api.primg540.origin-ci-int-gce.dev.rhcloud.com:8443/api/v1/namespaces
I1031 00:19:44.995073   20070 request.go:641] Throttling request took 489.408405ms, request: POST:https://internal-api.primg540.origin-ci-int-gce.dev.rhcloud.com:8443/api/v1/namespaces
I1031 00:19:45.045081   20070 request.go:641] Throttling request took 539.415918ms, request: POST:https://internal-api.primg540.origin-ci-int-gce.dev.rhcloud.com:8443/api/v1/namespaces
I1031 00:19:45.095087   20070 request.go:641] Throttling request took 589.397913ms, request: POST:https://internal-api.primg540.origin-ci-int-gce.dev.rhcloud.com:8443/api/v1/namespaces
I1031 00:19:45.145098   20070 request.go:641] Throttling request took 639.394851ms, request: POST:https://internal-api.primg540.origin-ci-int-gce.dev.rhcloud.com:8443/api/v1/namespaces
I1031 00:19:45.195070   20070 request.go:641] Throttling request took 689.37195ms, request: POST:https://internal-api.primg540.origin-ci-int-gce.dev.rhcloud.com:8443/api/v1/namespaces
I1031 00:19:45.245059   20070 request.go:641] Throttling request took 739.352765ms, request: POST:https://internal-api.primg540.origin-ci-int-gce.dev.rhcloud.com:8443/api/v1/namespaces
I1031 00:19:45.295061   20070 request.go:641] Throttling request took 789.333368ms, request: POST:https://internal-api.primg540.origin-ci-int-gce.dev.rhcloud.com:8443/api/v1/namespaces
I1031 00:19:45.345075   20070 request.go:641] Throttling request took 839.334224ms, request: POST:https://internal-api.primg540.origin-ci-int-gce.dev.rhcloud.com:8443/api/v1/namespaces
I1031 00:19:45.395074   20070 request.go:641] Throttling request took 889.331966ms, request: POST:https://internal-api.primg540.origin-ci-int-gce.dev.rhcloud.com:8443/api/v1/namespaces
I1031 00:19:45.445087   20070 request.go:641] Throttling request took 939.332904ms, request: POST:https://internal-api.primg540.origin-ci-int-gce.dev.rhcloud.com:8443/api/v1/namespaces
I1031 00:19:45.495083   20070 request.go:641] Throttling request took 989.308983ms, request: POST:https://internal-api.primg540.origin-ci-int-gce.dev.rhcloud.com:8443/api/v1/namespaces
I1031 00:19:45.545086   20070 request.go:641] Throttling request took 1.03929796s, request: POST:https://internal-api.primg540.origin-ci-int-gce.dev.rhcloud.com:8443/api/v1/namespaces
I1031 00:19:45.595066   20070 request.go:641] Throttling request took 1.08929292s, request: POST:https://internal-api.primg540.origin-ci-int-gce.dev.rhcloud.com:8443/api/v1/namespaces
I1031 00:19:45.645066   20070 request.go:641] Throttling request took 1.139275205s, request: POST:https://internal-api.primg540.origin-ci-int-gce.dev.rhcloud.com:8443/api/v1/namespaces
I1031 00:19:45.695100   20070 request.go:641] Throttling request took 1.18927099s, request: POST:https://internal-api.primg540.origin-ci-int-gce.dev.rhcloud.com:8443/api/v1/namespaces
I1031 00:19:45.745112   20070 request.go:641] Throttling request took 1.239290242s, request: POST:https://internal-api.primg540.origin-ci-int-gce.dev.rhcloud.com:8443/api/v1/namespaces
I1031 00:19:45.795086   20070 request.go:641] Throttling request took 1.28926727s, request: POST:https://internal-api.primg540.origin-ci-int-gce.dev.rhcloud.com:8443/api/v1/namespaces
I1031 00:19:45.845085   20070 request.go:641] Throttling request took 1.339246377s, request: POST:https://internal-api.primg540.origin-ci-int-gce.dev.rhcloud.com:8443/api/v1/namespaces
I1031 00:19:45.895083   20070 request.go:641] Throttling request took 1.389227421s, request: POST:https://internal-api.primg540.origin-ci-int-gce.dev.rhcloud.com:8443/api/v1/namespaces
I1031 00:19:45.945093   20070 request.go:641] Throttling request took 1.439236107s, request: POST:https://internal-api.primg540.origin-ci-int-gce.dev.rhcloud.com:8443/api/v1/namespaces
I1031 00:19:45.995073   20070 request.go:641] Throttling request took 1.489213753s, request: POST:https://internal-api.primg540.origin-ci-int-gce.dev.rhcloud.com:8443/api/v1/namespaces
I1031 00:19:46.045078   20070 request.go:641] Throttling request took 1.539198684s, request: POST:https://internal-api.primg540.origin-ci-int-gce.dev.rhcloud.com:8443/api/v1/namespaces
I1031 00:19:46.095076   20070 request.go:641] Throttling request took 1.589189816s, request: POST:https://internal-api.primg540.origin-ci-int-gce.dev.rhcloud.com:8443/api/v1/namespaces
I1031 00:19:46.145079   20070 request.go:641] Throttling request took 1.639186598s, request: POST:https://internal-api.primg540.origin-ci-int-gce.dev.rhcloud.com:8443/api/v1/namespaces
I1031 00:19:46.195088   20070 request.go:641] Throttling request took 1.689182913s, request: POST:https://internal-api.primg540.origin-ci-int-gce.dev.rhcloud.com:8443/api/v1/namespaces
I1031 00:19:46.245088   20070 request.go:641] Throttling request took 1.739160026s, request: POST:https://internal-api.primg540.origin-ci-int-gce.dev.rhcloud.com:8443/api/v1/namespaces
I1031 00:19:46.295080   20070 request.go:641] Throttling request took 1.78915171s, request: POST:https://internal-api.primg540.origin-ci-int-gce.dev.rhcloud.com:8443/api/v1/namespaces
I1031 00:19:46.345086   20070 request.go:641] Throttling request took 1.839152464s, request: POST:https://internal-api.primg540.origin-ci-int-gce.dev.rhcloud.com:8443/api/v1/namespaces
I1031 00:19:46.395113   20070 request.go:641] Throttling request took 1.889123549s, request: POST:https://internal-api.primg540.origin-ci-int-gce.dev.rhcloud.com:8443/api/v1/namespaces
I1031 00:19:46.445116   20070 request.go:641] Throttling request took 1.939122547s, request: POST:https://internal-api.primg540.origin-ci-int-gce.dev.rhcloud.com:8443/api/v1/namespaces
I1031 00:19:46.495076   20070 request.go:641] Throttling request took 1.989093702s, request: POST:https://internal-api.primg540.origin-ci-int-gce.dev.rhcloud.com:8443/api/v1/namespaces
I1031 00:19:46.545070   20070 request.go:641] Throttling request took 2.039058268s, request: POST:https://internal-api.primg540.origin-ci-int-gce.dev.rhcloud.com:8443/api/v1/namespaces
I1031 00:19:46.595057   20070 request.go:641] Throttling request took 2.089027368s, request: POST:https://internal-api.primg540.origin-ci-int-gce.dev.rhcloud.com:8443/api/v1/namespaces
I1031 00:19:46.645072   20070 request.go:641] Throttling request took 2.139032634s, request: POST:https://internal-api.primg540.origin-ci-int-gce.dev.rhcloud.com:8443/api/v1/namespaces
I1031 00:19:46.695076   20070 request.go:641] Throttling request took 2.189035054s, request: POST:https://internal-api.primg540.origin-ci-int-gce.dev.rhcloud.com:8443/api/v1/namespaces
I1031 00:19:46.745086   20070 request.go:641] Throttling request took 2.239019823s, request: POST:https://internal-api.primg540.origin-ci-int-gce.dev.rhcloud.com:8443/api/v1/namespaces
I1031 00:19:46.795081   20070 request.go:641] Throttling request took 2.289012537s, request: POST:https://internal-api.primg540.origin-ci-int-gce.dev.rhcloud.com:8443/api/v1/namespaces
I1031 00:19:46.845086   20070 request.go:641] Throttling request took 2.339008021s, request: POST:https://internal-api.primg540.origin-ci-int-gce.dev.rhcloud.com:8443/api/v1/namespaces
I1031 00:19:46.895104   20070 request.go:641] Throttling request took 2.389013695s, request: POST:https://internal-api.primg540.origin-ci-int-gce.dev.rhcloud.com:8443/api/v1/namespaces
I1031 00:19:46.945091   20070 request.go:641] Throttling request took 2.438977291s, request: POST:https://internal-api.primg540.origin-ci-int-gce.dev.rhcloud.com:8443/api/v1/namespaces
I1031 00:19:46.995087   20070 request.go:641] Throttling request took 2.48896942s, request: POST:https://internal-api.primg540.origin-ci-int-gce.dev.rhcloud.com:8443/api/v1/namespaces
STEP: Waiting 10 seconds
STEP: Deleting namespaces
Oct 31 00:19:58.756: INFO: namespace : e2e-tests-nslifetest-28-w59rt api call to delete is complete 
Oct 31 00:19:58.757: INFO: namespace : e2e-tests-nslifetest-3-mngkh api call to delete is complete 
Oct 31 00:19:58.757: INFO: namespace : e2e-tests-nslifetest-14-g47f2 api call to delete is complete 
Oct 31 00:19:58.757: INFO: namespace : e2e-tests-nslifetest-17-7dm2r api call to delete is complete 
Oct 31 00:19:58.760: INFO: namespace : e2e-tests-nslifetest-99-tn9bv api call to delete is complete 
Oct 31 00:19:58.761: INFO: namespace : e2e-tests-nslifetest-15-srrfm api call to delete is complete 
Oct 31 00:19:58.793: INFO: namespace : e2e-tests-nslifetest-13-62wnj api call to delete is complete 
I1031 00:19:58.795056   20070 request.go:641] Throttling request took 62.663013ms, request: DELETE:https://internal-api.primg540.origin-ci-int-gce.dev.rhcloud.com:8443/api/v1/namespaces/e2e-tests-nslifetest-80-dtvpf
Oct 31 00:19:58.800: INFO: namespace : e2e-tests-nslifetest-1-sc6t6 api call to delete is complete 
Oct 31 00:19:58.808: INFO: namespace : e2e-tests-nslifetest-84-wgknq api call to delete is complete 
Oct 31 00:19:58.816: INFO: namespace : e2e-tests-nslifetest-20-tbsk5 api call to delete is complete 
Oct 31 00:19:58.819: INFO: namespace : e2e-tests-nslifetest-38-rq2j5 api call to delete is complete 
Oct 31 00:19:58.819: INFO: namespace : e2e-tests-nslifetest-33-4mjx4 api call to delete is complete 
Oct 31 00:19:58.819: INFO: namespace : e2e-tests-nslifetest-72-kjqd7 api call to delete is complete 
Oct 31 00:19:58.819: INFO: namespace : e2e-tests-nslifetest-16-l8mwx api call to delete is complete 
Oct 31 00:19:58.819: INFO: namespace : e2e-tests-nslifetest-37-m2z49 api call to delete is complete 
Oct 31 00:19:58.819: INFO: namespace : e2e-tests-nslifetest-22-xw7jw api call to delete is complete 
Oct 31 00:19:58.819: INFO: namespace : e2e-tests-nslifetest-32-k46bn api call to delete is complete 
Oct 31 00:19:58.819: INFO: namespace : e2e-tests-nslifetest-77-ctjhs api call to delete is complete 
Oct 31 00:19:58.827: INFO: namespace : e2e-tests-nslifetest-78-m9xww api call to delete is complete 
Oct 31 00:19:58.827: INFO: namespace : e2e-tests-nslifetest-2-p8zvj api call to delete is complete 
Oct 31 00:19:58.827: INFO: namespace : e2e-tests-nslifetest-23-8bjqb api call to delete is complete 
Oct 31 00:19:58.827: INFO: namespace : e2e-tests-nslifetest-34-8qjzz api call to delete is complete 
Oct 31 00:19:58.832: INFO: namespace : e2e-tests-nslifetest-36-2ksjc api call to delete is complete 
Oct 31 00:19:58.832: INFO: namespace : e2e-tests-nslifetest-7-hp7w5 api call to delete is complete 
Oct 31 00:19:58.837: INFO: namespace : e2e-tests-nslifetest-35-gwx9w api call to delete is complete 
Oct 31 00:19:58.837: INFO: namespace : e2e-tests-nslifetest-24-t8b8z api call to delete is complete 
Oct 31 00:19:58.837: INFO: namespace : e2e-tests-nslifetest-31-lphj7 api call to delete is complete 
Oct 31 00:19:58.837: INFO: namespace : e2e-tests-nslifetest-89-svv7r api call to delete is complete 
Oct 31 00:19:58.837: INFO: namespace : e2e-tests-nslifetest-0-mw8l4 api call to delete is complete 
Oct 31 00:19:58.840: INFO: namespace : e2e-tests-nslifetest-11-sqlsl api call to delete is complete 
Oct 31 00:19:58.840: INFO: namespace : e2e-tests-nslifetest-79-hrwgn api call to delete is complete 
Oct 31 00:19:58.840: INFO: namespace : e2e-tests-nslifetest-70-gfp74 api call to delete is complete 
Oct 31 00:19:58.840: INFO: namespace : e2e-tests-nslifetest-87-sbjhf api call to delete is complete 
Oct 31 00:19:58.840: INFO: namespace : e2e-tests-nslifetest-27-5plpn api call to delete is complete 
Oct 31 00:19:58.840: INFO: namespace : e2e-tests-nslifetest-4-5ddp4 api call to delete is complete 
Oct 31 00:19:58.840: INFO: namespace : e2e-tests-nslifetest-40-xj2hx api call to delete is complete 
Oct 31 00:19:58.840: INFO: namespace : e2e-tests-nslifetest-18-btnff api call to delete is complete 
Oct 31 00:19:58.840: INFO: namespace : e2e-tests-nslifetest-30-g429q api call to delete is complete 
Oct 31 00:19:58.840: INFO: namespace : e2e-tests-nslifetest-39-6tctx api call to delete is complete 
Oct 31 00:19:58.840: INFO: namespace : e2e-tests-nslifetest-8-6whn4 api call to delete is complete 
Oct 31 00:19:58.840: INFO: namespace : e2e-tests-nslifetest-29-vbqss api call to delete is complete 
Oct 31 00:19:58.840: INFO: namespace : e2e-tests-nslifetest-85-k7xpm api call to delete is complete 
Oct 31 00:19:58.840: INFO: namespace : e2e-tests-nslifetest-19-r4d4g api call to delete is complete 
Oct 31 00:19:58.840: INFO: namespace : e2e-tests-nslifetest-21-v9bpn api call to delete is complete 
Oct 31 00:19:58.840: INFO: namespace : e2e-tests-nslifetest-86-dtnrz api call to delete is complete 
Oct 31 00:19:58.840: INFO: namespace : e2e-tests-nslifetest-25-j7lzl api call to delete is complete 
Oct 31 00:19:58.840: INFO: namespace : e2e-tests-nslifetest-10-gcrgj api call to delete is complete 
Oct 31 00:19:58.841: INFO: namespace : e2e-tests-nslifetest-26-bmwcv api call to delete is complete 
Oct 31 00:19:58.841: INFO: namespace : e2e-tests-nslifetest-71-n55qg api call to delete is complete 
Oct 31 00:19:58.841: INFO: namespace : e2e-tests-nslifetest-12-8b5vv api call to delete is complete 
Oct 31 00:19:58.841: INFO: namespace : e2e-tests-nslifetest-88-jbmfh api call to delete is complete 
I1031 00:19:58.845056   20070 request.go:641] Throttling request took 112.618293ms, request: DELETE:https://internal-api.primg540.origin-ci-int-gce.dev.rhcloud.com:8443/api/v1/namespaces/e2e-tests-nslifetest-73-wq9fj
Oct 31 00:19:58.845: INFO: namespace : e2e-tests-nslifetest-80-dtvpf api call to delete is complete 
Oct 31 00:19:58.869: INFO: namespace : e2e-tests-nslifetest-73-wq9fj api call to delete is complete 
I1031 00:19:58.895055   20070 request.go:641] Throttling request took 162.605057ms, request: DELETE:https://internal-api.primg540.origin-ci-int-gce.dev.rhcloud.com:8443/api/v1/namespaces/e2e-tests-nslifetest-74-q5bcg
Oct 31 00:19:58.913: INFO: namespace : e2e-tests-nslifetest-74-q5bcg api call to delete is complete 
I1031 00:19:58.945052   20070 request.go:641] Throttling request took 212.588995ms, request: DELETE:https://internal-api.primg540.origin-ci-int-gce.dev.rhcloud.com:8443/api/v1/namespaces/e2e-tests-nslifetest-81-g767s
Oct 31 00:19:58.964: INFO: namespace : e2e-tests-nslifetest-81-g767s api call to delete is complete 
I1031 00:19:58.995078   20070 request.go:641] Throttling request took 262.613155ms, request: DELETE:https://internal-api.primg540.origin-ci-int-gce.dev.rhcloud.com:8443/api/v1/namespaces/e2e-tests-nslifetest-9-vpgrg
Oct 31 00:19:59.012: INFO: namespace : e2e-tests-nslifetest-9-vpgrg api call to delete is complete 
I1031 00:19:59.045070   20070 request.go:641] Throttling request took 312.602874ms, request: DELETE:https://internal-api.primg540.origin-ci-int-gce.dev.rhcloud.com:8443/api/v1/namespaces/e2e-tests-nslifetest-75-lct8f
Oct 31 00:19:59.062: INFO: namespace : e2e-tests-nslifetest-75-lct8f api call to delete is complete 
I1031 00:19:59.095066   20070 request.go:641] Throttling request took 362.58899ms, request: DELETE:https://internal-api.primg540.origin-ci-int-gce.dev.rhcloud.com:8443/api/v1/namespaces/e2e-tests-nslifetest-82-p55kt
Oct 31 00:19:59.112: INFO: namespace : e2e-tests-nslifetest-82-p55kt api call to delete is complete 
I1031 00:19:59.145087   20070 request.go:641] Throttling request took 412.610134ms, request: DELETE:https://internal-api.primg540.origin-ci-int-gce.dev.rhcloud.com:8443/api/v1/namespaces/e2e-tests-nslifetest-90-zsh69
Oct 31 00:19:59.162: INFO: namespace : e2e-tests-nslifetest-90-zsh69 api call to delete is complete 
I1031 00:19:59.195079   20070 request.go:641] Throttling request took 462.592363ms, request: DELETE:https://internal-api.primg540.origin-ci-int-gce.dev.rhcloud.com:8443/api/v1/namespaces/e2e-tests-nslifetest-76-pd6kf
Oct 31 00:19:59.212: INFO: namespace : e2e-tests-nslifetest-76-pd6kf api call to delete is complete 
I1031 00:19:59.245070   20070 request.go:641] Throttling request took 512.585787ms, request: DELETE:https://internal-api.primg540.origin-ci-int-gce.dev.rhcloud.com:8443/api/v1/namespaces/e2e-tests-nslifetest-83-v7cdc
Oct 31 00:19:59.278: INFO: namespace : e2e-tests-nslifetest-83-v7cdc api call to delete is complete 
I1031 00:19:59.295059   20070 request.go:641] Throttling request took 562.571795ms, request: DELETE:https://internal-api.primg540.origin-ci-int-gce.dev.rhcloud.com:8443/api/v1/namespaces/e2e-tests-nslifetest-91-svdk2
Oct 31 00:19:59.313: INFO: namespace : e2e-tests-nslifetest-91-svdk2 api call to delete is complete 
I1031 00:19:59.345086   20070 request.go:641] Throttling request took 612.582323ms, request: DELETE:https://internal-api.primg540.origin-ci-int-gce.dev.rhcloud.com:8443/api/v1/namespaces/e2e-tests-nslifetest-92-m6t52
Oct 31 00:19:59.364: INFO: namespace : e2e-tests-nslifetest-92-m6t52 api call to delete is complete 
I1031 00:19:59.395069   20070 request.go:641] Throttling request took 662.568112ms, request: DELETE:https://internal-api.primg540.origin-ci-int-gce.dev.rhcloud.com:8443/api/v1/namespaces/e2e-tests-nslifetest-56-2t269
Oct 31 00:19:59.412: INFO: namespace : e2e-tests-nslifetest-56-2t269 api call to delete is complete 
I1031 00:19:59.445070   20070 request.go:641] Throttling request took 712.559372ms, request: DELETE:https://internal-api.primg540.origin-ci-int-gce.dev.rhcloud.com:8443/api/v1/namespaces/e2e-tests-nslifetest-93-6b2hl
Oct 31 00:19:59.463: INFO: namespace : e2e-tests-nslifetest-93-6b2hl api call to delete is complete 
I1031 00:19:59.495070   20070 request.go:641] Throttling request took 762.556434ms, request: DELETE:https://internal-api.primg540.origin-ci-int-gce.dev.rhcloud.com:8443/api/v1/namespaces/e2e-tests-nslifetest-41-sf96v
Oct 31 00:19:59.513: INFO: namespace : e2e-tests-nslifetest-41-sf96v api call to delete is complete 
I1031 00:19:59.545083   20070 request.go:641] Throttling request took 812.549878ms, request: DELETE:https://internal-api.primg540.origin-ci-int-gce.dev.rhcloud.com:8443/api/v1/namespaces/e2e-tests-nslifetest-94-sk7fv
Oct 31 00:19:59.563: INFO: namespace : e2e-tests-nslifetest-94-sk7fv api call to delete is complete 
I1031 00:19:59.595092   20070 request.go:641] Throttling request took 862.561624ms, request: DELETE:https://internal-api.primg540.origin-ci-int-gce.dev.rhcloud.com:8443/api/v1/namespaces/e2e-tests-nslifetest-42-9rw4p
Oct 31 00:19:59.612: INFO: namespace : e2e-tests-nslifetest-42-9rw4p api call to delete is complete 
I1031 00:19:59.645083   20070 request.go:641] Throttling request took 912.551123ms, request: DELETE:https://internal-api.primg540.origin-ci-int-gce.dev.rhcloud.com:8443/api/v1/namespaces/e2e-tests-nslifetest-57-frcck
Oct 31 00:19:59.662: INFO: namespace : e2e-tests-nslifetest-57-frcck api call to delete is complete 
I1031 00:19:59.695064   20070 request.go:641] Throttling request took 962.526382ms, request: DELETE:https://internal-api.primg540.origin-ci-int-gce.dev.rhcloud.com:8443/api/v1/namespaces/e2e-tests-nslifetest-95-6dhsl
Oct 31 00:19:59.712: INFO: namespace : e2e-tests-nslifetest-95-6dhsl api call to delete is complete 
I1031 00:19:59.745068   20070 request.go:641] Throttling request took 1.012531479s, request: DELETE:https://internal-api.primg540.origin-ci-int-gce.dev.rhcloud.com:8443/api/v1/namespaces/e2e-tests-nslifetest-43-n9hdd
Oct 31 00:19:59.762: INFO: namespace : e2e-tests-nslifetest-43-n9hdd api call to delete is complete 
I1031 00:19:59.795068   20070 request.go:641] Throttling request took 1.062521386s, request: DELETE:https://internal-api.primg540.origin-ci-int-gce.dev.rhcloud.com:8443/api/v1/namespaces/e2e-tests-nslifetest-58-kgmc8
Oct 31 00:19:59.814: INFO: namespace : e2e-tests-nslifetest-58-kgmc8 api call to delete is complete 
I1031 00:19:59.845090   20070 request.go:641] Throttling request took 1.112536532s, request: DELETE:https://internal-api.primg540.origin-ci-int-gce.dev.rhcloud.com:8443/api/v1/namespaces/e2e-tests-nslifetest-96-7jl2b
Oct 31 00:19:59.867: INFO: namespace : e2e-tests-nslifetest-96-7jl2b api call to delete is complete 
I1031 00:19:59.895091   20070 request.go:641] Throttling request took 1.162530158s, request: DELETE:https://internal-api.primg540.origin-ci-int-gce.dev.rhcloud.com:8443/api/v1/namespaces/e2e-tests-nslifetest-59-cw46c
Oct 31 00:19:59.915: INFO: namespace : e2e-tests-nslifetest-59-cw46c api call to delete is complete 
I1031 00:19:59.945108   20070 request.go:641] Throttling request took 1.21254516s, request: DELETE:https://internal-api.primg540.origin-ci-int-gce.dev.rhcloud.com:8443/api/v1/namespaces/e2e-tests-nslifetest-44-tpsfk
Oct 31 00:19:59.962: INFO: namespace : e2e-tests-nslifetest-44-tpsfk api call to delete is complete 
I1031 00:19:59.995099   20070 request.go:641] Throttling request took 1.262531077s, request: DELETE:https://internal-api.primg540.origin-ci-int-gce.dev.rhcloud.com:8443/api/v1/namespaces/e2e-tests-nslifetest-6-vhgnw
Oct 31 00:20:00.014: INFO: namespace : e2e-tests-nslifetest-6-vhgnw api call to delete is complete 
I1031 00:20:00.045131   20070 request.go:641] Throttling request took 1.31255322s, request: DELETE:https://internal-api.primg540.origin-ci-int-gce.dev.rhcloud.com:8443/api/v1/namespaces/e2e-tests-nslifetest-97-gv6tx
Oct 31 00:20:00.062: INFO: namespace : e2e-tests-nslifetest-97-gv6tx api call to delete is complete 
I1031 00:20:00.095088   20070 request.go:641] Throttling request took 1.362518014s, request: DELETE:https://internal-api.primg540.origin-ci-int-gce.dev.rhcloud.com:8443/api/v1/namespaces/e2e-tests-nslifetest-45-b2mgs
Oct 31 00:20:00.112: INFO: namespace : e2e-tests-nslifetest-45-b2mgs api call to delete is complete 
I1031 00:20:00.145110   20070 request.go:641] Throttling request took 1.412531465s, request: DELETE:https://internal-api.primg540.origin-ci-int-gce.dev.rhcloud.com:8443/api/v1/namespaces/e2e-tests-nslifetest-60-5nkqw
Oct 31 00:20:00.161: INFO: namespace : e2e-tests-nslifetest-60-5nkqw api call to delete is complete 
I1031 00:20:00.195099   20070 request.go:641] Throttling request took 1.462518904s, request: DELETE:https://internal-api.primg540.origin-ci-int-gce.dev.rhcloud.com:8443/api/v1/namespaces/e2e-tests-nslifetest-98-b7jc7
Oct 31 00:20:00.211: INFO: namespace : e2e-tests-nslifetest-98-b7jc7 api call to delete is complete 
I1031 00:20:00.245090   20070 request.go:641] Throttling request took 1.512510956s, request: DELETE:https://internal-api.primg540.origin-ci-int-gce.dev.rhcloud.com:8443/api/v1/namespaces/e2e-tests-nslifetest-46-f54cm
Oct 31 00:20:00.261: INFO: namespace : e2e-tests-nslifetest-46-f54cm api call to delete is complete 
I1031 00:20:00.295094   20070 request.go:641] Throttling request took 1.56251052s, request: DELETE:https://internal-api.primg540.origin-ci-int-gce.dev.rhcloud.com:8443/api/v1/namespaces/e2e-tests-nslifetest-61-x9rx6
Oct 31 00:20:00.312: INFO: namespace : e2e-tests-nslifetest-61-x9rx6 api call to delete is complete 
I1031 00:20:00.345135   20070 request.go:641] Throttling request took 1.612542651s, request: DELETE:https://internal-api.primg540.origin-ci-int-gce.dev.rhcloud.com:8443/api/v1/namespaces/e2e-tests-nslifetest-66-99g5j
Oct 31 00:20:00.361: INFO: namespace : e2e-tests-nslifetest-66-99g5j api call to delete is complete 
I1031 00:20:00.395090   20070 request.go:641] Throttling request took 1.66249965s, request: DELETE:https://internal-api.primg540.origin-ci-int-gce.dev.rhcloud.com:8443/api/v1/namespaces/e2e-tests-nslifetest-67-2h2xs
Oct 31 00:20:00.412: INFO: namespace : e2e-tests-nslifetest-67-2h2xs api call to delete is complete 
I1031 00:20:00.445135   20070 request.go:641] Throttling request took 1.712534367s, request: DELETE:https://internal-api.primg540.origin-ci-int-gce.dev.rhcloud.com:8443/api/v1/namespaces/e2e-tests-nslifetest-47-vktcp
Oct 31 00:20:00.462: INFO: namespace : e2e-tests-nslifetest-47-vktcp api call to delete is complete 
I1031 00:20:00.495105   20070 request.go:641] Throttling request took 1.762511505s, request: DELETE:https://internal-api.primg540.origin-ci-int-gce.dev.rhcloud.com:8443/api/v1/namespaces/e2e-tests-nslifetest-68-xk74g
Oct 31 00:20:00.511: INFO: namespace : e2e-tests-nslifetest-68-xk74g api call to delete is complete 
I1031 00:20:00.545060   20070 request.go:641] Throttling request took 1.812455772s, request: DELETE:https://internal-api.primg540.origin-ci-int-gce.dev.rhcloud.com:8443/api/v1/namespaces/e2e-tests-nslifetest-62-42cnm
Oct 31 00:20:00.561: INFO: namespace : e2e-tests-nslifetest-62-42cnm api call to delete is complete 
I1031 00:20:00.595048   20070 request.go:641] Throttling request took 1.862448583s, request: DELETE:https://internal-api.primg540.origin-ci-int-gce.dev.rhcloud.com:8443/api/v1/namespaces/e2e-tests-nslifetest-69-fkgj6
Oct 31 00:20:00.611: INFO: namespace : e2e-tests-nslifetest-69-fkgj6 api call to delete is complete 
I1031 00:20:00.645048   20070 request.go:641] Throttling request took 1.912447961s, request: DELETE:https://internal-api.primg540.origin-ci-int-gce.dev.rhcloud.com:8443/api/v1/namespaces/e2e-tests-nslifetest-48-lnw9n
Oct 31 00:20:00.662: INFO: namespace : e2e-tests-nslifetest-48-lnw9n api call to delete is complete 
I1031 00:20:00.695042   20070 request.go:641] Throttling request took 1.962436236s, request: DELETE:https://internal-api.primg540.origin-ci-int-gce.dev.rhcloud.com:8443/api/v1/namespaces/e2e-tests-nslifetest-63-wrsdc
Oct 31 00:20:00.711: INFO: namespace : e2e-tests-nslifetest-63-wrsdc api call to delete is complete 
I1031 00:20:00.745060   20070 request.go:641] Throttling request took 2.012448299s, request: DELETE:https://internal-api.primg540.origin-ci-int-gce.dev.rhcloud.com:8443/api/v1/namespaces/e2e-tests-nslifetest-49-w768h
Oct 31 00:20:00.761: INFO: namespace : e2e-tests-nslifetest-49-w768h api call to delete is complete 
I1031 00:20:00.795063   20070 request.go:641] Throttling request took 2.062444645s, request: DELETE:https://internal-api.primg540.origin-ci-int-gce.dev.rhcloud.com:8443/api/v1/namespaces/e2e-tests-nslifetest-64-nrrrj
Oct 31 00:20:00.812: INFO: namespace : e2e-tests-nslifetest-64-nrrrj api call to delete is complete 
I1031 00:20:00.845050   20070 request.go:641] Throttling request took 2.112425473s, request: DELETE:https://internal-api.primg540.origin-ci-int-gce.dev.rhcloud.com:8443/api/v1/namespaces/e2e-tests-nslifetest-5-6978h
Oct 31 00:20:00.862: INFO: namespace : e2e-tests-nslifetest-5-6978h api call to delete is complete 
I1031 00:20:00.895075   20070 request.go:641] Throttling request took 2.162440419s, request: DELETE:https://internal-api.primg540.origin-ci-int-gce.dev.rhcloud.com:8443/api/v1/namespaces/e2e-tests-nslifetest-65-ngcwk
Oct 31 00:20:00.911: INFO: namespace : e2e-tests-nslifetest-65-ngcwk api call to delete is complete 
I1031 00:20:00.945123   20070 request.go:641] Throttling request took 2.212478601s, request: DELETE:https://internal-api.primg540.origin-ci-int-gce.dev.rhcloud.com:8443/api/v1/namespaces/e2e-tests-nslifetest-50-mgxgg
Oct 31 00:20:00.962: INFO: namespace : e2e-tests-nslifetest-50-mgxgg api call to delete is complete 
I1031 00:20:00.995078   20070 request.go:641] Throttling request took 2.262435668s, request: DELETE:https://internal-api.primg540.origin-ci-int-gce.dev.rhcloud.com:8443/api/v1/namespaces/e2e-tests-nslifetest-53-f52br
Oct 31 00:20:01.011: INFO: namespace : e2e-tests-nslifetest-53-f52br api call to delete is complete 
I1031 00:20:01.045051   20070 request.go:641] Throttling request took 2.312404719s, request: DELETE:https://internal-api.primg540.origin-ci-int-gce.dev.rhcloud.com:8443/api/v1/namespaces/e2e-tests-nslifetest-54-j88dq
Oct 31 00:20:01.062: INFO: namespace : e2e-tests-nslifetest-54-j88dq api call to delete is complete 
I1031 00:20:01.095046   20070 request.go:641] Throttling request took 2.362392586s, request: DELETE:https://internal-api.primg540.origin-ci-int-gce.dev.rhcloud.com:8443/api/v1/namespaces/e2e-tests-nslifetest-51-npx2d
Oct 31 00:20:01.112: INFO: namespace : e2e-tests-nslifetest-51-npx2d api call to delete is complete 
I1031 00:20:01.145063   20070 request.go:641] Throttling request took 2.412399534s, request: DELETE:https://internal-api.primg540.origin-ci-int-gce.dev.rhcloud.com:8443/api/v1/namespaces/e2e-tests-nslifetest-55-sxp6m
Oct 31 00:20:01.162: INFO: namespace : e2e-tests-nslifetest-55-sxp6m api call to delete is complete 
I1031 00:20:01.195058   20070 request.go:641] Throttling request took 2.4623952s, request: DELETE:https://internal-api.primg540.origin-ci-int-gce.dev.rhcloud.com:8443/api/v1/namespaces/e2e-tests-nslifetest-52-wz6qh
Oct 31 00:20:01.212: INFO: namespace : e2e-tests-nslifetest-52-wz6qh api call to delete is complete 
STEP: Waiting for namespaces to vanish
Oct 31 00:20:03.257: INFO: Remaining namespaces : 100
Oct 31 00:20:05.258: INFO: Remaining namespaces : 90
Oct 31 00:20:07.254: INFO: Remaining namespaces : 80
Oct 31 00:20:09.252: INFO: Remaining namespaces : 66
Oct 31 00:20:11.243: INFO: Remaining namespaces : 50
Oct 31 00:20:13.256: INFO: Remaining namespaces : 42
Oct 31 00:20:15.252: INFO: Remaining namespaces : 30
Oct 31 00:20:17.272: INFO: Remaining namespaces : 15
[AfterEach] [k8s.io] Namespaces [Serial]
  /go/src/github.com/openshift/origin/vendor/k8s.io/kubernetes/test/e2e/framework/framework.go:131
Oct 31 00:20:19.232: INFO: Waiting up to 3m0s for all (but 0) nodes to be ready
STEP: Destroying namespace "e2e-tests-namespaces-l574l" for this suite.
Oct 31 00:20:26.241: INFO: namespace: e2e-tests-namespaces-l574l, resource: bindings, ignored listing per whitelist
Oct 31 00:20:26.637: INFO: namespace e2e-tests-namespaces-l574l deletion completed in 7.373438374s
STEP: Destroying namespace "e2e-tests-nslifetest-99-tn9bv" for this suite.
Oct 31 00:20:26.652: INFO: Namespace e2e-tests-nslifetest-99-tn9bv was already deleted
STEP: Destroying namespace "e2e-tests-nslifetest-40-xj2hx" for this suite.
Oct 31 00:20:26.668: INFO: Namespace e2e-tests-nslifetest-40-xj2hx was already deleted
STEP: Destroying namespace "e2e-tests-nslifetest-19-r4d4g" for this suite.
Oct 31 00:20:26.683: INFO: Namespace e2e-tests-nslifetest-19-r4d4g was already deleted
STEP: Destroying namespace "e2e-tests-nslifetest-0-mw8l4" for this suite.
Oct 31 00:20:26.699: INFO: Namespace e2e-tests-nslifetest-0-mw8l4 was already deleted
STEP: Destroying namespace "e2e-tests-nslifetest-20-tbsk5" for this suite.
Oct 31 00:20:26.714: INFO: Namespace e2e-tests-nslifetest-20-tbsk5 was already deleted
STEP: Destroying namespace "e2e-tests-nslifetest-1-sc6t6" for this suite.
Oct 31 00:20:26.729: INFO: Namespace e2e-tests-nslifetest-1-sc6t6 was already deleted
STEP: Destroying namespace "e2e-tests-nslifetest-21-v9bpn" for this suite.
Oct 31 00:20:26.744: INFO: Namespace e2e-tests-nslifetest-21-v9bpn was already deleted
STEP: Destroying namespace "e2e-tests-nslifetest-22-xw7jw" for this suite.
Oct 31 00:20:26.760: INFO: Namespace e2e-tests-nslifetest-22-xw7jw was already deleted
STEP: Destroying namespace "e2e-tests-nslifetest-2-p8zvj" for this suite.
Oct 31 00:20:26.775: INFO: Namespace e2e-tests-nslifetest-2-p8zvj was already deleted
STEP: Destroying namespace "e2e-tests-nslifetest-42-9rw4p" for this suite.
Oct 31 00:20:26.791: INFO: Namespace e2e-tests-nslifetest-42-9rw4p was already deleted
STEP: Destroying namespace "e2e-tests-nslifetest-3-mngkh" for this suite.
Oct 31 00:20:26.806: INFO: Namespace e2e-tests-nslifetest-3-mngkh was already deleted
STEP: Destroying namespace "e2e-tests-nslifetest-43-n9hdd" for this suite.
Oct 31 00:20:26.822: INFO: Namespace e2e-tests-nslifetest-43-n9hdd was already deleted
STEP: Destroying namespace "e2e-tests-nslifetest-23-8bjqb" for this suite.
Oct 31 00:20:26.837: INFO: Namespace e2e-tests-nslifetest-23-8bjqb was already deleted
STEP: Destroying namespace "e2e-tests-nslifetest-55-sxp6m" for this suite.
Oct 31 00:20:26.852: INFO: Namespace e2e-tests-nslifetest-55-sxp6m was already deleted
STEP: Destroying namespace "e2e-tests-nslifetest-44-tpsfk" for this suite.
Oct 31 00:20:26.868: INFO: Namespace e2e-tests-nslifetest-44-tpsfk was already deleted
STEP: Destroying namespace "e2e-tests-nslifetest-4-5ddp4" for this suite.
Oct 31 00:20:26.884: INFO: Namespace e2e-tests-nslifetest-4-5ddp4 was already deleted
STEP: Destroying namespace "e2e-tests-nslifetest-31-lphj7" for this suite.
Oct 31 00:20:26.899: INFO: Namespace e2e-tests-nslifetest-31-lphj7 was already deleted
STEP: Destroying namespace "e2e-tests-nslifetest-24-t8b8z" for this suite.
Oct 31 00:20:26.915: INFO: Namespace e2e-tests-nslifetest-24-t8b8z was already deleted
STEP: Destroying namespace "e2e-tests-nslifetest-45-b2mgs" for this suite.
Oct 31 00:20:26.930: INFO: Namespace e2e-tests-nslifetest-45-b2mgs was already deleted
STEP: Destroying namespace "e2e-tests-nslifetest-56-2t269" for this suite.
Oct 31 00:20:26.945: INFO: Namespace e2e-tests-nslifetest-56-2t269 was already deleted
STEP: Destroying namespace "e2e-tests-nslifetest-25-j7lzl" for this suite.
Oct 31 00:20:26.961: INFO: Namespace e2e-tests-nslifetest-25-j7lzl was already deleted
STEP: Destroying namespace "e2e-tests-nslifetest-46-f54cm" for this suite.
Oct 31 00:20:26.976: INFO: Namespace e2e-tests-nslifetest-46-f54cm was already deleted
STEP: Destroying namespace "e2e-tests-nslifetest-5-6978h" for this suite.
Oct 31 00:20:26.992: INFO: Namespace e2e-tests-nslifetest-5-6978h was already deleted
STEP: Destroying namespace "e2e-tests-nslifetest-47-vktcp" for this suite.
Oct 31 00:20:27.007: INFO: Namespace e2e-tests-nslifetest-47-vktcp was already deleted
STEP: Destroying namespace "e2e-tests-nslifetest-26-bmwcv" for this suite.
Oct 31 00:20:27.022: INFO: Namespace e2e-tests-nslifetest-26-bmwcv was already deleted
STEP: Destroying namespace "e2e-tests-nslifetest-11-sqlsl" for this suite.
Oct 31 00:20:27.038: INFO: Namespace e2e-tests-nslifetest-11-sqlsl was already deleted
STEP: Destroying namespace "e2e-tests-nslifetest-6-vhgnw" for this suite.
Oct 31 00:20:27.054: INFO: Namespace e2e-tests-nslifetest-6-vhgnw was already deleted
STEP: Destroying namespace "e2e-tests-nslifetest-48-lnw9n" for this suite.
Oct 31 00:20:27.070: INFO: Namespace e2e-tests-nslifetest-48-lnw9n was already deleted
STEP: Destroying namespace "e2e-tests-nslifetest-27-5plpn" for this suite.
Oct 31 00:20:27.085: INFO: Namespace e2e-tests-nslifetest-27-5plpn was already deleted
STEP: Destroying namespace "e2e-tests-nslifetest-49-w768h" for this suite.
Oct 31 00:20:27.101: INFO: Namespace e2e-tests-nslifetest-49-w768h was already deleted
STEP: Destroying namespace "e2e-tests-nslifetest-7-hp7w5" for this suite.
Oct 31 00:20:27.117: INFO: Namespace e2e-tests-nslifetest-7-hp7w5 was already deleted
STEP: Destroying namespace "e2e-tests-nslifetest-57-frcck" for this suite.
Oct 31 00:20:27.134: INFO: Namespace e2e-tests-nslifetest-57-frcck was already deleted
STEP: Destroying namespace "e2e-tests-nslifetest-60-5nkqw" for this suite.
Oct 31 00:20:27.149: INFO: Namespace e2e-tests-nslifetest-60-5nkqw was already deleted
STEP: Destroying namespace "e2e-tests-nslifetest-12-8b5vv" for this suite.
Oct 31 00:20:27.165: INFO: Namespace e2e-tests-nslifetest-12-8b5vv was already deleted
STEP: Destroying namespace "e2e-tests-nslifetest-50-mgxgg" for this suite.
Oct 31 00:20:27.181: INFO: Namespace e2e-tests-nslifetest-50-mgxgg was already deleted
STEP: Destroying namespace "e2e-tests-nslifetest-8-6whn4" for this suite.
Oct 31 00:20:27.196: INFO: Namespace e2e-tests-nslifetest-8-6whn4 was already deleted
STEP: Destroying namespace "e2e-tests-nslifetest-51-npx2d" for this suite.
Oct 31 00:20:27.212: INFO: Namespace e2e-tests-nslifetest-51-npx2d was already deleted
STEP: Destroying namespace "e2e-tests-nslifetest-28-w59rt" for this suite.
Oct 31 00:20:27.231: INFO: Namespace e2e-tests-nslifetest-28-w59rt was already deleted
STEP: Destroying namespace "e2e-tests-nslifetest-52-wz6qh" for this suite.
Oct 31 00:20:27.248: INFO: Namespace e2e-tests-nslifetest-52-wz6qh was already deleted
STEP: Destroying namespace "e2e-tests-nslifetest-29-vbqss" for this suite.
Oct 31 00:20:27.266: INFO: Namespace e2e-tests-nslifetest-29-vbqss was already deleted
STEP: Destroying namespace "e2e-tests-nslifetest-9-vpgrg" for this suite.
Oct 31 00:20:27.282: INFO: Namespace e2e-tests-nslifetest-9-vpgrg was already deleted
STEP: Destroying namespace "e2e-tests-nslifetest-32-k46bn" for this suite.
Oct 31 00:20:27.302: INFO: Namespace e2e-tests-nslifetest-32-k46bn was already deleted
STEP: Destroying namespace "e2e-tests-nslifetest-59-cw46c" for this suite.
Oct 31 00:20:27.319: INFO: Namespace e2e-tests-nslifetest-59-cw46c was already deleted
STEP: Destroying namespace "e2e-tests-nslifetest-58-kgmc8" for this suite.
Oct 31 00:20:27.336: INFO: Namespace e2e-tests-nslifetest-58-kgmc8 was already deleted
STEP: Destroying namespace "e2e-tests-nslifetest-33-4mjx4" for this suite.
Oct 31 00:20:27.358: INFO: Namespace e2e-tests-nslifetest-33-4mjx4 was already deleted
STEP: Destroying namespace "e2e-tests-nslifetest-53-f52br" for this suite.
Oct 31 00:20:27.374: INFO: Namespace e2e-tests-nslifetest-53-f52br was already deleted
STEP: Destroying namespace "e2e-tests-nslifetest-54-j88dq" for this suite.
Oct 31 00:20:27.399: INFO: Namespace e2e-tests-nslifetest-54-j88dq was already deleted
STEP: Destroying namespace "e2e-tests-nslifetest-30-g429q" for this suite.
Oct 31 00:20:27.422: INFO: Namespace e2e-tests-nslifetest-30-g429q was already deleted
STEP: Destroying namespace "e2e-tests-nslifetest-10-gcrgj" for this suite.
Oct 31 00:20:27.447: INFO: Namespace e2e-tests-nslifetest-10-gcrgj was already deleted
STEP: Destroying namespace "e2e-tests-nslifetest-41-sf96v" for this suite.
Oct 31 00:20:27.465: INFO: Namespace e2e-tests-nslifetest-41-sf96v was already deleted
STEP: Destroying namespace "e2e-tests-nslifetest-34-8qjzz" for this suite.
Oct 31 00:20:27.490: INFO: Namespace e2e-tests-nslifetest-34-8qjzz was already deleted
STEP: Destroying namespace "e2e-tests-nslifetest-13-62wnj" for this suite.
Oct 31 00:20:27.519: INFO: Namespace e2e-tests-nslifetest-13-62wnj was already deleted
STEP: Destroying namespace "e2e-tests-nslifetest-14-g47f2" for this suite.
Oct 31 00:20:27.542: INFO: Namespace e2e-tests-nslifetest-14-g47f2 was already deleted
STEP: Destroying namespace "e2e-tests-nslifetest-62-42cnm" for this suite.
Oct 31 00:20:27.572: INFO: Namespace e2e-tests-nslifetest-62-42cnm was already deleted
STEP: Destroying namespace "e2e-tests-nslifetest-61-x9rx6" for this suite.
Oct 31 00:20:27.593: INFO: Namespace e2e-tests-nslifetest-61-x9rx6 was already deleted
STEP: Destroying namespace "e2e-tests-nslifetest-15-srrfm" for this suite.
Oct 31 00:20:27.618: INFO: Namespace e2e-tests-nslifetest-15-srrfm was already deleted
STEP: Destroying namespace "e2e-tests-nslifetest-35-gwx9w" for this suite.
Oct 31 00:20:27.635: INFO: Namespace e2e-tests-nslifetest-35-gwx9w was already deleted
STEP: Destroying namespace "e2e-tests-nslifetest-63-wrsdc" for this suite.
Oct 31 00:20:27.654: INFO: Namespace e2e-tests-nslifetest-63-wrsdc was already deleted
STEP: Destroying namespace "e2e-tests-nslifetest-16-l8mwx" for this suite.
Oct 31 00:20:27.671: INFO: Namespace e2e-tests-nslifetest-16-l8mwx was already deleted
STEP: Destroying namespace "e2e-tests-nslifetest-36-2ksjc" for this suite.
Oct 31 00:20:27.691: INFO: Namespace e2e-tests-nslifetest-36-2ksjc was already deleted
STEP: Destroying namespace "e2e-tests-nslifetest-65-ngcwk" for this suite.
Oct 31 00:20:27.709: INFO: Namespace e2e-tests-nslifetest-65-ngcwk was already deleted
STEP: Destroying namespace "e2e-tests-nslifetest-64-nrrrj" for this suite.
Oct 31 00:20:27.729: INFO: Namespace e2e-tests-nslifetest-64-nrrrj was already deleted
STEP: Destroying namespace "e2e-tests-nslifetest-37-m2z49" for this suite.
Oct 31 00:20:27.749: INFO: Namespace e2e-tests-nslifetest-37-m2z49 was already deleted
STEP: Destroying namespace "e2e-tests-nslifetest-17-7dm2r" for this suite.
Oct 31 00:20:27.766: INFO: Namespace e2e-tests-nslifetest-17-7dm2r was already deleted
STEP: Destroying namespace "e2e-tests-nslifetest-67-2h2xs" for this suite.
Oct 31 00:20:27.784: INFO: Namespace e2e-tests-nslifetest-67-2h2xs was already deleted
STEP: Destroying namespace "e2e-tests-nslifetest-66-99g5j" for this suite.
Oct 31 00:20:27.810: INFO: Namespace e2e-tests-nslifetest-66-99g5j was already deleted
STEP: Destroying namespace "e2e-tests-nslifetest-38-rq2j5" for this suite.
Oct 31 00:20:27.862: INFO: Namespace e2e-tests-nslifetest-38-rq2j5 was already deleted
STEP: Destroying namespace "e2e-tests-nslifetest-18-btnff" for this suite.
Oct 31 00:20:27.912: INFO: Namespace e2e-tests-nslifetest-18-btnff was already deleted
STEP: Destroying namespace "e2e-tests-nslifetest-68-xk74g" for this suite.
Oct 31 00:20:27.961: INFO: Namespace e2e-tests-nslifetest-68-xk74g was already deleted
STEP: Destroying namespace "e2e-tests-nslifetest-85-k7xpm" for this suite.
Oct 31 00:20:28.013: INFO: Namespace e2e-tests-nslifetest-85-k7xpm was already deleted
STEP: Destroying namespace "e2e-tests-nslifetest-84-wgknq" for this suite.
Oct 31 00:20:28.063: INFO: Namespace e2e-tests-nslifetest-84-wgknq was already deleted
STEP: Destroying namespace "e2e-tests-nslifetest-39-6tctx" for this suite.
Oct 31 00:20:28.112: INFO: Namespace e2e-tests-nslifetest-39-6tctx was already deleted
STEP: Destroying namespace "e2e-tests-nslifetest-86-dtnrz" for this suite.
Oct 31 00:20:28.163: INFO: Namespace e2e-tests-nslifetest-86-dtnrz was already deleted
STEP: Destroying namespace "e2e-tests-nslifetest-87-sbjhf" for this suite.
Oct 31 00:20:28.210: INFO: Namespace e2e-tests-nslifetest-87-sbjhf was already deleted
STEP: Destroying namespace "e2e-tests-nslifetest-69-fkgj6" for this suite.
Oct 31 00:20:28.261: INFO: Namespace e2e-tests-nslifetest-69-fkgj6 was already deleted
STEP: Destroying namespace "e2e-tests-nslifetest-76-pd6kf" for this suite.
Oct 31 00:20:28.312: INFO: Namespace e2e-tests-nslifetest-76-pd6kf was already deleted
STEP: Destroying namespace "e2e-tests-nslifetest-88-jbmfh" for this suite.
Oct 31 00:20:28.372: INFO: Namespace e2e-tests-nslifetest-88-jbmfh was already deleted
STEP: Destroying namespace "e2e-tests-nslifetest-70-gfp74" for this suite.
Oct 31 00:20:28.411: INFO: Namespace e2e-tests-nslifetest-70-gfp74 was already deleted
STEP: Destroying namespace "e2e-tests-nslifetest-77-ctjhs" for this suite.
Oct 31 00:20:28.465: INFO: Namespace e2e-tests-nslifetest-77-ctjhs was already deleted
STEP: Destroying namespace "e2e-tests-nslifetest-89-svv7r" for this suite.
Oct 31 00:20:28.511: INFO: Namespace e2e-tests-nslifetest-89-svv7r was already deleted
STEP: Destroying namespace "e2e-tests-nslifetest-90-zsh69" for this suite.
Oct 31 00:20:28.566: INFO: Namespace e2e-tests-nslifetest-90-zsh69 was already deleted
STEP: Destroying namespace "e2e-tests-nslifetest-71-n55qg" for this suite.
Oct 31 00:20:28.613: INFO: Namespace e2e-tests-nslifetest-71-n55qg was already deleted
STEP: Destroying namespace "e2e-tests-nslifetest-78-m9xww" for this suite.
Oct 31 00:20:28.664: INFO: Namespace e2e-tests-nslifetest-78-m9xww was already deleted
STEP: Destroying namespace "e2e-tests-nslifetest-91-svdk2" for this suite.
Oct 31 00:20:28.711: INFO: Namespace e2e-tests-nslifetest-91-svdk2 was already deleted
STEP: Destroying namespace "e2e-tests-nslifetest-92-m6t52" for this suite.
Oct 31 00:20:28.763: INFO: Namespace e2e-tests-nslifetest-92-m6t52 was already deleted
STEP: Destroying namespace "e2e-tests-nslifetest-72-kjqd7" for this suite.
Oct 31 00:20:28.814: INFO: Namespace e2e-tests-nslifetest-72-kjqd7 was already deleted
STEP: Destroying namespace "e2e-tests-nslifetest-79-hrwgn" for this suite.
Oct 31 00:20:28.863: INFO: Namespace e2e-tests-nslifetest-79-hrwgn was already deleted
STEP: Destroying namespace "e2e-tests-nslifetest-93-6b2hl" for this suite.
Oct 31 00:20:28.915: INFO: Namespace e2e-tests-nslifetest-93-6b2hl was already deleted
STEP: Destroying namespace "e2e-tests-nslifetest-73-wq9fj" for this suite.
Oct 31 00:20:28.966: INFO: Namespace e2e-tests-nslifetest-73-wq9fj was already deleted
STEP: Destroying namespace "e2e-tests-nslifetest-80-dtvpf" for this suite.
Oct 31 00:20:29.010: INFO: Namespace e2e-tests-nslifetest-80-dtvpf was already deleted
STEP: Destroying namespace "e2e-tests-nslifetest-94-sk7fv" for this suite.
Oct 31 00:20:29.060: INFO: Namespace e2e-tests-nslifetest-94-sk7fv was already deleted
STEP: Destroying namespace "e2e-tests-nslifetest-74-q5bcg" for this suite.
Oct 31 00:20:29.110: INFO: Namespace e2e-tests-nslifetest-74-q5bcg was already deleted
STEP: Destroying namespace "e2e-tests-nslifetest-82-p55kt" for this suite.
Oct 31 00:20:29.160: INFO: Namespace e2e-tests-nslifetest-82-p55kt was already deleted
STEP: Destroying namespace "e2e-tests-nslifetest-95-6dhsl" for this suite.
Oct 31 00:20:29.219: INFO: Namespace e2e-tests-nslifetest-95-6dhsl was already deleted
STEP: Destroying namespace "e2e-tests-nslifetest-96-7jl2b" for this suite.
Oct 31 00:20:29.261: INFO: Namespace e2e-tests-nslifetest-96-7jl2b was already deleted
STEP: Destroying namespace "e2e-tests-nslifetest-75-lct8f" for this suite.
Oct 31 00:20:29.375: INFO: Namespace e2e-tests-nslifetest-75-lct8f was already deleted
STEP: Destroying namespace "e2e-tests-nslifetest-81-g767s" for this suite.
Oct 31 00:20:29.402: INFO: Namespace e2e-tests-nslifetest-81-g767s was already deleted
STEP: Destroying namespace "e2e-tests-nslifetest-97-gv6tx" for this suite.
Oct 31 00:20:29.427: INFO: Namespace e2e-tests-nslifetest-97-gv6tx was already deleted
STEP: Destroying namespace "e2e-tests-nslifetest-83-v7cdc" for this suite.
Oct 31 00:20:29.468: INFO: Namespace e2e-tests-nslifetest-83-v7cdc was already deleted
STEP: Destroying namespace "e2e-tests-nslifetest-98-b7jc7" for this suite.
Oct 31 00:20:29.510: INFO: Namespace e2e-tests-nslifetest-98-b7jc7 was already deleted

• [SLOW TEST:45.167 seconds]
[k8s.io] Namespaces [Serial]
/go/src/github.com/openshift/origin/vendor/k8s.io/kubernetes/test/e2e/framework/framework.go:620
  should delete fast enough (90 percent of 100 namespaces in 150 seconds) [Suite:openshift/conformance/serial] [Suite:k8s]
  /go/src/github.com/openshift/origin/vendor/k8s.io/kubernetes/test/e2e/namespace.go:271
------------------------------
SSSSSSSSSSSSSSSSSSSSSSSSSSSSSSSSSSSSSSSSSSSSSSSSSSSSSSSSSSSSSSSSSSSSSSSSSSSSSSSSSSSSSSSSSSSSSSSSSSSSSSSSSSSSSSSSSSSSSSSSSSSSSSSSSSSSSSSSSSSSSSSSSSSSSSSSSSSSSSSSSSSSSSSSSSSSSSSSSSSSSSSSSSSSSSSSSOct 31 00:20:29.512: INFO: Running AfterSuite actions on all node
Oct 31 00:20:29.512: INFO: Running AfterSuite actions on node 1

Ran 5 of 804 Specs in 173.385 seconds
SUCCESS! -- 5 Passed | 0 Failed | 0 Pending | 799 Skipped Oct 31 00:20:29.521: INFO: Error running cluster/log-dump/log-dump.sh: fork/exec /data/src/github.com/openshift/origin/vendor/k8s.io/kubernetes/cluster/log-dump/log-dump.sh: no such file or directory
PASS

Ginkgo ran 1 suite in 2m54.072973426s
Test Suite Passed
[INFO] [CLEANUP] Beginning cleanup routines...
[INFO] [CLEANUP] Dumping cluster events to _output/scripts/conformance/artifacts/events.txt
Logged into "https://internal-api.primg540.origin-ci-int-gce.dev.rhcloud.com:8443" as "system:admin" using existing credentials.

You have access to the following projects and can switch between them with 'oc project <projectname>':

  * default
    kube-public
    kube-system
    logging
    management-infra
    openshift
    openshift-infra
    openshift-node

Using project "default".
[INFO] [CLEANUP] Dumping container logs to _output/scripts/conformance/logs/containers
[INFO] [CLEANUP] Truncating log files over 200M
[INFO] [CLEANUP] Stopping docker containers
[INFO] [CLEANUP] Removing docker containers
[INFO] [CLEANUP] Killing child processes
[ERROR] test/extended/conformance.sh exited with code 1 after 00h 13m 16s

real	13m15.391s
user	3m26.710s
sys	0m29.625s
+ failure=1
+ [[ branch_success == \b\r\a\n\c\h\_\s\u\c\c\e\s\s ]]
+ [[ 1 != 1 ]]
+ [[ branch_success == \b\r\a\n\c\h ]]
+ [[ branch_success == \n\o\w ]]
+ exit 1
+ gather
+ set +e
++ pwd
+ export PATH=/data/src/github.com/openshift/origin/_output/local/bin/linux/amd64:/var/lib/jenkins/jobs/zz_origin_gce_image/workspace/_output/local/bin/linux/amd64:/usr/local/bin:/usr/bin:/usr/local/sbin:/usr/sbin:/home/origin/.local/bin:/home/origin/bin
+ PATH=/data/src/github.com/openshift/origin/_output/local/bin/linux/amd64:/var/lib/jenkins/jobs/zz_origin_gce_image/workspace/_output/local/bin/linux/amd64:/usr/local/bin:/usr/bin:/usr/local/sbin:/usr/sbin:/home/origin/.local/bin:/home/origin/bin
+ oc get nodes --template '{{ range .items }}{{ .metadata.name }}{{ "\n" }}{{ end }}'
+ xargs -L 1 -I X bash -c 'oc get --raw /api/v1/nodes/X/proxy/metrics > /tmp/artifacts/X.metrics' ''
+ oc get --raw /metrics
+ set -e
Build step 'Execute shell' marked build as failure
[PostBuildScript] - Execution post build scripts.
[workspace] $ /bin/bash /tmp/jenkins2075126397546357615.sh
~/jobs/zz_origin_gce_image/workspace ~/jobs/zz_origin_gce_image/workspace
/tmp/jenkins2075126397546357615.sh: line 6: .venv/bin/activate: No such file or directory
Activated service account credentials for: [jenkins-ci-provisioner@openshift-gce-devel.iam.gserviceaccount.com]

PLAY [Terminate running cluster and remove all supporting resources in GCE] ****

TASK [Gathering Facts] *********************************************************
Tuesday 31 October 2017  00:20:40 +0000 (0:00:00.054)       0:00:00.054 ******* 
ok: [localhost]

TASK [openshift_gcp : Templatize DNS script] ***********************************
Tuesday 31 October 2017  00:20:45 +0000 (0:00:04.478)       0:00:04.533 ******* 
changed: [localhost]

TASK [openshift_gcp : Templatize provision script] *****************************
Tuesday 31 October 2017  00:20:45 +0000 (0:00:00.485)       0:00:05.018 ******* 
changed: [localhost]

TASK [openshift_gcp : Templatize de-provision script] **************************
Tuesday 31 October 2017  00:20:45 +0000 (0:00:00.301)       0:00:05.320 ******* 
changed: [localhost]

TASK [openshift_gcp : Provision GCP DNS domain] ********************************
Tuesday 31 October 2017  00:20:46 +0000 (0:00:00.272)       0:00:05.592 ******* 
skipping: [localhost]

TASK [openshift_gcp : Ensure that DNS resolves to the hosted zone] *************
Tuesday 31 October 2017  00:20:46 +0000 (0:00:00.021)       0:00:05.614 ******* 
skipping: [localhost]

TASK [openshift_gcp : Provision GCP resources] *********************************
Tuesday 31 October 2017  00:20:46 +0000 (0:00:00.020)       0:00:05.634 ******* 
skipping: [localhost]

TASK [openshift_gcp : De-provision GCP resources] ******************************
Tuesday 31 October 2017  00:20:46 +0000 (0:00:00.019)       0:00:05.654 ******* 
changed: [localhost]

PLAY RECAP *********************************************************************
localhost                  : ok=5    changed=4    unreachable=0    failed=0   

Tuesday 31 October 2017  00:26:39 +0000 (0:05:53.294)       0:05:58.949 ******* 
=============================================================================== 
openshift_gcp : De-provision GCP resources ---------------------------- 353.29s
Gathering Facts --------------------------------------------------------- 4.48s
openshift_gcp : Templatize DNS script ----------------------------------- 0.49s
openshift_gcp : Templatize provision script ----------------------------- 0.30s
openshift_gcp : Templatize de-provision script -------------------------- 0.27s
openshift_gcp : Provision GCP DNS domain -------------------------------- 0.02s
openshift_gcp : Ensure that DNS resolves to the hosted zone ------------- 0.02s
openshift_gcp : Provision GCP resources --------------------------------- 0.02s
/var/lib/jenkins/jobs/zz_origin_gce_image/workspace/artifacts
/var/lib/jenkins/jobs/zz_origin_gce_image/workspace/artifacts/junit
/var/lib/jenkins/jobs/zz_origin_gce_image/workspace/artifacts/ci-primg540-ig-m-gdck.metrics
/var/lib/jenkins/jobs/zz_origin_gce_image/workspace/artifacts/ci-primg540-ig-n-h8q0.metrics
/var/lib/jenkins/jobs/zz_origin_gce_image/workspace/artifacts/ci-primg540-ig-n-jq8k.metrics
/var/lib/jenkins/jobs/zz_origin_gce_image/workspace/artifacts/ci-primg540-ig-n-qlb9.metrics
/var/lib/jenkins/jobs/zz_origin_gce_image/workspace/artifacts/master.metrics
/var/lib/jenkins/jobs/zz_origin_gce_image/workspace/artifacts/openshift
/var/lib/jenkins/jobs/zz_origin_gce_image/workspace/artifacts/openshift/conformance
/var/lib/jenkins/jobs/zz_origin_gce_image/workspace/artifacts/openshift/conformance/volumes
/var/lib/jenkins/jobs/zz_origin_gce_image/workspace/artifacts/openshift/env
/var/lib/jenkins/jobs/zz_origin_gce_image/workspace/artifacts/openshift/env/volumes
/var/lib/jenkins/jobs/zz_origin_gce_image/workspace/artifacts/scripts
/var/lib/jenkins/jobs/zz_origin_gce_image/workspace/artifacts/scripts/conformance
/var/lib/jenkins/jobs/zz_origin_gce_image/workspace/artifacts/scripts/conformance/artifacts
/var/lib/jenkins/jobs/zz_origin_gce_image/workspace/artifacts/scripts/conformance/artifacts/junit
/var/lib/jenkins/jobs/zz_origin_gce_image/workspace/artifacts/scripts/conformance/artifacts/junit/conformance_parallel_01.xml
/var/lib/jenkins/jobs/zz_origin_gce_image/workspace/artifacts/scripts/conformance/artifacts/junit/conformance_parallel_02.xml
/var/lib/jenkins/jobs/zz_origin_gce_image/workspace/artifacts/scripts/conformance/artifacts/junit/conformance_parallel_03.xml
/var/lib/jenkins/jobs/zz_origin_gce_image/workspace/artifacts/scripts/conformance/artifacts/junit/conformance_parallel_04.xml
/var/lib/jenkins/jobs/zz_origin_gce_image/workspace/artifacts/scripts/conformance/artifacts/junit/conformance_parallel_05.xml
/var/lib/jenkins/jobs/zz_origin_gce_image/workspace/artifacts/scripts/conformance/artifacts/junit/conformance_parallel_06.xml
/var/lib/jenkins/jobs/zz_origin_gce_image/workspace/artifacts/scripts/conformance/artifacts/junit/conformance_parallel_07.xml
/var/lib/jenkins/jobs/zz_origin_gce_image/workspace/artifacts/scripts/conformance/artifacts/junit/conformance_parallel_08.xml
/var/lib/jenkins/jobs/zz_origin_gce_image/workspace/artifacts/scripts/conformance/artifacts/junit/conformance_parallel_09.xml
/var/lib/jenkins/jobs/zz_origin_gce_image/workspace/artifacts/scripts/conformance/artifacts/junit/conformance_parallel_10.xml
/var/lib/jenkins/jobs/zz_origin_gce_image/workspace/artifacts/scripts/conformance/artifacts/junit/conformance_parallel_11.xml
/var/lib/jenkins/jobs/zz_origin_gce_image/workspace/artifacts/scripts/conformance/artifacts/junit/conformance_parallel_12.xml
/var/lib/jenkins/jobs/zz_origin_gce_image/workspace/artifacts/scripts/conformance/artifacts/junit/conformance_parallel_13.xml
/var/lib/jenkins/jobs/zz_origin_gce_image/workspace/artifacts/scripts/conformance/artifacts/junit/conformance_parallel_14.xml
/var/lib/jenkins/jobs/zz_origin_gce_image/workspace/artifacts/scripts/conformance/artifacts/junit/conformance_parallel_15.xml
/var/lib/jenkins/jobs/zz_origin_gce_image/workspace/artifacts/scripts/conformance/artifacts/junit/conformance_parallel_16.xml
/var/lib/jenkins/jobs/zz_origin_gce_image/workspace/artifacts/scripts/conformance/artifacts/junit/conformance_parallel_17.xml
/var/lib/jenkins/jobs/zz_origin_gce_image/workspace/artifacts/scripts/conformance/artifacts/junit/conformance_parallel_18.xml
/var/lib/jenkins/jobs/zz_origin_gce_image/workspace/artifacts/scripts/conformance/artifacts/junit/conformance_parallel_19.xml
/var/lib/jenkins/jobs/zz_origin_gce_image/workspace/artifacts/scripts/conformance/artifacts/junit/conformance_parallel_20.xml
/var/lib/jenkins/jobs/zz_origin_gce_image/workspace/artifacts/scripts/conformance/artifacts/junit/conformance_parallel_21.xml
/var/lib/jenkins/jobs/zz_origin_gce_image/workspace/artifacts/scripts/conformance/artifacts/junit/conformance_parallel_22.xml
/var/lib/jenkins/jobs/zz_origin_gce_image/workspace/artifacts/scripts/conformance/artifacts/junit/conformance_parallel_23.xml
/var/lib/jenkins/jobs/zz_origin_gce_image/workspace/artifacts/scripts/conformance/artifacts/junit/conformance_parallel_24.xml
/var/lib/jenkins/jobs/zz_origin_gce_image/workspace/artifacts/scripts/conformance/artifacts/junit/conformance_parallel_25.xml
/var/lib/jenkins/jobs/zz_origin_gce_image/workspace/artifacts/scripts/conformance/artifacts/junit/conformance_serial_01.xml
/var/lib/jenkins/jobs/zz_origin_gce_image/workspace/artifacts/scripts/conformance/artifacts/events.txt
/var/lib/jenkins/jobs/zz_origin_gce_image/workspace/artifacts/scripts/conformance/logs
/var/lib/jenkins/jobs/zz_origin_gce_image/workspace/artifacts/scripts/conformance/logs/containers
/var/lib/jenkins/jobs/zz_origin_gce_image/workspace/artifacts/scripts/conformance/logs/scripts.log
/var/lib/jenkins/jobs/zz_origin_gce_image/workspace/artifacts/scripts/conformance/openshift.local.home
/var/lib/jenkins/jobs/zz_origin_gce_image/workspace/artifacts/scripts/env
/var/lib/jenkins/jobs/zz_origin_gce_image/workspace/artifacts/scripts/env/artifacts
/var/lib/jenkins/jobs/zz_origin_gce_image/workspace/artifacts/scripts/env/logs
/var/lib/jenkins/jobs/zz_origin_gce_image/workspace/artifacts/scripts/env/logs/scripts.log
/var/lib/jenkins/jobs/zz_origin_gce_image/workspace/artifacts/scripts/env/openshift.local.home
/tmp/jenkins2075126397546357615.sh: line 25: oct: command not found
~/jobs/zz_origin_gce_image/workspace
Recording test results
Archiving artifacts
[BFA] Scanning build for known causes...
[BFA] Found failure cause(s):
[BFA] Extended Test Failure
[BFA] Extended test failure
[BFA] Done. 41s
Adding one-line test results to commit status...
Setting status of 3703d555ac71ad6c32841ec79acb0f704e218242 to FAILURE with url https://ci.openshift.redhat.com/jenkins/job/zz_origin_gce_image/540/ and message: ' 1608 tests run, 1363 skipped, 1 failed.'
Using context: ci/zz_origin_gce_image
Finished: FAILURE