FailedConsole Output

Skipping 102 KB.. Full Log
[WARNING] [08:44:39+0000] testing.runTests.func1(0xc4200b8000)
[WARNING] [08:44:39+0000] 	/usr/local/go/src/testing/testing.go:1004 +0x64
[WARNING] [08:44:39+0000] testing.tRunner(0xc4200b8000, 0xc420043de0)
[WARNING] [08:44:39+0000] 	/usr/local/go/src/testing/testing.go:746 +0xd0
[WARNING] [08:44:39+0000] testing.runTests(0xc42000a2c0, 0x6b6d00, 0x1, 0x1, 0x0)
[WARNING] [08:44:39+0000] 	/usr/local/go/src/testing/testing.go:1002 +0x2d8
[WARNING] [08:44:39+0000] testing.(*M).Run(0xc420043f18, 0xc420043f70)
[WARNING] [08:44:39+0000] 	/usr/local/go/src/testing/testing.go:921 +0x111
[WARNING] [08:44:39+0000] main.main()
[WARNING] [08:44:39+0000] 	github.com/openshift/origin/test/integration/runner/_test/_testmain.go:44 +0xdb
[WARNING] [08:44:39+0000] goroutine 6 [chan receive, 30 minutes]:
[WARNING] [08:44:39+0000] testing.tRunner.func1(0xc4200b80f0)
[WARNING] [08:44:39+0000] 	/usr/local/go/src/testing/testing.go:722 +0x131
[WARNING] [08:44:39+0000] testing.tRunner(0xc4200b80f0, 0x5d58c0)
[WARNING] [08:44:39+0000] 	/usr/local/go/src/testing/testing.go:748 +0xda
[WARNING] [08:44:39+0000] created by testing.(*T).Run
[WARNING] [08:44:39+0000] 	/usr/local/go/src/testing/testing.go:789 +0x2de
[WARNING] [08:44:39+0000] goroutine 12 [chan receive, 31 minutes]:
[WARNING] [08:44:39+0000] testing.(*testContext).waitParallel(0xc42000e870)
[WARNING] [08:44:39+0000] 	/usr/local/go/src/testing/testing.go:833 +0x9f
[WARNING] [08:44:39+0000] testing.(*T).Parallel(0xc4200b82d0)
[WARNING] [08:44:39+0000] 	/usr/local/go/src/testing/testing.go:678 +0x13f
[WARNING] [08:44:39+0000] github.com/openshift/origin/test/integration/runner.executeTests.func1(0xc4200b82d0)
[WARNING] [08:44:39+0000] 	/go/src/github.com/openshift/origin/_output/local/go/src/github.com/openshift/origin/test/integration/runner/runner_test.go:112 +0x9f
[WARNING] [08:44:39+0000] testing.tRunner(0xc4200b82d0, 0xc4202cfb40)
[WARNING] [08:44:39+0000] 	/usr/local/go/src/testing/testing.go:746 +0xd0
[WARNING] [08:44:39+0000] created by testing.(*T).Run
[WARNING] [08:44:39+0000] 	/usr/local/go/src/testing/testing.go:789 +0x2de
[WARNING] [08:44:39+0000] goroutine 13 [chan receive, 31 minutes]:
[WARNING] [08:44:39+0000] testing.(*testContext).waitParallel(0xc42000e870)
[WARNING] [08:44:39+0000] 	/usr/local/go/src/testing/testing.go:833 +0x9f
[WARNING] [08:44:39+0000] testing.(*T).Parallel(0xc4200b83c0)
[WARNING] [08:44:39+0000] 	/usr/local/go/src/testing/testing.go:678 +0x13f
[WARNING] [08:44:39+0000] github.com/openshift/origin/test/integration/runner.executeTests.func1(0xc4200b83c0)
[WARNING] [08:44:39+0000] 	/go/src/github.com/openshift/origin/_output/local/go/src/github.com/openshift/origin/test/integration/runner/runner_test.go:112 +0x9f
[WARNING] [08:44:39+0000] testing.tRunner(0xc4200b83c0, 0xc4202cfb80)
[WARNING] [08:44:39+0000] 	/usr/local/go/src/testing/testing.go:746 +0xd0
[WARNING] [08:44:39+0000] created by testing.(*T).Run
[WARNING] [08:44:39+0000] 	/usr/local/go/src/testing/testing.go:789 +0x2de
[WARNING] [08:44:39+0000] goroutine 14 [chan receive, 31 minutes]:
[WARNING] [08:44:39+0000] testing.(*testContext).waitParallel(0xc42000e870)
[WARNING] [08:44:39+0000] 	/usr/local/go/src/testing/testing.go:833 +0x9f
[WARNING] [08:44:39+0000] testing.(*T).Parallel(0xc4200b84b0)
[WARNING] [08:44:39+0000] 	/usr/local/go/src/testing/testing.go:678 +0x13f
[WARNING] [08:44:39+0000] github.com/openshift/origin/test/integration/runner.executeTests.func1(0xc4200b84b0)
[WARNING] [08:44:39+0000] 	/go/src/github.com/openshift/origin/_output/local/go/src/github.com/openshift/origin/test/integration/runner/runner_test.go:112 +0x9f
[WARNING] [08:44:39+0000] testing.tRunner(0xc4200b84b0, 0xc4202cfbc0)
[WARNING] [08:44:39+0000] 	/usr/local/go/src/testing/testing.go:746 +0xd0
[WARNING] [08:44:39+0000] created by testing.(*T).Run
[WARNING] [08:44:39+0000] 	/usr/local/go/src/testing/testing.go:789 +0x2de
[WARNING] [08:44:39+0000] goroutine 15 [chan receive, 31 minutes]:
[WARNING] [08:44:39+0000] testing.(*testContext).waitParallel(0xc42000e870)
[WARNING] [08:44:39+0000] 	/usr/local/go/src/testing/testing.go:833 +0x9f
[WARNING] [08:44:39+0000] testing.(*T).Parallel(0xc4200b85a0)
[WARNING] [08:44:39+0000] 	/usr/local/go/src/testing/testing.go:678 +0x13f
[WARNING] [08:44:39+0000] github.com/openshift/origin/test/integration/runner.executeTests.func1(0xc4200b85a0)
[WARNING] [08:44:39+0000] 	/go/src/github.com/openshift/origin/_output/local/go/src/github.com/openshift/origin/test/integration/runner/runner_test.go:112 +0x9f
[WARNING] [08:44:39+0000] testing.tRunner(0xc4200b85a0, 0xc4202cfc00)
[WARNING] [08:44:39+0000] 	/usr/local/go/src/testing/testing.go:746 +0xd0
[WARNING] [08:44:39+0000] created by testing.(*T).Run
[WARNING] [08:44:39+0000] 	/usr/local/go/src/testing/testing.go:789 +0x2de
[WARNING] [08:44:39+0000] goroutine 16 [chan receive, 31 minutes]:
[WARNING] [08:44:39+0000] testing.(*testContext).waitParallel(0xc42000e870)
[WARNING] [08:44:39+0000] 	/usr/local/go/src/testing/testing.go:833 +0x9f
[WARNING] [08:44:39+0000] testing.(*T).Parallel(0xc4200b8690)
[WARNING] [08:44:39+0000] 	/usr/local/go/src/testing/testing.go:678 +0x13f
[WARNING] [08:44:39+0000] github.com/openshift/origin/test/integration/runner.executeTests.func1(0xc4200b8690)
[WARNING] [08:44:39+0000] 	/go/src/github.com/openshift/origin/_output/local/go/src/github.com/openshift/origin/test/integration/runner/runner_test.go:112 +0x9f
[WARNING] [08:44:39+0000] testing.tRunner(0xc4200b8690, 0xc4202cfc80)
[WARNING] [08:44:39+0000] 	/usr/local/go/src/testing/testing.go:746 +0xd0
[WARNING] [08:44:39+0000] created by testing.(*T).Run
[WARNING] [08:44:39+0000] 	/usr/local/go/src/testing/testing.go:789 +0x2de
[WARNING] [08:44:39+0000] goroutine 17 [chan receive, 31 minutes]:
[WARNING] [08:44:39+0000] testing.(*testContext).waitParallel(0xc42000e870)
[WARNING] [08:44:39+0000] 	/usr/local/go/src/testing/testing.go:833 +0x9f
[WARNING] [08:44:39+0000] testing.(*T).Parallel(0xc4200b8780)
[WARNING] [08:44:39+0000] 	/usr/local/go/src/testing/testing.go:678 +0x13f
[WARNING] [08:44:39+0000] github.com/openshift/origin/test/integration/runner.executeTests.func1(0xc4200b8780)
[WARNING] [08:44:39+0000] 	/go/src/github.com/openshift/origin/_output/local/go/src/github.com/openshift/origin/test/integration/runner/runner_test.go:112 +0x9f
[WARNING] [08:44:39+0000] testing.tRunner(0xc4200b8780, 0xc4202cfd00)
[WARNING] [08:44:39+0000] 	/usr/local/go/src/testing/testing.go:746 +0xd0
[WARNING] [08:44:39+0000] created by testing.(*T).Run
[WARNING] [08:44:39+0000] 	/usr/local/go/src/testing/testing.go:789 +0x2de
[WARNING] [08:44:39+0000] goroutine 18 [chan receive, 31 minutes]:
[WARNING] [08:44:39+0000] testing.(*testContext).waitParallel(0xc42000e870)
[WARNING] [08:44:39+0000] 	/usr/local/go/src/testing/testing.go:833 +0x9f
[WARNING] [08:44:39+0000] testing.(*T).Parallel(0xc4200b8870)
[WARNING] [08:44:39+0000] 	/usr/local/go/src/testing/testing.go:678 +0x13f
[WARNING] [08:44:39+0000] github.com/openshift/origin/test/integration/runner.executeTests.func1(0xc4200b8870)
[WARNING] [08:44:39+0000] 	/go/src/github.com/openshift/origin/_output/local/go/src/github.com/openshift/origin/test/integration/runner/runner_test.go:112 +0x9f
[WARNING] [08:44:39+0000] testing.tRunner(0xc4200b8870, 0xc4202cfd80)
[WARNING] [08:44:39+0000] 	/usr/local/go/src/testing/testing.go:746 +0xd0
[WARNING] [08:44:39+0000] created by testing.(*T).Run
[WARNING] [08:44:39+0000] 	/usr/local/go/src/testing/testing.go:789 +0x2de
[WARNING] [08:44:39+0000] goroutine 19 [chan receive, 31 minutes]:
[WARNING] [08:44:39+0000] testing.(*testContext).waitParallel(0xc42000e870)
[WARNING] [08:44:39+0000] 	/usr/local/go/src/testing/testing.go:833 +0x9f
[WARNING] [08:44:39+0000] testing.(*T).Parallel(0xc4200b8960)
[WARNING] [08:44:39+0000] 	/usr/local/go/src/testing/testing.go:678 +0x13f
[WARNING] [08:44:39+0000] github.com/openshift/origin/test/integration/runner.executeTests.func1(0xc4200b8960)
[WARNING] [08:44:39+0000] 	/go/src/github.com/openshift/origin/_output/local/go/src/github.com/openshift/origin/test/integration/runner/runner_test.go:112 +0x9f
[WARNING] [08:44:39+0000] testing.tRunner(0xc4200b8960, 0xc4202cfe00)
[WARNING] [08:44:39+0000] 	/usr/local/go/src/testing/testing.go:746 +0xd0
[WARNING] [08:44:39+0000] created by testing.(*T).Run
[WARNING] [08:44:39+0000] 	/usr/local/go/src/testing/testing.go:789 +0x2de
[WARNING] [08:44:39+0000] goroutine 20 [chan receive, 31 minutes]:
[WARNING] [08:44:39+0000] testing.(*testContext).waitParallel(0xc42000e870)
[WARNING] [08:44:39+0000] 	/usr/local/go/src/testing/testing.go:833 +0x9f
[WARNING] [08:44:39+0000] testing.(*T).Parallel(0xc4200b8a50)
[WARNING] [08:44:39+0000] 	/usr/local/go/src/testing/testing.go:678 +0x13f
[WARNING] [08:44:39+0000] github.com/openshift/origin/test/integration/runner.executeTests.func1(0xc4200b8a50)
[WARNING] [08:44:39+0000] 	/go/src/github.com/openshift/origin/_output/local/go/src/github.com/openshift/origin/test/integration/runner/runner_test.go:112 +0x9f
[WARNING] [08:44:39+0000] testing.tRunner(0xc4200b8a50, 0xc4202cfe80)
[WARNING] [08:44:39+0000] 	/usr/local/go/src/testing/testing.go:746 +0xd0
[WARNING] [08:44:39+0000] created by testing.(*T).Run
[WARNING] [08:44:39+0000] 	/usr/local/go/src/testing/testing.go:789 +0x2de
[WARNING] [08:44:39+0000] goroutine 21 [chan receive, 31 minutes]:
[WARNING] [08:44:39+0000] testing.(*testContext).waitParallel(0xc42000e870)
[WARNING] [08:44:39+0000] 	/usr/local/go/src/testing/testing.go:833 +0x9f
[WARNING] [08:44:39+0000] testing.(*T).Parallel(0xc4200b8b40)
[WARNING] [08:44:39+0000] 	/usr/local/go/src/testing/testing.go:678 +0x13f
[WARNING] [08:44:39+0000] github.com/openshift/origin/test/integration/runner.executeTests.func1(0xc4200b8b40)
[WARNING] [08:44:39+0000] 	/go/src/github.com/openshift/origin/_output/local/go/src/github.com/openshift/origin/test/integration/runner/runner_test.go:112 +0x9f
[WARNING] [08:44:39+0000] testing.tRunner(0xc4200b8b40, 0xc4202cff00)
[WARNING] [08:44:39+0000] 	/usr/local/go/src/testing/testing.go:746 +0xd0
[WARNING] [08:44:39+0000] created by testing.(*T).Run
[WARNING] [08:44:39+0000] 	/usr/local/go/src/testing/testing.go:789 +0x2de
[WARNING] [08:44:39+0000] goroutine 22 [chan receive, 31 minutes]:
[WARNING] [08:44:39+0000] testing.(*testContext).waitParallel(0xc42000e870)
[WARNING] [08:44:39+0000] 	/usr/local/go/src/testing/testing.go:833 +0x9f
[WARNING] [08:44:39+0000] testing.(*T).Parallel(0xc4200b8c30)
[WARNING] [08:44:39+0000] 	/usr/local/go/src/testing/testing.go:678 +0x13f
[WARNING] [08:44:39+0000] github.com/openshift/origin/test/integration/runner.executeTests.func1(0xc4200b8c30)
[WARNING] [08:44:39+0000] 	/go/src/github.com/openshift/origin/_output/local/go/src/github.com/openshift/origin/test/integration/runner/runner_test.go:112 +0x9f
[WARNING] [08:44:39+0000] testing.tRunner(0xc4200b8c30, 0xc4202cff80)
[WARNING] [08:44:39+0000] 	/usr/local/go/src/testing/testing.go:746 +0xd0
[WARNING] [08:44:39+0000] created by testing.(*T).Run
[WARNING] [08:44:39+0000] 	/usr/local/go/src/testing/testing.go:789 +0x2de
[WARNING] [08:44:39+0000] goroutine 23 [chan receive, 31 minutes]:
[WARNING] [08:44:39+0000] testing.(*testContext).waitParallel(0xc42000e870)
[WARNING] [08:44:39+0000] 	/usr/local/go/src/testing/testing.go:833 +0x9f
[WARNING] [08:44:39+0000] testing.(*T).Parallel(0xc4200b8d20)
[WARNING] [08:44:39+0000] 	/usr/local/go/src/testing/testing.go:678 +0x13f
[WARNING] [08:44:39+0000] github.com/openshift/origin/test/integration/runner.executeTests.func1(0xc4200b8d20)
[WARNING] [08:44:39+0000] 	/go/src/github.com/openshift/origin/_output/local/go/src/github.com/openshift/origin/test/integration/runner/runner_test.go:112 +0x9f
[WARNING] [08:44:39+0000] testing.tRunner(0xc4200b8d20, 0xc4203b8000)
[WARNING] [08:44:39+0000] 	/usr/local/go/src/testing/testing.go:746 +0xd0
[WARNING] [08:44:39+0000] created by testing.(*T).Run
[WARNING] [08:44:39+0000] 	/usr/local/go/src/testing/testing.go:789 +0x2de
[WARNING] [08:44:39+0000] goroutine 24 [chan send, 1 minutes]:
[WARNING] [08:44:39+0000] testing.tRunner.func1(0xc4200b8e10)
[WARNING] [08:44:39+0000] 	/usr/local/go/src/testing/testing.go:741 +0x19b
[WARNING] [08:44:39+0000] testing.tRunner(0xc4200b8e10, 0xc4203b8080)
[WARNING] [08:44:39+0000] 	/usr/local/go/src/testing/testing.go:748 +0xda
[WARNING] [08:44:39+0000] created by testing.(*T).Run
[WARNING] [08:44:39+0000] 	/usr/local/go/src/testing/testing.go:789 +0x2de
[WARNING] [08:44:39+0000] goroutine 25 [chan receive, 31 minutes]:
[WARNING] [08:44:39+0000] testing.(*testContext).waitParallel(0xc42000e870)
[WARNING] [08:44:39+0000] 	/usr/local/go/src/testing/testing.go:833 +0x9f
[WARNING] [08:44:39+0000] testing.(*T).Parallel(0xc4200b8f00)
[WARNING] [08:44:39+0000] 	/usr/local/go/src/testing/testing.go:678 +0x13f
[WARNING] [08:44:39+0000] github.com/openshift/origin/test/integration/runner.executeTests.func1(0xc4200b8f00)
[WARNING] [08:44:39+0000] 	/go/src/github.com/openshift/origin/_output/local/go/src/github.com/openshift/origin/test/integration/runner/runner_test.go:112 +0x9f
[WARNING] [08:44:39+0000] testing.tRunner(0xc4200b8f00, 0xc4203b8100)
[WARNING] [08:44:39+0000] 	/usr/local/go/src/testing/testing.go:746 +0xd0
[WARNING] [08:44:39+0000] created by testing.(*T).Run
[WARNING] [08:44:39+0000] 	/usr/local/go/src/testing/testing.go:789 +0x2de
[WARNING] [08:44:39+0000] goroutine 26 [chan receive, 31 minutes]:
[WARNING] [08:44:39+0000] testing.(*testContext).waitParallel(0xc42000e870)
[WARNING] [08:44:39+0000] 	/usr/local/go/src/testing/testing.go:833 +0x9f
[WARNING] [08:44:39+0000] testing.(*T).Parallel(0xc4200b8ff0)
[WARNING] [08:44:39+0000] 	/usr/local/go/src/testing/testing.go:678 +0x13f
[WARNING] [08:44:39+0000] github.com/openshift/origin/test/integration/runner.executeTests.func1(0xc4200b8ff0)
[WARNING] [08:44:39+0000] 	/go/src/github.com/openshift/origin/_output/local/go/src/github.com/openshift/origin/test/integration/runner/runner_test.go:112 +0x9f
[WARNING] [08:44:39+0000] testing.tRunner(0xc4200b8ff0, 0xc4203b8180)
[WARNING] [08:44:39+0000] 	/usr/local/go/src/testing/testing.go:746 +0xd0
[WARNING] [08:44:39+0000] created by testing.(*T).Run
[WARNING] [08:44:39+0000] 	/usr/local/go/src/testing/testing.go:789 +0x2de
[WARNING] [08:44:39+0000] goroutine 27 [chan receive, 31 minutes]:
[WARNING] [08:44:39+0000] testing.(*testContext).waitParallel(0xc42000e870)
[WARNING] [08:44:39+0000] 	/usr/local/go/src/testing/testing.go:833 +0x9f
[WARNING] [08:44:39+0000] testing.(*T).Parallel(0xc4200b90e0)
[WARNING] [08:44:39+0000] 	/usr/local/go/src/testing/testing.go:678 +0x13f
[WARNING] [08:44:39+0000] github.com/openshift/origin/test/integration/runner.executeTests.func1(0xc4200b90e0)
[WARNING] [08:44:39+0000] 	/go/src/github.com/openshift/origin/_output/local/go/src/github.com/openshift/origin/test/integration/runner/runner_test.go:112 +0x9f
[WARNING] [08:44:39+0000] testing.tRunner(0xc4200b90e0, 0xc4203b8200)
[WARNING] [08:44:39+0000] 	/usr/local/go/src/testing/testing.go:746 +0xd0
[WARNING] [08:44:39+0000] created by testing.(*T).Run
[WARNING] [08:44:39+0000] 	/usr/local/go/src/testing/testing.go:789 +0x2de
[WARNING] [08:44:39+0000] goroutine 28 [syscall, 1 minutes]:
[WARNING] [08:44:39+0000] syscall.Syscall6(0xf7, 0x1, 0x3fd, 0xc420e06a08, 0x1000004, 0x0, 0x0, 0x0, 0x0, 0x0)
[WARNING] [08:44:39+0000] 	/usr/local/go/src/syscall/asm_linux_amd64.s:44 +0x5
[WARNING] [08:44:39+0000] os.(*Process).blockUntilWaitable(0xc4203065d0, 0xc4203065d0, 0x0, 0x0)
[WARNING] [08:44:39+0000] 	/usr/local/go/src/os/wait_waitid.go:31 +0xa5
[WARNING] [08:44:39+0000] os.(*Process).wait(0xc4203065d0, 0xc420444480, 0xc4201224f8, 0x68)
[WARNING] [08:44:39+0000] 	/usr/local/go/src/os/exec_unix.go:22 +0x42
[WARNING] [08:44:39+0000] os.(*Process).Wait(0xc4203065d0, 0x0, 0x0, 0x5d59a0)
[WARNING] [08:44:39+0000] 	/usr/local/go/src/os/exec.go:115 +0x2b
[WARNING] [08:44:39+0000] os/exec.(*Cmd).Wait(0xc420122420, 0x0, 0x0)
[WARNING] [08:44:39+0000] 	/usr/local/go/src/os/exec/exec.go:446 +0x62
[WARNING] [08:44:39+0000] os/exec.(*Cmd).Run(0xc420122420, 0xc420098310, 0x0)
[WARNING] [08:44:39+0000] 	/usr/local/go/src/os/exec/exec.go:289 +0x5c
[WARNING] [08:44:39+0000] os/exec.(*Cmd).CombinedOutput(0xc420122420, 0xc42026e300, 0x4, 0x4, 0x6, 0xc420444480)
[WARNING] [08:44:39+0000] 	/usr/local/go/src/os/exec/exec.go:506 +0x127
[WARNING] [08:44:39+0000] github.com/openshift/origin/test/integration/runner.runSingleTest(0xc4200b91d0, 0x5ca51e, 0x2, 0xc42044e9c0, 0x52, 0xc420212f60, 0x1f, 0x0, 0x0)
[WARNING] [08:44:39+0000] 	/go/src/github.com/openshift/origin/_output/local/go/src/github.com/openshift/origin/test/integration/runner/runner_test.go:174 +0x721
[WARNING] [08:44:39+0000] github.com/openshift/origin/test/integration/runner.executeTests.func1(0xc4200b91d0)
[WARNING] [08:44:39+0000] 	/go/src/github.com/openshift/origin/_output/local/go/src/github.com/openshift/origin/test/integration/runner/runner_test.go:116 +0x1dc
[WARNING] [08:44:39+0000] testing.tRunner(0xc4200b91d0, 0xc4203b8280)
[WARNING] [08:44:39+0000] 	/usr/local/go/src/testing/testing.go:746 +0xd0
[WARNING] [08:44:39+0000] created by testing.(*T).Run
[WARNING] [08:44:39+0000] 	/usr/local/go/src/testing/testing.go:789 +0x2de
[WARNING] [08:44:39+0000] goroutine 29 [syscall, 1 minutes]:
[WARNING] [08:44:39+0000] syscall.Syscall6(0xf7, 0x1, 0x3f0, 0xc420a40a08, 0x1000004, 0x0, 0x0, 0x0, 0x0, 0x0)
[WARNING] [08:44:39+0000] 	/usr/local/go/src/syscall/asm_linux_amd64.s:44 +0x5
[WARNING] [08:44:39+0000] os.(*Process).blockUntilWaitable(0xc4200125a0, 0xc4200125a0, 0x0, 0x0)
[WARNING] [08:44:39+0000] 	/usr/local/go/src/os/wait_waitid.go:31 +0xa5
[WARNING] [08:44:39+0000] os.(*Process).wait(0xc4200125a0, 0xc4211a8280, 0xc420092658, 0x68)
[WARNING] [08:44:39+0000] 	/usr/local/go/src/os/exec_unix.go:22 +0x42
[WARNING] [08:44:39+0000] os.(*Process).Wait(0xc4200125a0, 0x0, 0x0, 0x5d59a0)
[WARNING] [08:44:39+0000] 	/usr/local/go/src/os/exec.go:115 +0x2b
[WARNING] [08:44:39+0000] os/exec.(*Cmd).Wait(0xc420092580, 0x0, 0x0)
[WARNING] [08:44:39+0000] 	/usr/local/go/src/os/exec/exec.go:446 +0x62
[WARNING] [08:44:39+0000] os/exec.(*Cmd).Run(0xc420092580, 0xc4200b2230, 0x0)
[WARNING] [08:44:39+0000] 	/usr/local/go/src/os/exec/exec.go:289 +0x5c
[WARNING] [08:44:39+0000] os/exec.(*Cmd).CombinedOutput(0xc420092580, 0xc420056700, 0x4, 0x4, 0x6, 0xc4211a8280)
[WARNING] [08:44:39+0000] 	/usr/local/go/src/os/exec/exec.go:506 +0x127
[WARNING] [08:44:39+0000] github.com/openshift/origin/test/integration/runner.runSingleTest(0xc4200b92c0, 0x5ca51e, 0x2, 0xc42044e9c0, 0x52, 0xc42027a8c0, 0x1a, 0x0, 0x0)
[WARNING] [08:44:39+0000] 	/go/src/github.com/openshift/origin/_output/local/go/src/github.com/openshift/origin/test/integration/runner/runner_test.go:174 +0x721
[WARNING] [08:44:39+0000] github.com/openshift/origin/test/integration/runner.executeTests.func1(0xc4200b92c0)
[WARNING] [08:44:39+0000] 	/go/src/github.com/openshift/origin/_output/local/go/src/github.com/openshift/origin/test/integration/runner/runner_test.go:116 +0x1dc
[WARNING] [08:44:39+0000] testing.tRunner(0xc4200b92c0, 0xc4203b8300)
[WARNING] [08:44:39+0000] 	/usr/local/go/src/testing/testing.go:746 +0xd0
[WARNING] [08:44:39+0000] created by testing.(*T).Run
[WARNING] [08:44:39+0000] 	/usr/local/go/src/testing/testing.go:789 +0x2de
[WARNING] [08:44:39+0000] goroutine 30 [syscall, 1 minutes]:
[WARNING] [08:44:39+0000] syscall.Syscall6(0xf7, 0x1, 0x3e5, 0xc420e0aa08, 0x1000004, 0x0, 0x0, 0x0, 0x0, 0x0)
[WARNING] [08:44:39+0000] 	/usr/local/go/src/syscall/asm_linux_amd64.s:44 +0x5
[WARNING] [08:44:39+0000] os.(*Process).blockUntilWaitable(0xc420012420, 0xc420012420, 0x0, 0x0)
[WARNING] [08:44:39+0000] 	/usr/local/go/src/os/wait_waitid.go:31 +0xa5
[WARNING] [08:44:39+0000] os.(*Process).wait(0xc420012420, 0xc4211a8100, 0xc4200920d8, 0x68)
[WARNING] [08:44:39+0000] 	/usr/local/go/src/os/exec_unix.go:22 +0x42
[WARNING] [08:44:39+0000] os.(*Process).Wait(0xc420012420, 0x0, 0x0, 0x5d59a0)
[WARNING] [08:44:39+0000] 	/usr/local/go/src/os/exec.go:115 +0x2b
[WARNING] [08:44:39+0000] os/exec.(*Cmd).Wait(0xc420092000, 0x0, 0x0)
[WARNING] [08:44:39+0000] 	/usr/local/go/src/os/exec/exec.go:446 +0x62
[WARNING] [08:44:39+0000] os/exec.(*Cmd).Run(0xc420092000, 0xc4200b2150, 0x0)
[WARNING] [08:44:39+0000] 	/usr/local/go/src/os/exec/exec.go:289 +0x5c
[WARNING] [08:44:39+0000] os/exec.(*Cmd).CombinedOutput(0xc420092000, 0xc420056600, 0x4, 0x4, 0x6, 0xc4211a8100)
[WARNING] [08:44:39+0000] 	/usr/local/go/src/os/exec/exec.go:506 +0x127
[WARNING] [08:44:39+0000] github.com/openshift/origin/test/integration/runner.runSingleTest(0xc4200b93b0, 0x5ca51e, 0x2, 0xc42044e9c0, 0x52, 0xc420013e60, 0x23, 0x0, 0x0)
[WARNING] [08:44:39+0000] 	/go/src/github.com/openshift/origin/_output/local/go/src/github.com/openshift/origin/test/integration/runner/runner_test.go:174 +0x721
[WARNING] [08:44:39+0000] github.com/openshift/origin/test/integration/runner.executeTests.func1(0xc4200b93b0)
[WARNING] [08:44:39+0000] 	/go/src/github.com/openshift/origin/_output/local/go/src/github.com/openshift/origin/test/integration/runner/runner_test.go:116 +0x1dc
[WARNING] [08:44:39+0000] testing.tRunner(0xc4200b93b0, 0xc4203b8380)
[WARNING] [08:44:39+0000] 	/usr/local/go/src/testing/testing.go:746 +0xd0
[WARNING] [08:44:39+0000] created by testing.(*T).Run
[WARNING] [08:44:39+0000] 	/usr/local/go/src/testing/testing.go:789 +0x2de
[WARNING] [08:44:39+0000] goroutine 31 [chan send, 1 minutes]:
[WARNING] [08:44:39+0000] testing.tRunner.func1(0xc4200b94a0)
[WARNING] [08:44:39+0000] 	/usr/local/go/src/testing/testing.go:741 +0x19b
[WARNING] [08:44:39+0000] testing.tRunner(0xc4200b94a0, 0xc4203b8400)
[WARNING] [08:44:39+0000] 	/usr/local/go/src/testing/testing.go:748 +0xda
[WARNING] [08:44:39+0000] created by testing.(*T).Run
[WARNING] [08:44:39+0000] 	/usr/local/go/src/testing/testing.go:789 +0x2de
[WARNING] [08:44:39+0000] goroutine 32 [chan send, 1 minutes]:
[WARNING] [08:44:39+0000] testing.tRunner.func1(0xc4200b9590)
[WARNING] [08:44:39+0000] 	/usr/local/go/src/testing/testing.go:741 +0x19b
[WARNING] [08:44:39+0000] testing.tRunner(0xc4200b9590, 0xc4203b8480)
[WARNING] [08:44:39+0000] 	/usr/local/go/src/testing/testing.go:748 +0xda
[WARNING] [08:44:39+0000] created by testing.(*T).Run
[WARNING] [08:44:39+0000] 	/usr/local/go/src/testing/testing.go:789 +0x2de
[WARNING] [08:44:39+0000] goroutine 33 [chan send, 1 minutes]:
[WARNING] [08:44:39+0000] testing.tRunner.func1(0xc4200b9680)
[WARNING] [08:44:39+0000] 	/usr/local/go/src/testing/testing.go:741 +0x19b
[WARNING] [08:44:39+0000] testing.tRunner(0xc4200b9680, 0xc4203b8500)
[WARNING] [08:44:39+0000] 	/usr/local/go/src/testing/testing.go:748 +0xda
[WARNING] [08:44:39+0000] created by testing.(*T).Run
[WARNING] [08:44:39+0000] 	/usr/local/go/src/testing/testing.go:789 +0x2de
[WARNING] [08:44:39+0000] goroutine 34 [chan send, 1 minutes]:
[WARNING] [08:44:39+0000] testing.tRunner.func1(0xc4200b9770)
[WARNING] [08:44:39+0000] 	/usr/local/go/src/testing/testing.go:741 +0x19b
[WARNING] [08:44:39+0000] testing.tRunner(0xc4200b9770, 0xc4203b8580)
[WARNING] [08:44:39+0000] 	/usr/local/go/src/testing/testing.go:748 +0xda
[WARNING] [08:44:39+0000] created by testing.(*T).Run
[WARNING] [08:44:39+0000] 	/usr/local/go/src/testing/testing.go:789 +0x2de
[WARNING] [08:44:39+0000] goroutine 35 [chan send, 1 minutes]:
[WARNING] [08:44:39+0000] testing.tRunner.func1(0xc4200b9860)
[WARNING] [08:44:39+0000] 	/usr/local/go/src/testing/testing.go:741 +0x19b
[WARNING] [08:44:39+0000] testing.tRunner(0xc4200b9860, 0xc4203b8600)
[WARNING] [08:44:39+0000] 	/usr/local/go/src/testing/testing.go:748 +0xda
[WARNING] [08:44:39+0000] created by testing.(*T).Run
[WARNING] [08:44:39+0000] 	/usr/local/go/src/testing/testing.go:789 +0x2de
[WARNING] [08:44:39+0000] goroutine 36 [chan send, 1 minutes]:
[WARNING] [08:44:39+0000] testing.tRunner.func1(0xc4200b9950)
[WARNING] [08:44:39+0000] 	/usr/local/go/src/testing/testing.go:741 +0x19b
[WARNING] [08:44:39+0000] testing.tRunner(0xc4200b9950, 0xc4203b8680)
[WARNING] [08:44:39+0000] 	/usr/local/go/src/testing/testing.go:748 +0xda
[WARNING] [08:44:39+0000] created by testing.(*T).Run
[WARNING] [08:44:39+0000] 	/usr/local/go/src/testing/testing.go:789 +0x2de
[WARNING] [08:44:39+0000] goroutine 37 [chan send, 8 minutes]:
[WARNING] [08:44:39+0000] testing.tRunner.func1(0xc4200b9a40)
[WARNING] [08:44:39+0000] 	/usr/local/go/src/testing/testing.go:741 +0x19b
[WARNING] [08:44:39+0000] testing.tRunner(0xc4200b9a40, 0xc4203b8700)
[WARNING] [08:44:39+0000] 	/usr/local/go/src/testing/testing.go:748 +0xda
[WARNING] [08:44:39+0000] created by testing.(*T).Run
[WARNING] [08:44:39+0000] 	/usr/local/go/src/testing/testing.go:789 +0x2de
[WARNING] [08:44:39+0000] goroutine 38 [chan send, 1 minutes]:
[WARNING] [08:44:39+0000] testing.tRunner.func1(0xc4200b9b30)
[WARNING] [08:44:39+0000] 	/usr/local/go/src/testing/testing.go:741 +0x19b
[WARNING] [08:44:39+0000] testing.tRunner(0xc4200b9b30, 0xc4203b8780)
[WARNING] [08:44:39+0000] 	/usr/local/go/src/testing/testing.go:748 +0xda
[WARNING] [08:44:39+0000] created by testing.(*T).Run
[WARNING] [08:44:39+0000] 	/usr/local/go/src/testing/testing.go:789 +0x2de
[WARNING] [08:44:39+0000] goroutine 39 [chan send, 1 minutes]:
[WARNING] [08:44:39+0000] testing.tRunner.func1(0xc4200b9c20)
[WARNING] [08:44:39+0000] 	/usr/local/go/src/testing/testing.go:741 +0x19b
[WARNING] [08:44:39+0000] testing.tRunner(0xc4200b9c20, 0xc4203b8800)
[WARNING] [08:44:39+0000] 	/usr/local/go/src/testing/testing.go:748 +0xda
[WARNING] [08:44:39+0000] created by testing.(*T).Run
[WARNING] [08:44:39+0000] 	/usr/local/go/src/testing/testing.go:789 +0x2de
[WARNING] [08:44:39+0000] goroutine 40 [chan send, 3 minutes]:
[WARNING] [08:44:39+0000] testing.tRunner.func1(0xc4200b9d10)
[WARNING] [08:44:39+0000] 	/usr/local/go/src/testing/testing.go:741 +0x19b
[WARNING] [08:44:39+0000] testing.tRunner(0xc4200b9d10, 0xc4203b8880)
[WARNING] [08:44:39+0000] 	/usr/local/go/src/testing/testing.go:748 +0xda
[WARNING] [08:44:39+0000] created by testing.(*T).Run
[WARNING] [08:44:39+0000] 	/usr/local/go/src/testing/testing.go:789 +0x2de
[WARNING] [08:44:39+0000] goroutine 41 [chan send, 3 minutes]:
[WARNING] [08:44:39+0000] testing.tRunner.func1(0xc4200b9e00)
[WARNING] [08:44:39+0000] 	/usr/local/go/src/testing/testing.go:741 +0x19b
[WARNING] [08:44:39+0000] testing.tRunner(0xc4200b9e00, 0xc4203b8900)
[WARNING] [08:44:39+0000] 	/usr/local/go/src/testing/testing.go:748 +0xda
[WARNING] [08:44:39+0000] created by testing.(*T).Run
[WARNING] [08:44:39+0000] 	/usr/local/go/src/testing/testing.go:789 +0x2de
[WARNING] [08:44:39+0000] goroutine 42 [chan send, 3 minutes]:
[WARNING] [08:44:39+0000] testing.tRunner.func1(0xc4200b9ef0)
[WARNING] [08:44:39+0000] 	/usr/local/go/src/testing/testing.go:741 +0x19b
[WARNING] [08:44:39+0000] testing.tRunner(0xc4200b9ef0, 0xc4203b8980)
[WARNING] [08:44:39+0000] 	/usr/local/go/src/testing/testing.go:748 +0xda
[WARNING] [08:44:39+0000] created by testing.(*T).Run
[WARNING] [08:44:39+0000] 	/usr/local/go/src/testing/testing.go:789 +0x2de
[WARNING] [08:44:39+0000] goroutine 43 [chan send, 3 minutes]:
[WARNING] [08:44:39+0000] testing.tRunner.func1(0xc4201f4000)
[WARNING] [08:44:39+0000] 	/usr/local/go/src/testing/testing.go:741 +0x19b
[WARNING] [08:44:39+0000] testing.tRunner(0xc4201f4000, 0xc4203b8a00)
[WARNING] [08:44:39+0000] 	/usr/local/go/src/testing/testing.go:748 +0xda
[WARNING] [08:44:39+0000] created by testing.(*T).Run
[WARNING] [08:44:39+0000] 	/usr/local/go/src/testing/testing.go:789 +0x2de
[WARNING] [08:44:39+0000] goroutine 44 [chan send, 3 minutes]:
[WARNING] [08:44:39+0000] testing.tRunner.func1(0xc4201f40f0)
[WARNING] [08:44:39+0000] 	/usr/local/go/src/testing/testing.go:741 +0x19b
[WARNING] [08:44:39+0000] testing.tRunner(0xc4201f40f0, 0xc4203b8a80)
[WARNING] [08:44:39+0000] 	/usr/local/go/src/testing/testing.go:748 +0xda
[WARNING] [08:44:39+0000] created by testing.(*T).Run
[WARNING] [08:44:39+0000] 	/usr/local/go/src/testing/testing.go:789 +0x2de
[WARNING] [08:44:39+0000] goroutine 45 [chan send, 4 minutes]:
[WARNING] [08:44:39+0000] testing.tRunner.func1(0xc4201f41e0)
[WARNING] [08:44:39+0000] 	/usr/local/go/src/testing/testing.go:741 +0x19b
[WARNING] [08:44:39+0000] testing.tRunner(0xc4201f41e0, 0xc4203b8b00)
[WARNING] [08:44:39+0000] 	/usr/local/go/src/testing/testing.go:748 +0xda
[WARNING] [08:44:39+0000] created by testing.(*T).Run
[WARNING] [08:44:39+0000] 	/usr/local/go/src/testing/testing.go:789 +0x2de
[WARNING] [08:44:39+0000] goroutine 46 [chan send, 4 minutes]:
[WARNING] [08:44:39+0000] testing.tRunner.func1(0xc4201f42d0)
[WARNING] [08:44:39+0000] 	/usr/local/go/src/testing/testing.go:741 +0x19b
[WARNING] [08:44:39+0000] testing.tRunner(0xc4201f42d0, 0xc4203b8b80)
[WARNING] [08:44:39+0000] 	/usr/local/go/src/testing/testing.go:748 +0xda
[WARNING] [08:44:39+0000] created by testing.(*T).Run
[WARNING] [08:44:39+0000] 	/usr/local/go/src/testing/testing.go:789 +0x2de
[WARNING] [08:44:39+0000] goroutine 47 [chan send, 4 minutes]:
[WARNING] [08:44:39+0000] testing.tRunner.func1(0xc4201f43c0)
[WARNING] [08:44:39+0000] 	/usr/local/go/src/testing/testing.go:741 +0x19b
[WARNING] [08:44:39+0000] testing.tRunner(0xc4201f43c0, 0xc4203b8c00)
[WARNING] [08:44:39+0000] 	/usr/local/go/src/testing/testing.go:748 +0xda
[WARNING] [08:44:39+0000] created by testing.(*T).Run
[WARNING] [08:44:39+0000] 	/usr/local/go/src/testing/testing.go:789 +0x2de
[WARNING] [08:44:39+0000] goroutine 48 [chan send, 4 minutes]:
[WARNING] [08:44:39+0000] testing.tRunner.func1(0xc4201f44b0)
[WARNING] [08:44:39+0000] 	/usr/local/go/src/testing/testing.go:741 +0x19b
[WARNING] [08:44:39+0000] testing.tRunner(0xc4201f44b0, 0xc4203b8c80)
[WARNING] [08:44:39+0000] 	/usr/local/go/src/testing/testing.go:748 +0xda
[WARNING] [08:44:39+0000] created by testing.(*T).Run
[WARNING] [08:44:39+0000] 	/usr/local/go/src/testing/testing.go:789 +0x2de
[WARNING] [08:44:39+0000] goroutine 49 [chan send, 4 minutes]:
[WARNING] [08:44:39+0000] testing.tRunner.func1(0xc4201f45a0)
[WARNING] [08:44:39+0000] 	/usr/local/go/src/testing/testing.go:741 +0x19b
[WARNING] [08:44:39+0000] testing.tRunner(0xc4201f45a0, 0xc4203b8d00)
[WARNING] [08:44:39+0000] 	/usr/local/go/src/testing/testing.go:748 +0xda
[WARNING] [08:44:39+0000] created by testing.(*T).Run
[WARNING] [08:44:39+0000] 	/usr/local/go/src/testing/testing.go:789 +0x2de
[WARNING] [08:44:39+0000] goroutine 50 [chan send, 4 minutes]:
[WARNING] [08:44:39+0000] testing.tRunner.func1(0xc4201f4690)
[WARNING] [08:44:39+0000] 	/usr/local/go/src/testing/testing.go:741 +0x19b
[WARNING] [08:44:39+0000] testing.tRunner(0xc4201f4690, 0xc4203b8d80)
[WARNING] [08:44:39+0000] 	/usr/local/go/src/testing/testing.go:748 +0xda
[WARNING] [08:44:39+0000] created by testing.(*T).Run
[WARNING] [08:44:39+0000] 	/usr/local/go/src/testing/testing.go:789 +0x2de
[WARNING] [08:44:39+0000] goroutine 51 [chan send, 4 minutes]:
[WARNING] [08:44:39+0000] testing.tRunner.func1(0xc4201f4780)
[WARNING] [08:44:39+0000] 	/usr/local/go/src/testing/testing.go:741 +0x19b
[WARNING] [08:44:39+0000] testing.tRunner(0xc4201f4780, 0xc4203b8e00)
[WARNING] [08:44:39+0000] 	/usr/local/go/src/testing/testing.go:748 +0xda
[WARNING] [08:44:39+0000] created by testing.(*T).Run
[WARNING] [08:44:39+0000] 	/usr/local/go/src/testing/testing.go:789 +0x2de
[WARNING] [08:44:39+0000] goroutine 52 [chan send, 6 minutes]:
[WARNING] [08:44:39+0000] testing.tRunner.func1(0xc4201f4870)
[WARNING] [08:44:39+0000] 	/usr/local/go/src/testing/testing.go:741 +0x19b
[WARNING] [08:44:39+0000] testing.tRunner(0xc4201f4870, 0xc4203b8e80)
[WARNING] [08:44:39+0000] 	/usr/local/go/src/testing/testing.go:748 +0xda
[WARNING] [08:44:39+0000] created by testing.(*T).Run
[WARNING] [08:44:39+0000] 	/usr/local/go/src/testing/testing.go:789 +0x2de
[WARNING] [08:44:39+0000] goroutine 53 [chan send, 6 minutes]:
[WARNING] [08:44:39+0000] testing.tRunner.func1(0xc4201f4960)
[WARNING] [08:44:39+0000] 	/usr/local/go/src/testing/testing.go:741 +0x19b
[WARNING] [08:44:39+0000] testing.tRunner(0xc4201f4960, 0xc4203b8f00)
[WARNING] [08:44:39+0000] 	/usr/local/go/src/testing/testing.go:748 +0xda
[WARNING] [08:44:39+0000] created by testing.(*T).Run
[WARNING] [08:44:39+0000] 	/usr/local/go/src/testing/testing.go:789 +0x2de
[WARNING] [08:44:39+0000] goroutine 54 [chan send, 6 minutes]:
[WARNING] [08:44:39+0000] testing.tRunner.func1(0xc4201f4a50)
[WARNING] [08:44:39+0000] 	/usr/local/go/src/testing/testing.go:741 +0x19b
[WARNING] [08:44:39+0000] testing.tRunner(0xc4201f4a50, 0xc4203b8f80)
[WARNING] [08:44:39+0000] 	/usr/local/go/src/testing/testing.go:748 +0xda
[WARNING] [08:44:39+0000] created by testing.(*T).Run
[WARNING] [08:44:39+0000] 	/usr/local/go/src/testing/testing.go:789 +0x2de
[WARNING] [08:44:39+0000] goroutine 55 [chan send, 6 minutes]:
[WARNING] [08:44:39+0000] testing.tRunner.func1(0xc4201f4b40)
[WARNING] [08:44:39+0000] 	/usr/local/go/src/testing/testing.go:741 +0x19b
[WARNING] [08:44:39+0000] testing.tRunner(0xc4201f4b40, 0xc4203b9000)
[WARNING] [08:44:39+0000] 	/usr/local/go/src/testing/testing.go:748 +0xda
[WARNING] [08:44:39+0000] created by testing.(*T).Run
[WARNING] [08:44:39+0000] 	/usr/local/go/src/testing/testing.go:789 +0x2de
[WARNING] [08:44:39+0000] goroutine 56 [chan send, 6 minutes]:
[WARNING] [08:44:39+0000] testing.tRunner.func1(0xc4201f4c30)
[WARNING] [08:44:39+0000] 	/usr/local/go/src/testing/testing.go:741 +0x19b
[WARNING] [08:44:39+0000] testing.tRunner(0xc4201f4c30, 0xc4203b9080)
[WARNING] [08:44:39+0000] 	/usr/local/go/src/testing/testing.go:748 +0xda
[WARNING] [08:44:39+0000] created by testing.(*T).Run
[WARNING] [08:44:39+0000] 	/usr/local/go/src/testing/testing.go:789 +0x2de
[WARNING] [08:44:39+0000] goroutine 58 [chan send, 6 minutes]:
[WARNING] [08:44:39+0000] testing.tRunner.func1(0xc4201f4e10)
[WARNING] [08:44:39+0000] 	/usr/local/go/src/testing/testing.go:741 +0x19b
[WARNING] [08:44:39+0000] testing.tRunner(0xc4201f4e10, 0xc4203b9180)
[WARNING] [08:44:39+0000] 	/usr/local/go/src/testing/testing.go:748 +0xda
[WARNING] [08:44:39+0000] created by testing.(*T).Run
[WARNING] [08:44:39+0000] 	/usr/local/go/src/testing/testing.go:789 +0x2de
[WARNING] [08:44:39+0000] goroutine 59 [chan send, 6 minutes]:
[WARNING] [08:44:39+0000] testing.tRunner.func1(0xc4201f4f00)
[WARNING] [08:44:39+0000] 	/usr/local/go/src/testing/testing.go:741 +0x19b
[WARNING] [08:44:39+0000] testing.tRunner(0xc4201f4f00, 0xc4203b9200)
[WARNING] [08:44:39+0000] 	/usr/local/go/src/testing/testing.go:748 +0xda
[WARNING] [08:44:39+0000] created by testing.(*T).Run
[WARNING] [08:44:39+0000] 	/usr/local/go/src/testing/testing.go:789 +0x2de
[WARNING] [08:44:39+0000] goroutine 60 [chan send, 6 minutes]:
[WARNING] [08:44:39+0000] testing.tRunner.func1(0xc4201f4ff0)
[WARNING] [08:44:39+0000] 	/usr/local/go/src/testing/testing.go:741 +0x19b
[WARNING] [08:44:39+0000] testing.tRunner(0xc4201f4ff0, 0xc4203b9280)
[WARNING] [08:44:39+0000] 	/usr/local/go/src/testing/testing.go:748 +0xda
[WARNING] [08:44:39+0000] created by testing.(*T).Run
[WARNING] [08:44:39+0000] 	/usr/local/go/src/testing/testing.go:789 +0x2de
[WARNING] [08:44:39+0000] goroutine 61 [chan send, 6 minutes]:
[WARNING] [08:44:39+0000] testing.tRunner.func1(0xc4201f50e0)
[WARNING] [08:44:39+0000] 	/usr/local/go/src/testing/testing.go:741 +0x19b
[WARNING] [08:44:39+0000] testing.tRunner(0xc4201f50e0, 0xc4203b9300)
[WARNING] [08:44:39+0000] 	/usr/local/go/src/testing/testing.go:748 +0xda
[WARNING] [08:44:39+0000] created by testing.(*T).Run
[WARNING] [08:44:39+0000] 	/usr/local/go/src/testing/testing.go:789 +0x2de
[WARNING] [08:44:39+0000] goroutine 62 [chan send, 15 minutes]:
[WARNING] [08:44:39+0000] testing.tRunner.func1(0xc4201f51d0)
[WARNING] [08:44:39+0000] 	/usr/local/go/src/testing/testing.go:741 +0x19b
[WARNING] [08:44:39+0000] testing.tRunner(0xc4201f51d0, 0xc4203b9380)
[WARNING] [08:44:39+0000] 	/usr/local/go/src/testing/testing.go:748 +0xda
[WARNING] [08:44:39+0000] created by testing.(*T).Run
[WARNING] [08:44:39+0000] 	/usr/local/go/src/testing/testing.go:789 +0x2de
[WARNING] [08:44:39+0000] goroutine 63 [chan send, 8 minutes]:
[WARNING] [08:44:39+0000] testing.tRunner.func1(0xc4201f52c0)
[WARNING] [08:44:39+0000] 	/usr/local/go/src/testing/testing.go:741 +0x19b
[WARNING] [08:44:39+0000] testing.tRunner(0xc4201f52c0, 0xc4203b9400)
[WARNING] [08:44:39+0000] 	/usr/local/go/src/testing/testing.go:748 +0xda
[WARNING] [08:44:39+0000] created by testing.(*T).Run
[WARNING] [08:44:39+0000] 	/usr/local/go/src/testing/testing.go:789 +0x2de
[WARNING] [08:44:39+0000] goroutine 64 [chan send, 8 minutes]:
[WARNING] [08:44:39+0000] testing.tRunner.func1(0xc4201f53b0)
[WARNING] [08:44:39+0000] 	/usr/local/go/src/testing/testing.go:741 +0x19b
[WARNING] [08:44:39+0000] testing.tRunner(0xc4201f53b0, 0xc4203b9480)
[WARNING] [08:44:39+0000] 	/usr/local/go/src/testing/testing.go:748 +0xda
[WARNING] [08:44:39+0000] created by testing.(*T).Run
[WARNING] [08:44:39+0000] 	/usr/local/go/src/testing/testing.go:789 +0x2de
[WARNING] [08:44:39+0000] goroutine 65 [chan send, 8 minutes]:
[WARNING] [08:44:39+0000] testing.tRunner.func1(0xc4201f54a0)
[WARNING] [08:44:39+0000] 	/usr/local/go/src/testing/testing.go:741 +0x19b
[WARNING] [08:44:39+0000] testing.tRunner(0xc4201f54a0, 0xc4203b9500)
[WARNING] [08:44:39+0000] 	/usr/local/go/src/testing/testing.go:748 +0xda
[WARNING] [08:44:39+0000] created by testing.(*T).Run
[WARNING] [08:44:39+0000] 	/usr/local/go/src/testing/testing.go:789 +0x2de
[WARNING] [08:44:39+0000] goroutine 66 [chan send, 8 minutes]:
[WARNING] [08:44:39+0000] testing.tRunner.func1(0xc4201f5590)
[WARNING] [08:44:39+0000] 	/usr/local/go/src/testing/testing.go:741 +0x19b
[WARNING] [08:44:39+0000] testing.tRunner(0xc4201f5590, 0xc4203b9580)
[WARNING] [08:44:39+0000] 	/usr/local/go/src/testing/testing.go:748 +0xda
[WARNING] [08:44:39+0000] created by testing.(*T).Run
[WARNING] [08:44:39+0000] 	/usr/local/go/src/testing/testing.go:789 +0x2de
[WARNING] [08:44:39+0000] goroutine 67 [chan send, 6 minutes]:
[WARNING] [08:44:39+0000] testing.tRunner.func1(0xc4201f5680)
[WARNING] [08:44:39+0000] 	/usr/local/go/src/testing/testing.go:741 +0x19b
[WARNING] [08:44:39+0000] testing.tRunner(0xc4201f5680, 0xc4203b9600)
[WARNING] [08:44:39+0000] 	/usr/local/go/src/testing/testing.go:748 +0xda
[WARNING] [08:44:39+0000] created by testing.(*T).Run
[WARNING] [08:44:39+0000] 	/usr/local/go/src/testing/testing.go:789 +0x2de
[WARNING] [08:44:39+0000] goroutine 68 [chan send, 8 minutes]:
[WARNING] [08:44:39+0000] testing.tRunner.func1(0xc4201f5770)
[WARNING] [08:44:39+0000] 	/usr/local/go/src/testing/testing.go:741 +0x19b
[WARNING] [08:44:39+0000] testing.tRunner(0xc4201f5770, 0xc4203b9680)
[WARNING] [08:44:39+0000] 	/usr/local/go/src/testing/testing.go:748 +0xda
[WARNING] [08:44:39+0000] created by testing.(*T).Run
[WARNING] [08:44:39+0000] 	/usr/local/go/src/testing/testing.go:789 +0x2de
[WARNING] [08:44:39+0000] goroutine 69 [chan send, 8 minutes]:
[WARNING] [08:44:39+0000] testing.tRunner.func1(0xc4201f5860)
[WARNING] [08:44:39+0000] 	/usr/local/go/src/testing/testing.go:741 +0x19b
[WARNING] [08:44:39+0000] testing.tRunner(0xc4201f5860, 0xc4203b9700)
[WARNING] [08:44:39+0000] 	/usr/local/go/src/testing/testing.go:748 +0xda
[WARNING] [08:44:39+0000] created by testing.(*T).Run
[WARNING] [08:44:39+0000] 	/usr/local/go/src/testing/testing.go:789 +0x2de
[WARNING] [08:44:39+0000] goroutine 70 [chan send, 9 minutes]:
[WARNING] [08:44:39+0000] testing.tRunner.func1(0xc4201f5950)
[WARNING] [08:44:39+0000] 	/usr/local/go/src/testing/testing.go:741 +0x19b
[WARNING] [08:44:39+0000] testing.tRunner(0xc4201f5950, 0xc4203b9780)
[WARNING] [08:44:39+0000] 	/usr/local/go/src/testing/testing.go:748 +0xda
[WARNING] [08:44:39+0000] created by testing.(*T).Run
[WARNING] [08:44:39+0000] 	/usr/local/go/src/testing/testing.go:789 +0x2de
[WARNING] [08:44:39+0000] goroutine 71 [chan send, 9 minutes]:
[WARNING] [08:44:39+0000] testing.tRunner.func1(0xc4201f5a40)
[WARNING] [08:44:39+0000] 	/usr/local/go/src/testing/testing.go:741 +0x19b
[WARNING] [08:44:39+0000] testing.tRunner(0xc4201f5a40, 0xc4203b9800)
[WARNING] [08:44:39+0000] 	/usr/local/go/src/testing/testing.go:748 +0xda
[WARNING] [08:44:39+0000] created by testing.(*T).Run
[WARNING] [08:44:39+0000] 	/usr/local/go/src/testing/testing.go:789 +0x2de
[WARNING] [08:44:39+0000] goroutine 72 [chan send, 9 minutes]:
[WARNING] [08:44:39+0000] testing.tRunner.func1(0xc4201f5b30)
[WARNING] [08:44:39+0000] 	/usr/local/go/src/testing/testing.go:741 +0x19b
[WARNING] [08:44:39+0000] testing.tRunner(0xc4201f5b30, 0xc4203b9880)
[WARNING] [08:44:39+0000] 	/usr/local/go/src/testing/testing.go:748 +0xda
[WARNING] [08:44:39+0000] created by testing.(*T).Run
[WARNING] [08:44:39+0000] 	/usr/local/go/src/testing/testing.go:789 +0x2de
[WARNING] [08:44:39+0000] goroutine 73 [chan send, 9 minutes]:
[WARNING] [08:44:39+0000] testing.tRunner.func1(0xc4201f5c20)
[WARNING] [08:44:39+0000] 	/usr/local/go/src/testing/testing.go:741 +0x19b
[WARNING] [08:44:39+0000] testing.tRunner(0xc4201f5c20, 0xc4203b9900)
[WARNING] [08:44:39+0000] 	/usr/local/go/src/testing/testing.go:748 +0xda
[WARNING] [08:44:39+0000] created by testing.(*T).Run
[WARNING] [08:44:39+0000] 	/usr/local/go/src/testing/testing.go:789 +0x2de
[WARNING] [08:44:39+0000] goroutine 74 [chan send, 9 minutes]:
[WARNING] [08:44:39+0000] testing.tRunner.func1(0xc4201f5d10)
[WARNING] [08:44:39+0000] 	/usr/local/go/src/testing/testing.go:741 +0x19b
[WARNING] [08:44:39+0000] testing.tRunner(0xc4201f5d10, 0xc4203b9980)
[WARNING] [08:44:39+0000] 	/usr/local/go/src/testing/testing.go:748 +0xda
[WARNING] [08:44:39+0000] created by testing.(*T).Run
[WARNING] [08:44:39+0000] 	/usr/local/go/src/testing/testing.go:789 +0x2de
[WARNING] [08:44:39+0000] goroutine 75 [chan send, 9 minutes]:
[WARNING] [08:44:39+0000] testing.tRunner.func1(0xc4201f5e00)
[WARNING] [08:44:39+0000] 	/usr/local/go/src/testing/testing.go:741 +0x19b
[WARNING] [08:44:39+0000] testing.tRunner(0xc4201f5e00, 0xc4203b9a00)
[WARNING] [08:44:39+0000] 	/usr/local/go/src/testing/testing.go:748 +0xda
[WARNING] [08:44:39+0000] created by testing.(*T).Run
[WARNING] [08:44:39+0000] 	/usr/local/go/src/testing/testing.go:789 +0x2de
[WARNING] [08:44:39+0000] goroutine 76 [chan send, 9 minutes]:
[WARNING] [08:44:39+0000] testing.tRunner.func1(0xc4201f5ef0)
[WARNING] [08:44:39+0000] 	/usr/local/go/src/testing/testing.go:741 +0x19b
[WARNING] [08:44:39+0000] testing.tRunner(0xc4201f5ef0, 0xc4203b9a80)
[WARNING] [08:44:39+0000] 	/usr/local/go/src/testing/testing.go:748 +0xda
[WARNING] [08:44:39+0000] created by testing.(*T).Run
[WARNING] [08:44:39+0000] 	/usr/local/go/src/testing/testing.go:789 +0x2de
[WARNING] [08:44:39+0000] goroutine 77 [chan send, 10 minutes]:
[WARNING] [08:44:39+0000] testing.tRunner.func1(0xc420126000)
[WARNING] [08:44:39+0000] 	/usr/local/go/src/testing/testing.go:741 +0x19b
[WARNING] [08:44:39+0000] testing.tRunner(0xc420126000, 0xc4203b9b00)
[WARNING] [08:44:39+0000] 	/usr/local/go/src/testing/testing.go:748 +0xda
[WARNING] [08:44:39+0000] created by testing.(*T).Run
[WARNING] [08:44:39+0000] 	/usr/local/go/src/testing/testing.go:789 +0x2de
[WARNING] [08:44:39+0000] goroutine 78 [chan send, 10 minutes]:
[WARNING] [08:44:39+0000] testing.tRunner.func1(0xc4201260f0)
[WARNING] [08:44:39+0000] 	/usr/local/go/src/testing/testing.go:741 +0x19b
[WARNING] [08:44:39+0000] testing.tRunner(0xc4201260f0, 0xc4203b9b80)
[WARNING] [08:44:39+0000] 	/usr/local/go/src/testing/testing.go:748 +0xda
[WARNING] [08:44:39+0000] created by testing.(*T).Run
[WARNING] [08:44:39+0000] 	/usr/local/go/src/testing/testing.go:789 +0x2de
[WARNING] [08:44:39+0000] goroutine 79 [chan send, 10 minutes]:
[WARNING] [08:44:39+0000] testing.tRunner.func1(0xc4201261e0)
[WARNING] [08:44:39+0000] 	/usr/local/go/src/testing/testing.go:741 +0x19b
[WARNING] [08:44:39+0000] testing.tRunner(0xc4201261e0, 0xc4203b9c00)
[WARNING] [08:44:39+0000] 	/usr/local/go/src/testing/testing.go:748 +0xda
[WARNING] [08:44:39+0000] created by testing.(*T).Run
[WARNING] [08:44:39+0000] 	/usr/local/go/src/testing/testing.go:789 +0x2de
[WARNING] [08:44:39+0000] goroutine 80 [chan send, 10 minutes]:
[WARNING] [08:44:39+0000] testing.tRunner.func1(0xc4201262d0)
[WARNING] [08:44:39+0000] 	/usr/local/go/src/testing/testing.go:741 +0x19b
[WARNING] [08:44:39+0000] testing.tRunner(0xc4201262d0, 0xc4203b9c80)
[WARNING] [08:44:39+0000] 	/usr/local/go/src/testing/testing.go:748 +0xda
[WARNING] [08:44:39+0000] created by testing.(*T).Run
[WARNING] [08:44:39+0000] 	/usr/local/go/src/testing/testing.go:789 +0x2de
[WARNING] [08:44:39+0000] goroutine 81 [chan send, 11 minutes]:
[WARNING] [08:44:39+0000] testing.tRunner.func1(0xc4201263c0)
[WARNING] [08:44:39+0000] 	/usr/local/go/src/testing/testing.go:741 +0x19b
[WARNING] [08:44:39+0000] testing.tRunner(0xc4201263c0, 0xc4203b9d00)
[WARNING] [08:44:39+0000] 	/usr/local/go/src/testing/testing.go:748 +0xda
[WARNING] [08:44:39+0000] created by testing.(*T).Run
[WARNING] [08:44:39+0000] 	/usr/local/go/src/testing/testing.go:789 +0x2de
[WARNING] [08:44:39+0000] goroutine 82 [chan send, 11 minutes]:
[WARNING] [08:44:39+0000] testing.tRunner.func1(0xc4201264b0)
[WARNING] [08:44:39+0000] 	/usr/local/go/src/testing/testing.go:741 +0x19b
[WARNING] [08:44:39+0000] testing.tRunner(0xc4201264b0, 0xc4203b9d80)
[WARNING] [08:44:39+0000] 	/usr/local/go/src/testing/testing.go:748 +0xda
[WARNING] [08:44:39+0000] created by testing.(*T).Run
[WARNING] [08:44:39+0000] 	/usr/local/go/src/testing/testing.go:789 +0x2de
[WARNING] [08:44:39+0000] goroutine 83 [chan send, 11 minutes]:
[WARNING] [08:44:39+0000] testing.tRunner.func1(0xc4201265a0)
[WARNING] [08:44:39+0000] 	/usr/local/go/src/testing/testing.go:741 +0x19b
[WARNING] [08:44:39+0000] testing.tRunner(0xc4201265a0, 0xc4203b9e00)
[WARNING] [08:44:39+0000] 	/usr/local/go/src/testing/testing.go:748 +0xda
[WARNING] [08:44:39+0000] created by testing.(*T).Run
[WARNING] [08:44:39+0000] 	/usr/local/go/src/testing/testing.go:789 +0x2de
[WARNING] [08:44:39+0000] goroutine 84 [chan send, 11 minutes]:
[WARNING] [08:44:39+0000] testing.tRunner.func1(0xc420126690)
[WARNING] [08:44:39+0000] 	/usr/local/go/src/testing/testing.go:741 +0x19b
[WARNING] [08:44:39+0000] testing.tRunner(0xc420126690, 0xc4203b9e80)
[WARNING] [08:44:39+0000] 	/usr/local/go/src/testing/testing.go:748 +0xda
[WARNING] [08:44:39+0000] created by testing.(*T).Run
[WARNING] [08:44:39+0000] 	/usr/local/go/src/testing/testing.go:789 +0x2de
[WARNING] [08:44:39+0000] goroutine 85 [chan send, 11 minutes]:
[WARNING] [08:44:39+0000] testing.tRunner.func1(0xc420126780)
[WARNING] [08:44:39+0000] 	/usr/local/go/src/testing/testing.go:741 +0x19b
[WARNING] [08:44:39+0000] testing.tRunner(0xc420126780, 0xc4203b9f00)
[WARNING] [08:44:39+0000] 	/usr/local/go/src/testing/testing.go:748 +0xda
[WARNING] [08:44:39+0000] created by testing.(*T).Run
[WARNING] [08:44:39+0000] 	/usr/local/go/src/testing/testing.go:789 +0x2de
[WARNING] [08:44:39+0000] goroutine 86 [chan send, 8 minutes]:
[WARNING] [08:44:39+0000] testing.tRunner.func1(0xc420126870)
[WARNING] [08:44:39+0000] 	/usr/local/go/src/testing/testing.go:741 +0x19b
[WARNING] [08:44:39+0000] testing.tRunner(0xc420126870, 0xc4203b9f80)
[WARNING] [08:44:39+0000] 	/usr/local/go/src/testing/testing.go:748 +0xda
[WARNING] [08:44:39+0000] created by testing.(*T).Run
[WARNING] [08:44:39+0000] 	/usr/local/go/src/testing/testing.go:789 +0x2de
[WARNING] [08:44:39+0000] goroutine 87 [chan send, 11 minutes]:
[WARNING] [08:44:39+0000] testing.tRunner.func1(0xc420126960)
[WARNING] [08:44:39+0000] 	/usr/local/go/src/testing/testing.go:741 +0x19b
[WARNING] [08:44:39+0000] testing.tRunner(0xc420126960, 0xc42012a000)
[WARNING] [08:44:39+0000] 	/usr/local/go/src/testing/testing.go:748 +0xda
[WARNING] [08:44:39+0000] created by testing.(*T).Run
[WARNING] [08:44:39+0000] 	/usr/local/go/src/testing/testing.go:789 +0x2de
[WARNING] [08:44:39+0000] goroutine 88 [chan send, 11 minutes]:
[WARNING] [08:44:39+0000] testing.tRunner.func1(0xc420126a50)
[WARNING] [08:44:39+0000] 	/usr/local/go/src/testing/testing.go:741 +0x19b
[WARNING] [08:44:39+0000] testing.tRunner(0xc420126a50, 0xc42012a080)
[WARNING] [08:44:39+0000] 	/usr/local/go/src/testing/testing.go:748 +0xda
[WARNING] [08:44:39+0000] created by testing.(*T).Run
[WARNING] [08:44:39+0000] 	/usr/local/go/src/testing/testing.go:789 +0x2de
[WARNING] [08:44:39+0000] goroutine 89 [chan send, 11 minutes]:
[WARNING] [08:44:39+0000] testing.tRunner.func1(0xc420126b40)
[WARNING] [08:44:39+0000] 	/usr/local/go/src/testing/testing.go:741 +0x19b
[WARNING] [08:44:39+0000] testing.tRunner(0xc420126b40, 0xc42012a100)
[WARNING] [08:44:39+0000] 	/usr/local/go/src/testing/testing.go:748 +0xda
[WARNING] [08:44:39+0000] created by testing.(*T).Run
[WARNING] [08:44:39+0000] 	/usr/local/go/src/testing/testing.go:789 +0x2de
[WARNING] [08:44:39+0000] goroutine 90 [chan send, 12 minutes]:
[WARNING] [08:44:39+0000] testing.tRunner.func1(0xc420126c30)
[WARNING] [08:44:39+0000] 	/usr/local/go/src/testing/testing.go:741 +0x19b
[WARNING] [08:44:39+0000] testing.tRunner(0xc420126c30, 0xc42012a180)
[WARNING] [08:44:39+0000] 	/usr/local/go/src/testing/testing.go:748 +0xda
[WARNING] [08:44:39+0000] created by testing.(*T).Run
[WARNING] [08:44:39+0000] 	/usr/local/go/src/testing/testing.go:789 +0x2de
[WARNING] [08:44:39+0000] goroutine 91 [chan send, 12 minutes]:
[WARNING] [08:44:39+0000] testing.tRunner.func1(0xc420126d20)
[WARNING] [08:44:39+0000] 	/usr/local/go/src/testing/testing.go:741 +0x19b
[WARNING] [08:44:39+0000] testing.tRunner(0xc420126d20, 0xc42012a200)
[WARNING] [08:44:39+0000] 	/usr/local/go/src/testing/testing.go:748 +0xda
[WARNING] [08:44:39+0000] created by testing.(*T).Run
[WARNING] [08:44:39+0000] 	/usr/local/go/src/testing/testing.go:789 +0x2de
[WARNING] [08:44:39+0000] goroutine 92 [chan send, 12 minutes]:
[WARNING] [08:44:39+0000] testing.tRunner.func1(0xc420126e10)
[WARNING] [08:44:39+0000] 	/usr/local/go/src/testing/testing.go:741 +0x19b
[WARNING] [08:44:39+0000] testing.tRunner(0xc420126e10, 0xc42012a280)
[WARNING] [08:44:39+0000] 	/usr/local/go/src/testing/testing.go:748 +0xda
[WARNING] [08:44:39+0000] created by testing.(*T).Run
[WARNING] [08:44:39+0000] 	/usr/local/go/src/testing/testing.go:789 +0x2de
[WARNING] [08:44:39+0000] goroutine 93 [chan send, 12 minutes]:
[WARNING] [08:44:39+0000] testing.tRunner.func1(0xc420126f00)
[WARNING] [08:44:39+0000] 	/usr/local/go/src/testing/testing.go:741 +0x19b
[WARNING] [08:44:39+0000] testing.tRunner(0xc420126f00, 0xc42012a300)
[WARNING] [08:44:39+0000] 	/usr/local/go/src/testing/testing.go:748 +0xda
[WARNING] [08:44:39+0000] created by testing.(*T).Run
[WARNING] [08:44:39+0000] 	/usr/local/go/src/testing/testing.go:789 +0x2de
[WARNING] [08:44:39+0000] goroutine 94 [chan send, 12 minutes]:
[WARNING] [08:44:39+0000] testing.tRunner.func1(0xc420126ff0)
[WARNING] [08:44:39+0000] 	/usr/local/go/src/testing/testing.go:741 +0x19b
[WARNING] [08:44:39+0000] testing.tRunner(0xc420126ff0, 0xc42012a380)
[WARNING] [08:44:39+0000] 	/usr/local/go/src/testing/testing.go:748 +0xda
[WARNING] [08:44:39+0000] created by testing.(*T).Run
[WARNING] [08:44:39+0000] 	/usr/local/go/src/testing/testing.go:789 +0x2de
[WARNING] [08:44:39+0000] goroutine 95 [chan send, 12 minutes]:
[WARNING] [08:44:39+0000] testing.tRunner.func1(0xc4201270e0)
[WARNING] [08:44:39+0000] 	/usr/local/go/src/testing/testing.go:741 +0x19b
[WARNING] [08:44:39+0000] testing.tRunner(0xc4201270e0, 0xc42012a400)
[WARNING] [08:44:39+0000] 	/usr/local/go/src/testing/testing.go:748 +0xda
[WARNING] [08:44:39+0000] created by testing.(*T).Run
[WARNING] [08:44:39+0000] 	/usr/local/go/src/testing/testing.go:789 +0x2de
[WARNING] [08:44:39+0000] goroutine 96 [chan send, 12 minutes]:
[WARNING] [08:44:39+0000] testing.tRunner.func1(0xc4201271d0)
[WARNING] [08:44:39+0000] 	/usr/local/go/src/testing/testing.go:741 +0x19b
[WARNING] [08:44:39+0000] testing.tRunner(0xc4201271d0, 0xc42012a480)
[WARNING] [08:44:39+0000] 	/usr/local/go/src/testing/testing.go:748 +0xda
[WARNING] [08:44:39+0000] created by testing.(*T).Run
[WARNING] [08:44:39+0000] 	/usr/local/go/src/testing/testing.go:789 +0x2de
[WARNING] [08:44:39+0000] goroutine 97 [chan send, 13 minutes]:
[WARNING] [08:44:39+0000] testing.tRunner.func1(0xc4201272c0)
[WARNING] [08:44:39+0000] 	/usr/local/go/src/testing/testing.go:741 +0x19b
[WARNING] [08:44:39+0000] testing.tRunner(0xc4201272c0, 0xc42012a500)
[WARNING] [08:44:39+0000] 	/usr/local/go/src/testing/testing.go:748 +0xda
[WARNING] [08:44:39+0000] created by testing.(*T).Run
[WARNING] [08:44:39+0000] 	/usr/local/go/src/testing/testing.go:789 +0x2de
[WARNING] [08:44:39+0000] goroutine 98 [chan send, 13 minutes]:
[WARNING] [08:44:39+0000] testing.tRunner.func1(0xc4201273b0)
[WARNING] [08:44:39+0000] 	/usr/local/go/src/testing/testing.go:741 +0x19b
[WARNING] [08:44:39+0000] testing.tRunner(0xc4201273b0, 0xc42012a580)
[WARNING] [08:44:39+0000] 	/usr/local/go/src/testing/testing.go:748 +0xda
[WARNING] [08:44:39+0000] created by testing.(*T).Run
[WARNING] [08:44:39+0000] 	/usr/local/go/src/testing/testing.go:789 +0x2de
[WARNING] [08:44:39+0000] goroutine 99 [chan send, 13 minutes]:
[WARNING] [08:44:39+0000] testing.tRunner.func1(0xc4201274a0)
[WARNING] [08:44:39+0000] 	/usr/local/go/src/testing/testing.go:741 +0x19b
[WARNING] [08:44:39+0000] testing.tRunner(0xc4201274a0, 0xc42012a600)
[WARNING] [08:44:39+0000] 	/usr/local/go/src/testing/testing.go:748 +0xda
[WARNING] [08:44:39+0000] created by testing.(*T).Run
[WARNING] [08:44:39+0000] 	/usr/local/go/src/testing/testing.go:789 +0x2de
[WARNING] [08:44:39+0000] goroutine 100 [chan send, 13 minutes]:
[WARNING] [08:44:39+0000] testing.tRunner.func1(0xc420127590)
[WARNING] [08:44:39+0000] 	/usr/local/go/src/testing/testing.go:741 +0x19b
[WARNING] [08:44:39+0000] testing.tRunner(0xc420127590, 0xc42012a680)
[WARNING] [08:44:39+0000] 	/usr/local/go/src/testing/testing.go:748 +0xda
[WARNING] [08:44:39+0000] created by testing.(*T).Run
[WARNING] [08:44:39+0000] 	/usr/local/go/src/testing/testing.go:789 +0x2de
[WARNING] [08:44:39+0000] goroutine 101 [chan send, 13 minutes]:
[WARNING] [08:44:39+0000] testing.tRunner.func1(0xc420127680)
[WARNING] [08:44:39+0000] 	/usr/local/go/src/testing/testing.go:741 +0x19b
[WARNING] [08:44:39+0000] testing.tRunner(0xc420127680, 0xc42012a700)
[WARNING] [08:44:39+0000] 	/usr/local/go/src/testing/testing.go:748 +0xda
[WARNING] [08:44:39+0000] created by testing.(*T).Run
[WARNING] [08:44:39+0000] 	/usr/local/go/src/testing/testing.go:789 +0x2de
[WARNING] [08:44:39+0000] goroutine 102 [chan send, 14 minutes]:
[WARNING] [08:44:39+0000] testing.tRunner.func1(0xc420127770)
[WARNING] [08:44:39+0000] 	/usr/local/go/src/testing/testing.go:741 +0x19b
[WARNING] [08:44:39+0000] testing.tRunner(0xc420127770, 0xc42012a780)
[WARNING] [08:44:39+0000] 	/usr/local/go/src/testing/testing.go:748 +0xda
[WARNING] [08:44:39+0000] created by testing.(*T).Run
[WARNING] [08:44:39+0000] 	/usr/local/go/src/testing/testing.go:789 +0x2de
[WARNING] [08:44:39+0000] goroutine 103 [chan send, 14 minutes]:
[WARNING] [08:44:39+0000] testing.tRunner.func1(0xc420127860)
[WARNING] [08:44:39+0000] 	/usr/local/go/src/testing/testing.go:741 +0x19b
[WARNING] [08:44:39+0000] testing.tRunner(0xc420127860, 0xc42012a800)
[WARNING] [08:44:39+0000] 	/usr/local/go/src/testing/testing.go:748 +0xda
[WARNING] [08:44:39+0000] created by testing.(*T).Run
[WARNING] [08:44:39+0000] 	/usr/local/go/src/testing/testing.go:789 +0x2de
[WARNING] [08:44:39+0000] goroutine 104 [chan send, 14 minutes]:
[WARNING] [08:44:39+0000] testing.tRunner.func1(0xc420127950)
[WARNING] [08:44:39+0000] 	/usr/local/go/src/testing/testing.go:741 +0x19b
[WARNING] [08:44:39+0000] testing.tRunner(0xc420127950, 0xc42012a880)
[WARNING] [08:44:39+0000] 	/usr/local/go/src/testing/testing.go:748 +0xda
[WARNING] [08:44:39+0000] created by testing.(*T).Run
[WARNING] [08:44:39+0000] 	/usr/local/go/src/testing/testing.go:789 +0x2de
[WARNING] [08:44:39+0000] goroutine 105 [chan send, 14 minutes]:
[WARNING] [08:44:39+0000] testing.tRunner.func1(0xc420127a40)
[WARNING] [08:44:39+0000] 	/usr/local/go/src/testing/testing.go:741 +0x19b
[WARNING] [08:44:39+0000] testing.tRunner(0xc420127a40, 0xc42012a900)
[WARNING] [08:44:39+0000] 	/usr/local/go/src/testing/testing.go:748 +0xda
[WARNING] [08:44:39+0000] created by testing.(*T).Run
[WARNING] [08:44:39+0000] 	/usr/local/go/src/testing/testing.go:789 +0x2de
[WARNING] [08:44:39+0000] goroutine 106 [chan send, 14 minutes]:
[WARNING] [08:44:39+0000] testing.tRunner.func1(0xc420127b30)
[WARNING] [08:44:39+0000] 	/usr/local/go/src/testing/testing.go:741 +0x19b
[WARNING] [08:44:39+0000] testing.tRunner(0xc420127b30, 0xc42012a980)
[WARNING] [08:44:39+0000] 	/usr/local/go/src/testing/testing.go:748 +0xda
[WARNING] [08:44:39+0000] created by testing.(*T).Run
[WARNING] [08:44:39+0000] 	/usr/local/go/src/testing/testing.go:789 +0x2de
[WARNING] [08:44:39+0000] goroutine 107 [chan send, 14 minutes]:
[WARNING] [08:44:39+0000] testing.tRunner.func1(0xc420127c20)
[WARNING] [08:44:39+0000] 	/usr/local/go/src/testing/testing.go:741 +0x19b
[WARNING] [08:44:39+0000] testing.tRunner(0xc420127c20, 0xc42012aa00)
[WARNING] [08:44:39+0000] 	/usr/local/go/src/testing/testing.go:748 +0xda
[WARNING] [08:44:39+0000] created by testing.(*T).Run
[WARNING] [08:44:39+0000] 	/usr/local/go/src/testing/testing.go:789 +0x2de
[WARNING] [08:44:39+0000] goroutine 108 [chan send, 15 minutes]:
[WARNING] [08:44:39+0000] testing.tRunner.func1(0xc420127d10)
[WARNING] [08:44:39+0000] 	/usr/local/go/src/testing/testing.go:741 +0x19b
[WARNING] [08:44:39+0000] testing.tRunner(0xc420127d10, 0xc42012aa80)
[WARNING] [08:44:39+0000] 	/usr/local/go/src/testing/testing.go:748 +0xda
[WARNING] [08:44:39+0000] created by testing.(*T).Run
[WARNING] [08:44:39+0000] 	/usr/local/go/src/testing/testing.go:789 +0x2de
[WARNING] [08:44:39+0000] goroutine 109 [chan send, 15 minutes]:
[WARNING] [08:44:39+0000] testing.tRunner.func1(0xc420127e00)
[WARNING] [08:44:39+0000] 	/usr/local/go/src/testing/testing.go:741 +0x19b
[WARNING] [08:44:39+0000] testing.tRunner(0xc420127e00, 0xc42012ab00)
[WARNING] [08:44:39+0000] 	/usr/local/go/src/testing/testing.go:748 +0xda
[WARNING] [08:44:39+0000] created by testing.(*T).Run
[WARNING] [08:44:39+0000] 	/usr/local/go/src/testing/testing.go:789 +0x2de
[WARNING] [08:44:39+0000] goroutine 110 [chan send, 15 minutes]:
[WARNING] [08:44:39+0000] testing.tRunner.func1(0xc420127ef0)
[WARNING] [08:44:39+0000] 	/usr/local/go/src/testing/testing.go:741 +0x19b
[WARNING] [08:44:39+0000] testing.tRunner(0xc420127ef0, 0xc42012ab80)
[WARNING] [08:44:39+0000] 	/usr/local/go/src/testing/testing.go:748 +0xda
[WARNING] [08:44:39+0000] created by testing.(*T).Run
[WARNING] [08:44:39+0000] 	/usr/local/go/src/testing/testing.go:789 +0x2de
[WARNING] [08:44:39+0000] goroutine 111 [chan send, 15 minutes]:
[WARNING] [08:44:39+0000] testing.tRunner.func1(0xc420164000)
[WARNING] [08:44:39+0000] 	/usr/local/go/src/testing/testing.go:741 +0x19b
[WARNING] [08:44:39+0000] testing.tRunner(0xc420164000, 0xc42012ac00)
[WARNING] [08:44:39+0000] 	/usr/local/go/src/testing/testing.go:748 +0xda
[WARNING] [08:44:39+0000] created by testing.(*T).Run
[WARNING] [08:44:39+0000] 	/usr/local/go/src/testing/testing.go:789 +0x2de
[WARNING] [08:44:39+0000] goroutine 112 [chan send, 31 minutes]:
[WARNING] [08:44:39+0000] testing.tRunner.func1(0xc4201640f0)
[WARNING] [08:44:39+0000] 	/usr/local/go/src/testing/testing.go:741 +0x19b
[WARNING] [08:44:39+0000] testing.tRunner(0xc4201640f0, 0xc42012ac80)
[WARNING] [08:44:39+0000] 	/usr/local/go/src/testing/testing.go:748 +0xda
[WARNING] [08:44:39+0000] created by testing.(*T).Run
[WARNING] [08:44:39+0000] 	/usr/local/go/src/testing/testing.go:789 +0x2de
[WARNING] [08:44:39+0000] goroutine 113 [chan send, 15 minutes]:
[WARNING] [08:44:39+0000] testing.tRunner.func1(0xc4201641e0)
[WARNING] [08:44:39+0000] 	/usr/local/go/src/testing/testing.go:741 +0x19b
[WARNING] [08:44:39+0000] testing.tRunner(0xc4201641e0, 0xc42012ad00)
[WARNING] [08:44:39+0000] 	/usr/local/go/src/testing/testing.go:748 +0xda
[WARNING] [08:44:39+0000] created by testing.(*T).Run
[WARNING] [08:44:39+0000] 	/usr/local/go/src/testing/testing.go:789 +0x2de
[WARNING] [08:44:39+0000] goroutine 114 [chan send, 15 minutes]:
[WARNING] [08:44:39+0000] testing.tRunner.func1(0xc4201642d0)
[WARNING] [08:44:39+0000] 	/usr/local/go/src/testing/testing.go:741 +0x19b
[WARNING] [08:44:39+0000] testing.tRunner(0xc4201642d0, 0xc42012ad80)
[WARNING] [08:44:39+0000] 	/usr/local/go/src/testing/testing.go:748 +0xda
[WARNING] [08:44:39+0000] created by testing.(*T).Run
[WARNING] [08:44:39+0000] 	/usr/local/go/src/testing/testing.go:789 +0x2de
[WARNING] [08:44:39+0000] goroutine 115 [chan send, 15 minutes]:
[WARNING] [08:44:39+0000] testing.tRunner.func1(0xc4201643c0)
[WARNING] [08:44:39+0000] 	/usr/local/go/src/testing/testing.go:741 +0x19b
[WARNING] [08:44:39+0000] testing.tRunner(0xc4201643c0, 0xc42012ae00)
[WARNING] [08:44:39+0000] 	/usr/local/go/src/testing/testing.go:748 +0xda
[WARNING] [08:44:39+0000] created by testing.(*T).Run
[WARNING] [08:44:39+0000] 	/usr/local/go/src/testing/testing.go:789 +0x2de
[WARNING] [08:44:39+0000] goroutine 116 [chan send, 15 minutes]:
[WARNING] [08:44:39+0000] testing.tRunner.func1(0xc4201644b0)
[WARNING] [08:44:39+0000] 	/usr/local/go/src/testing/testing.go:741 +0x19b
[WARNING] [08:44:39+0000] testing.tRunner(0xc4201644b0, 0xc42012ae80)
[WARNING] [08:44:39+0000] 	/usr/local/go/src/testing/testing.go:748 +0xda
[WARNING] [08:44:39+0000] created by testing.(*T).Run
[WARNING] [08:44:39+0000] 	/usr/local/go/src/testing/testing.go:789 +0x2de
[WARNING] [08:44:39+0000] goroutine 117 [chan send, 16 minutes]:
[WARNING] [08:44:39+0000] testing.tRunner.func1(0xc4201645a0)
[WARNING] [08:44:39+0000] 	/usr/local/go/src/testing/testing.go:741 +0x19b
[WARNING] [08:44:39+0000] testing.tRunner(0xc4201645a0, 0xc42012af00)
[WARNING] [08:44:39+0000] 	/usr/local/go/src/testing/testing.go:748 +0xda
[WARNING] [08:44:39+0000] created by testing.(*T).Run
[WARNING] [08:44:39+0000] 	/usr/local/go/src/testing/testing.go:789 +0x2de
[WARNING] [08:44:39+0000] goroutine 118 [chan send, 15 minutes]:
[WARNING] [08:44:39+0000] testing.tRunner.func1(0xc420164690)
[WARNING] [08:44:39+0000] 	/usr/local/go/src/testing/testing.go:741 +0x19b
[WARNING] [08:44:39+0000] testing.tRunner(0xc420164690, 0xc42012af80)
[WARNING] [08:44:39+0000] 	/usr/local/go/src/testing/testing.go:748 +0xda
[WARNING] [08:44:39+0000] created by testing.(*T).Run
[WARNING] [08:44:39+0000] 	/usr/local/go/src/testing/testing.go:789 +0x2de
[WARNING] [08:44:39+0000] goroutine 119 [chan send, 16 minutes]:
[WARNING] [08:44:39+0000] testing.tRunner.func1(0xc420164780)
[WARNING] [08:44:39+0000] 	/usr/local/go/src/testing/testing.go:741 +0x19b
[WARNING] [08:44:39+0000] testing.tRunner(0xc420164780, 0xc42012b000)
[WARNING] [08:44:39+0000] 	/usr/local/go/src/testing/testing.go:748 +0xda
[WARNING] [08:44:39+0000] created by testing.(*T).Run
[WARNING] [08:44:39+0000] 	/usr/local/go/src/testing/testing.go:789 +0x2de
[WARNING] [08:44:39+0000] goroutine 120 [chan send, 16 minutes]:
[WARNING] [08:44:39+0000] testing.tRunner.func1(0xc420164870)
[WARNING] [08:44:39+0000] 	/usr/local/go/src/testing/testing.go:741 +0x19b
[WARNING] [08:44:39+0000] testing.tRunner(0xc420164870, 0xc42012b080)
[WARNING] [08:44:39+0000] 	/usr/local/go/src/testing/testing.go:748 +0xda
[WARNING] [08:44:39+0000] created by testing.(*T).Run
[WARNING] [08:44:39+0000] 	/usr/local/go/src/testing/testing.go:789 +0x2de
[WARNING] [08:44:39+0000] goroutine 121 [chan send, 16 minutes]:
[WARNING] [08:44:39+0000] testing.tRunner.func1(0xc420164960)
[WARNING] [08:44:39+0000] 	/usr/local/go/src/testing/testing.go:741 +0x19b
[WARNING] [08:44:39+0000] testing.tRunner(0xc420164960, 0xc42012b100)
[WARNING] [08:44:39+0000] 	/usr/local/go/src/testing/testing.go:748 +0xda
[WARNING] [08:44:39+0000] created by testing.(*T).Run
[WARNING] [08:44:39+0000] 	/usr/local/go/src/testing/testing.go:789 +0x2de
[WARNING] [08:44:39+0000] goroutine 122 [chan send, 16 minutes]:
[WARNING] [08:44:39+0000] testing.tRunner.func1(0xc420164a50)
[WARNING] [08:44:39+0000] 	/usr/local/go/src/testing/testing.go:741 +0x19b
[WARNING] [08:44:39+0000] testing.tRunner(0xc420164a50, 0xc42012b180)
[WARNING] [08:44:39+0000] 	/usr/local/go/src/testing/testing.go:748 +0xda
[WARNING] [08:44:39+0000] created by testing.(*T).Run
[WARNING] [08:44:39+0000] 	/usr/local/go/src/testing/testing.go:789 +0x2de
[WARNING] [08:44:39+0000] goroutine 123 [chan send, 16 minutes]:
[WARNING] [08:44:39+0000] testing.tRunner.func1(0xc420164b40)
[WARNING] [08:44:39+0000] 	/usr/local/go/src/testing/testing.go:741 +0x19b
[WARNING] [08:44:39+0000] testing.tRunner(0xc420164b40, 0xc42012b200)
[WARNING] [08:44:39+0000] 	/usr/local/go/src/testing/testing.go:748 +0xda
[WARNING] [08:44:39+0000] created by testing.(*T).Run
[WARNING] [08:44:39+0000] 	/usr/local/go/src/testing/testing.go:789 +0x2de
[WARNING] [08:44:39+0000] goroutine 124 [chan send, 16 minutes]:
[WARNING] [08:44:39+0000] testing.tRunner.func1(0xc420164c30)
[WARNING] [08:44:39+0000] 	/usr/local/go/src/testing/testing.go:741 +0x19b
[WARNING] [08:44:39+0000] testing.tRunner(0xc420164c30, 0xc42012b280)
[WARNING] [08:44:39+0000] 	/usr/local/go/src/testing/testing.go:748 +0xda
[WARNING] [08:44:39+0000] created by testing.(*T).Run
[WARNING] [08:44:39+0000] 	/usr/local/go/src/testing/testing.go:789 +0x2de
[WARNING] [08:44:39+0000] goroutine 125 [chan send, 17 minutes]:
[WARNING] [08:44:39+0000] testing.tRunner.func1(0xc420164d20)
[WARNING] [08:44:39+0000] 	/usr/local/go/src/testing/testing.go:741 +0x19b
[WARNING] [08:44:39+0000] testing.tRunner(0xc420164d20, 0xc42012b300)
[WARNING] [08:44:39+0000] 	/usr/local/go/src/testing/testing.go:748 +0xda
[WARNING] [08:44:39+0000] created by testing.(*T).Run
[WARNING] [08:44:39+0000] 	/usr/local/go/src/testing/testing.go:789 +0x2de
[WARNING] [08:44:39+0000] goroutine 126 [chan send, 17 minutes]:
[WARNING] [08:44:39+0000] testing.tRunner.func1(0xc420164e10)
[WARNING] [08:44:39+0000] 	/usr/local/go/src/testing/testing.go:741 +0x19b
[WARNING] [08:44:39+0000] testing.tRunner(0xc420164e10, 0xc42012b380)
[WARNING] [08:44:39+0000] 	/usr/local/go/src/testing/testing.go:748 +0xda
[WARNING] [08:44:39+0000] created by testing.(*T).Run
[WARNING] [08:44:39+0000] 	/usr/local/go/src/testing/testing.go:789 +0x2de
[WARNING] [08:44:39+0000] goroutine 127 [chan send, 17 minutes]:
[WARNING] [08:44:39+0000] testing.tRunner.func1(0xc420164f00)
[WARNING] [08:44:39+0000] 	/usr/local/go/src/testing/testing.go:741 +0x19b
[WARNING] [08:44:39+0000] testing.tRunner(0xc420164f00, 0xc42012b400)
[WARNING] [08:44:39+0000] 	/usr/local/go/src/testing/testing.go:748 +0xda
[WARNING] [08:44:39+0000] created by testing.(*T).Run
[WARNING] [08:44:39+0000] 	/usr/local/go/src/testing/testing.go:789 +0x2de
[WARNING] [08:44:39+0000] goroutine 128 [chan send, 17 minutes]:
[WARNING] [08:44:39+0000] testing.tRunner.func1(0xc420164ff0)
[WARNING] [08:44:39+0000] 	/usr/local/go/src/testing/testing.go:741 +0x19b
[WARNING] [08:44:39+0000] testing.tRunner(0xc420164ff0, 0xc42012b480)
[WARNING] [08:44:39+0000] 	/usr/local/go/src/testing/testing.go:748 +0xda
[WARNING] [08:44:39+0000] created by testing.(*T).Run
[WARNING] [08:44:39+0000] 	/usr/local/go/src/testing/testing.go:789 +0x2de
[WARNING] [08:44:39+0000] goroutine 129 [chan send, 18 minutes]:
[WARNING] [08:44:39+0000] testing.tRunner.func1(0xc4201650e0)
[WARNING] [08:44:39+0000] 	/usr/local/go/src/testing/testing.go:741 +0x19b
[WARNING] [08:44:39+0000] testing.tRunner(0xc4201650e0, 0xc42012b500)
[WARNING] [08:44:39+0000] 	/usr/local/go/src/testing/testing.go:748 +0xda
[WARNING] [08:44:39+0000] created by testing.(*T).Run
[WARNING] [08:44:39+0000] 	/usr/local/go/src/testing/testing.go:789 +0x2de
[WARNING] [08:44:39+0000] goroutine 130 [chan send, 17 minutes]:
[WARNING] [08:44:39+0000] testing.tRunner.func1(0xc4201651d0)
[WARNING] [08:44:39+0000] 	/usr/local/go/src/testing/testing.go:741 +0x19b
[WARNING] [08:44:39+0000] testing.tRunner(0xc4201651d0, 0xc42012b580)
[WARNING] [08:44:39+0000] 	/usr/local/go/src/testing/testing.go:748 +0xda
[WARNING] [08:44:39+0000] created by testing.(*T).Run
[WARNING] [08:44:39+0000] 	/usr/local/go/src/testing/testing.go:789 +0x2de
[WARNING] [08:44:39+0000] goroutine 131 [chan send, 18 minutes]:
[WARNING] [08:44:39+0000] testing.tRunner.func1(0xc4201652c0)
[WARNING] [08:44:39+0000] 	/usr/local/go/src/testing/testing.go:741 +0x19b
[WARNING] [08:44:39+0000] testing.tRunner(0xc4201652c0, 0xc42012b600)
[WARNING] [08:44:39+0000] 	/usr/local/go/src/testing/testing.go:748 +0xda
[WARNING] [08:44:39+0000] created by testing.(*T).Run
[WARNING] [08:44:39+0000] 	/usr/local/go/src/testing/testing.go:789 +0x2de
[WARNING] [08:44:39+0000] goroutine 132 [chan send, 11 minutes]:
[WARNING] [08:44:39+0000] testing.tRunner.func1(0xc4201653b0)
[WARNING] [08:44:39+0000] 	/usr/local/go/src/testing/testing.go:741 +0x19b
[WARNING] [08:44:39+0000] testing.tRunner(0xc4201653b0, 0xc42012b680)
[WARNING] [08:44:39+0000] 	/usr/local/go/src/testing/testing.go:748 +0xda
[WARNING] [08:44:39+0000] created by testing.(*T).Run
[WARNING] [08:44:39+0000] 	/usr/local/go/src/testing/testing.go:789 +0x2de
[WARNING] [08:44:39+0000] goroutine 133 [chan send, 14 minutes]:
[WARNING] [08:44:39+0000] testing.tRunner.func1(0xc4201654a0)
[WARNING] [08:44:39+0000] 	/usr/local/go/src/testing/testing.go:741 +0x19b
[WARNING] [08:44:39+0000] testing.tRunner(0xc4201654a0, 0xc42012b700)
[WARNING] [08:44:39+0000] 	/usr/local/go/src/testing/testing.go:748 +0xda
[WARNING] [08:44:39+0000] created by testing.(*T).Run
[WARNING] [08:44:39+0000] 	/usr/local/go/src/testing/testing.go:789 +0x2de
[WARNING] [08:44:39+0000] goroutine 134 [chan send, 19 minutes]:
[WARNING] [08:44:39+0000] testing.tRunner.func1(0xc420165590)
[WARNING] [08:44:39+0000] 	/usr/local/go/src/testing/testing.go:741 +0x19b
[WARNING] [08:44:39+0000] testing.tRunner(0xc420165590, 0xc42012b780)
[WARNING] [08:44:39+0000] 	/usr/local/go/src/testing/testing.go:748 +0xda
[WARNING] [08:44:39+0000] created by testing.(*T).Run
[WARNING] [08:44:39+0000] 	/usr/local/go/src/testing/testing.go:789 +0x2de
[WARNING] [08:44:39+0000] goroutine 135 [chan send, 19 minutes]:
[WARNING] [08:44:39+0000] testing.tRunner.func1(0xc420165680)
[WARNING] [08:44:39+0000] 	/usr/local/go/src/testing/testing.go:741 +0x19b
[WARNING] [08:44:39+0000] testing.tRunner(0xc420165680, 0xc42012b800)
[WARNING] [08:44:39+0000] 	/usr/local/go/src/testing/testing.go:748 +0xda
[WARNING] [08:44:39+0000] created by testing.(*T).Run
[WARNING] [08:44:39+0000] 	/usr/local/go/src/testing/testing.go:789 +0x2de
[WARNING] [08:44:39+0000] goroutine 136 [chan send, 19 minutes]:
[WARNING] [08:44:39+0000] testing.tRunner.func1(0xc420165770)
[WARNING] [08:44:39+0000] 	/usr/local/go/src/testing/testing.go:741 +0x19b
[WARNING] [08:44:39+0000] testing.tRunner(0xc420165770, 0xc42012b880)
[WARNING] [08:44:39+0000] 	/usr/local/go/src/testing/testing.go:748 +0xda
[WARNING] [08:44:39+0000] created by testing.(*T).Run
[WARNING] [08:44:39+0000] 	/usr/local/go/src/testing/testing.go:789 +0x2de
[WARNING] [08:44:39+0000] goroutine 137 [chan send, 19 minutes]:
[WARNING] [08:44:39+0000] testing.tRunner.func1(0xc420165860)
[WARNING] [08:44:39+0000] 	/usr/local/go/src/testing/testing.go:741 +0x19b
[WARNING] [08:44:39+0000] testing.tRunner(0xc420165860, 0xc42012b900)
[WARNING] [08:44:39+0000] 	/usr/local/go/src/testing/testing.go:748 +0xda
[WARNING] [08:44:39+0000] created by testing.(*T).Run
[WARNING] [08:44:39+0000] 	/usr/local/go/src/testing/testing.go:789 +0x2de
[WARNING] [08:44:39+0000] goroutine 138 [chan send, 19 minutes]:
[WARNING] [08:44:39+0000] testing.tRunner.func1(0xc420165950)
[WARNING] [08:44:39+0000] 	/usr/local/go/src/testing/testing.go:741 +0x19b
[WARNING] [08:44:39+0000] testing.tRunner(0xc420165950, 0xc42012b980)
[WARNING] [08:44:39+0000] 	/usr/local/go/src/testing/testing.go:748 +0xda
[WARNING] [08:44:39+0000] created by testing.(*T).Run
[WARNING] [08:44:39+0000] 	/usr/local/go/src/testing/testing.go:789 +0x2de
[WARNING] [08:44:39+0000] goroutine 139 [chan send, 19 minutes]:
[WARNING] [08:44:39+0000] testing.tRunner.func1(0xc420165a40)
[WARNING] [08:44:39+0000] 	/usr/local/go/src/testing/testing.go:741 +0x19b
[WARNING] [08:44:39+0000] testing.tRunner(0xc420165a40, 0xc42012ba00)
[WARNING] [08:44:39+0000] 	/usr/local/go/src/testing/testing.go:748 +0xda
[WARNING] [08:44:39+0000] created by testing.(*T).Run
[WARNING] [08:44:39+0000] 	/usr/local/go/src/testing/testing.go:789 +0x2de
[WARNING] [08:44:39+0000] goroutine 140 [chan send, 20 minutes]:
[WARNING] [08:44:39+0000] testing.tRunner.func1(0xc420165b30)
[WARNING] [08:44:39+0000] 	/usr/local/go/src/testing/testing.go:741 +0x19b
[WARNING] [08:44:39+0000] testing.tRunner(0xc420165b30, 0xc42012ba80)
[WARNING] [08:44:39+0000] 	/usr/local/go/src/testing/testing.go:748 +0xda
[WARNING] [08:44:39+0000] created by testing.(*T).Run
[WARNING] [08:44:39+0000] 	/usr/local/go/src/testing/testing.go:789 +0x2de
[WARNING] [08:44:39+0000] goroutine 141 [chan send, 20 minutes]:
[WARNING] [08:44:39+0000] testing.tRunner.func1(0xc420165c20)
[WARNING] [08:44:39+0000] 	/usr/local/go/src/testing/testing.go:741 +0x19b
[WARNING] [08:44:39+0000] testing.tRunner(0xc420165c20, 0xc42012bb00)
[WARNING] [08:44:39+0000] 	/usr/local/go/src/testing/testing.go:748 +0xda
[WARNING] [08:44:39+0000] created by testing.(*T).Run
[WARNING] [08:44:39+0000] 	/usr/local/go/src/testing/testing.go:789 +0x2de
[WARNING] [08:44:39+0000] goroutine 142 [chan send, 20 minutes]:
[WARNING] [08:44:39+0000] testing.tRunner.func1(0xc420165d10)
[WARNING] [08:44:39+0000] 	/usr/local/go/src/testing/testing.go:741 +0x19b
[WARNING] [08:44:39+0000] testing.tRunner(0xc420165d10, 0xc42012bb80)
[WARNING] [08:44:39+0000] 	/usr/local/go/src/testing/testing.go:748 +0xda
[WARNING] [08:44:39+0000] created by testing.(*T).Run
[WARNING] [08:44:39+0000] 	/usr/local/go/src/testing/testing.go:789 +0x2de
[WARNING] [08:44:39+0000] goroutine 143 [chan send, 20 minutes]:
[WARNING] [08:44:39+0000] testing.tRunner.func1(0xc420165e00)
[WARNING] [08:44:39+0000] 	/usr/local/go/src/testing/testing.go:741 +0x19b
[WARNING] [08:44:39+0000] testing.tRunner(0xc420165e00, 0xc42012bc00)
[WARNING] [08:44:39+0000] 	/usr/local/go/src/testing/testing.go:748 +0xda
[WARNING] [08:44:39+0000] created by testing.(*T).Run
[WARNING] [08:44:39+0000] 	/usr/local/go/src/testing/testing.go:789 +0x2de
[WARNING] [08:44:39+0000] goroutine 144 [chan send, 20 minutes]:
[WARNING] [08:44:39+0000] testing.tRunner.func1(0xc420165ef0)
[WARNING] [08:44:39+0000] 	/usr/local/go/src/testing/testing.go:741 +0x19b
[WARNING] [08:44:39+0000] testing.tRunner(0xc420165ef0, 0xc42012bc80)
[WARNING] [08:44:39+0000] 	/usr/local/go/src/testing/testing.go:748 +0xda
[WARNING] [08:44:39+0000] created by testing.(*T).Run
[WARNING] [08:44:39+0000] 	/usr/local/go/src/testing/testing.go:789 +0x2de
[WARNING] [08:44:39+0000] goroutine 145 [chan send, 20 minutes]:
[WARNING] [08:44:39+0000] testing.tRunner.func1(0xc4202d6000)
[WARNING] [08:44:39+0000] 	/usr/local/go/src/testing/testing.go:741 +0x19b
[WARNING] [08:44:39+0000] testing.tRunner(0xc4202d6000, 0xc42012bd00)
[WARNING] [08:44:39+0000] 	/usr/local/go/src/testing/testing.go:748 +0xda
[WARNING] [08:44:39+0000] created by testing.(*T).Run
[WARNING] [08:44:39+0000] 	/usr/local/go/src/testing/testing.go:789 +0x2de
[WARNING] [08:44:39+0000] goroutine 146 [chan send, 20 minutes]:
[WARNING] [08:44:39+0000] testing.tRunner.func1(0xc4202d60f0)
[WARNING] [08:44:39+0000] 	/usr/local/go/src/testing/testing.go:741 +0x19b
[WARNING] [08:44:39+0000] testing.tRunner(0xc4202d60f0, 0xc42012bd80)
[WARNING] [08:44:39+0000] 	/usr/local/go/src/testing/testing.go:748 +0xda
[WARNING] [08:44:39+0000] created by testing.(*T).Run
[WARNING] [08:44:39+0000] 	/usr/local/go/src/testing/testing.go:789 +0x2de
[WARNING] [08:44:39+0000] goroutine 147 [chan send, 21 minutes]:
[WARNING] [08:44:39+0000] testing.tRunner.func1(0xc4202d61e0)
[WARNING] [08:44:39+0000] 	/usr/local/go/src/testing/testing.go:741 +0x19b
[WARNING] [08:44:39+0000] testing.tRunner(0xc4202d61e0, 0xc42012be00)
[WARNING] [08:44:39+0000] 	/usr/local/go/src/testing/testing.go:748 +0xda
[WARNING] [08:44:39+0000] created by testing.(*T).Run
[WARNING] [08:44:39+0000] 	/usr/local/go/src/testing/testing.go:789 +0x2de
[WARNING] [08:44:39+0000] goroutine 148 [chan send, 21 minutes]:
[WARNING] [08:44:39+0000] testing.tRunner.func1(0xc4202d62d0)
[WARNING] [08:44:39+0000] 	/usr/local/go/src/testing/testing.go:741 +0x19b
[WARNING] [08:44:39+0000] testing.tRunner(0xc4202d62d0, 0xc42012be80)
[WARNING] [08:44:39+0000] 	/usr/local/go/src/testing/testing.go:748 +0xda
[WARNING] [08:44:39+0000] created by testing.(*T).Run
[WARNING] [08:44:39+0000] 	/usr/local/go/src/testing/testing.go:789 +0x2de
[WARNING] [08:44:39+0000] goroutine 149 [chan send, 21 minutes]:
[WARNING] [08:44:39+0000] testing.tRunner.func1(0xc4202d63c0)
[WARNING] [08:44:39+0000] 	/usr/local/go/src/testing/testing.go:741 +0x19b
[WARNING] [08:44:39+0000] testing.tRunner(0xc4202d63c0, 0xc42012bf00)
[WARNING] [08:44:39+0000] 	/usr/local/go/src/testing/testing.go:748 +0xda
[WARNING] [08:44:39+0000] created by testing.(*T).Run
[WARNING] [08:44:39+0000] 	/usr/local/go/src/testing/testing.go:789 +0x2de
[WARNING] [08:44:39+0000] goroutine 150 [chan send, 21 minutes]:
[WARNING] [08:44:39+0000] testing.tRunner.func1(0xc4202d64b0)
[WARNING] [08:44:39+0000] 	/usr/local/go/src/testing/testing.go:741 +0x19b
[WARNING] [08:44:39+0000] testing.tRunner(0xc4202d64b0, 0xc42012bf80)
[WARNING] [08:44:39+0000] 	/usr/local/go/src/testing/testing.go:748 +0xda
[WARNING] [08:44:39+0000] created by testing.(*T).Run
[WARNING] [08:44:39+0000] 	/usr/local/go/src/testing/testing.go:789 +0x2de
[WARNING] [08:44:39+0000] goroutine 151 [chan send, 21 minutes]:
[WARNING] [08:44:39+0000] testing.tRunner.func1(0xc4202d65a0)
[WARNING] [08:44:39+0000] 	/usr/local/go/src/testing/testing.go:741 +0x19b
[WARNING] [08:44:39+0000] testing.tRunner(0xc4202d65a0, 0xc4202e0000)
[WARNING] [08:44:39+0000] 	/usr/local/go/src/testing/testing.go:748 +0xda
[WARNING] [08:44:39+0000] created by testing.(*T).Run
[WARNING] [08:44:39+0000] 	/usr/local/go/src/testing/testing.go:789 +0x2de
[WARNING] [08:44:39+0000] goroutine 152 [chan send, 21 minutes]:
[WARNING] [08:44:39+0000] testing.tRunner.func1(0xc4202d6690)
[WARNING] [08:44:39+0000] 	/usr/local/go/src/testing/testing.go:741 +0x19b
[WARNING] [08:44:39+0000] testing.tRunner(0xc4202d6690, 0xc4202e0080)
[WARNING] [08:44:39+0000] 	/usr/local/go/src/testing/testing.go:748 +0xda
[WARNING] [08:44:39+0000] created by testing.(*T).Run
[WARNING] [08:44:39+0000] 	/usr/local/go/src/testing/testing.go:789 +0x2de
[WARNING] [08:44:39+0000] goroutine 153 [chan send, 22 minutes]:
[WARNING] [08:44:39+0000] testing.tRunner.func1(0xc4202d6780)
[WARNING] [08:44:39+0000] 	/usr/local/go/src/testing/testing.go:741 +0x19b
[WARNING] [08:44:39+0000] testing.tRunner(0xc4202d6780, 0xc4202e0100)
[WARNING] [08:44:39+0000] 	/usr/local/go/src/testing/testing.go:748 +0xda
[WARNING] [08:44:39+0000] created by testing.(*T).Run
[WARNING] [08:44:39+0000] 	/usr/local/go/src/testing/testing.go:789 +0x2de
[WARNING] [08:44:39+0000] goroutine 154 [chan send, 22 minutes]:
[WARNING] [08:44:39+0000] testing.tRunner.func1(0xc4202d6870)
[WARNING] [08:44:39+0000] 	/usr/local/go/src/testing/testing.go:741 +0x19b
[WARNING] [08:44:39+0000] testing.tRunner(0xc4202d6870, 0xc4202e0180)
[WARNING] [08:44:39+0000] 	/usr/local/go/src/testing/testing.go:748 +0xda
[WARNING] [08:44:39+0000] created by testing.(*T).Run
[WARNING] [08:44:39+0000] 	/usr/local/go/src/testing/testing.go:789 +0x2de
[WARNING] [08:44:39+0000] goroutine 155 [chan send, 22 minutes]:
[WARNING] [08:44:39+0000] testing.tRunner.func1(0xc4202d6960)
[WARNING] [08:44:39+0000] 	/usr/local/go/src/testing/testing.go:741 +0x19b
[WARNING] [08:44:39+0000] testing.tRunner(0xc4202d6960, 0xc4202e0200)
[WARNING] [08:44:39+0000] 	/usr/local/go/src/testing/testing.go:748 +0xda
[WARNING] [08:44:39+0000] created by testing.(*T).Run
[WARNING] [08:44:39+0000] 	/usr/local/go/src/testing/testing.go:789 +0x2de
[WARNING] [08:44:39+0000] goroutine 156 [chan send, 22 minutes]:
[WARNING] [08:44:39+0000] testing.tRunner.func1(0xc4202d6a50)
[WARNING] [08:44:39+0000] 	/usr/local/go/src/testing/testing.go:741 +0x19b
[WARNING] [08:44:39+0000] testing.tRunner(0xc4202d6a50, 0xc4202e0280)
[WARNING] [08:44:39+0000] 	/usr/local/go/src/testing/testing.go:748 +0xda
[WARNING] [08:44:39+0000] created by testing.(*T).Run
[WARNING] [08:44:39+0000] 	/usr/local/go/src/testing/testing.go:789 +0x2de
[WARNING] [08:44:39+0000] goroutine 157 [chan send, 23 minutes]:
[WARNING] [08:44:39+0000] testing.tRunner.func1(0xc4202d6b40)
[WARNING] [08:44:39+0000] 	/usr/local/go/src/testing/testing.go:741 +0x19b
[WARNING] [08:44:39+0000] testing.tRunner(0xc4202d6b40, 0xc4202e0300)
[WARNING] [08:44:39+0000] 	/usr/local/go/src/testing/testing.go:748 +0xda
[WARNING] [08:44:39+0000] created by testing.(*T).Run
[WARNING] [08:44:39+0000] 	/usr/local/go/src/testing/testing.go:789 +0x2de
[WARNING] [08:44:39+0000] goroutine 158 [chan send, 22 minutes]:
[WARNING] [08:44:39+0000] testing.tRunner.func1(0xc4202d6c30)
[WARNING] [08:44:39+0000] 	/usr/local/go/src/testing/testing.go:741 +0x19b
[WARNING] [08:44:39+0000] testing.tRunner(0xc4202d6c30, 0xc4202e0380)
[WARNING] [08:44:39+0000] 	/usr/local/go/src/testing/testing.go:748 +0xda
[WARNING] [08:44:39+0000] created by testing.(*T).Run
[WARNING] [08:44:39+0000] 	/usr/local/go/src/testing/testing.go:789 +0x2de
[WARNING] [08:44:39+0000] goroutine 159 [chan send, 23 minutes]:
[WARNING] [08:44:39+0000] testing.tRunner.func1(0xc4202d6d20)
[WARNING] [08:44:39+0000] 	/usr/local/go/src/testing/testing.go:741 +0x19b
[WARNING] [08:44:39+0000] testing.tRunner(0xc4202d6d20, 0xc4202e0400)
[WARNING] [08:44:39+0000] 	/usr/local/go/src/testing/testing.go:748 +0xda
[WARNING] [08:44:39+0000] created by testing.(*T).Run
[WARNING] [08:44:39+0000] 	/usr/local/go/src/testing/testing.go:789 +0x2de
[WARNING] [08:44:39+0000] goroutine 160 [chan send, 23 minutes]:
[WARNING] [08:44:39+0000] testing.tRunner.func1(0xc4202d6e10)
[WARNING] [08:44:39+0000] 	/usr/local/go/src/testing/testing.go:741 +0x19b
[WARNING] [08:44:39+0000] testing.tRunner(0xc4202d6e10, 0xc4202e0480)
[WARNING] [08:44:39+0000] 	/usr/local/go/src/testing/testing.go:748 +0xda
[WARNING] [08:44:39+0000] created by testing.(*T).Run
[WARNING] [08:44:39+0000] 	/usr/local/go/src/testing/testing.go:789 +0x2de
[WARNING] [08:44:39+0000] goroutine 161 [chan send, 23 minutes]:
[WARNING] [08:44:39+0000] testing.tRunner.func1(0xc4202d6f00)
[WARNING] [08:44:39+0000] 	/usr/local/go/src/testing/testing.go:741 +0x19b
[WARNING] [08:44:39+0000] testing.tRunner(0xc4202d6f00, 0xc4202e0500)
[WARNING] [08:44:39+0000] 	/usr/local/go/src/testing/testing.go:748 +0xda
[WARNING] [08:44:39+0000] created by testing.(*T).Run
[WARNING] [08:44:39+0000] 	/usr/local/go/src/testing/testing.go:789 +0x2de
[WARNING] [08:44:39+0000] goroutine 162 [chan send, 23 minutes]:
[WARNING] [08:44:39+0000] testing.tRunner.func1(0xc4202d6ff0)
[WARNING] [08:44:39+0000] 	/usr/local/go/src/testing/testing.go:741 +0x19b
[WARNING] [08:44:39+0000] testing.tRunner(0xc4202d6ff0, 0xc4202e0580)
[WARNING] [08:44:39+0000] 	/usr/local/go/src/testing/testing.go:748 +0xda
[WARNING] [08:44:39+0000] created by testing.(*T).Run
[WARNING] [08:44:39+0000] 	/usr/local/go/src/testing/testing.go:789 +0x2de
[WARNING] [08:44:39+0000] goroutine 163 [chan send, 22 minutes]:
[WARNING] [08:44:39+0000] testing.tRunner.func1(0xc4202d70e0)
[WARNING] [08:44:39+0000] 	/usr/local/go/src/testing/testing.go:741 +0x19b
[WARNING] [08:44:39+0000] testing.tRunner(0xc4202d70e0, 0xc4202e0600)
[WARNING] [08:44:39+0000] 	/usr/local/go/src/testing/testing.go:748 +0xda
[WARNING] [08:44:39+0000] created by testing.(*T).Run
[WARNING] [08:44:39+0000] 	/usr/local/go/src/testing/testing.go:789 +0x2de
[WARNING] [08:44:39+0000] goroutine 164 [chan send, 23 minutes]:
[WARNING] [08:44:39+0000] testing.tRunner.func1(0xc4202d71d0)
[WARNING] [08:44:39+0000] 	/usr/local/go/src/testing/testing.go:741 +0x19b
[WARNING] [08:44:39+0000] testing.tRunner(0xc4202d71d0, 0xc4202e0680)
[WARNING] [08:44:39+0000] 	/usr/local/go/src/testing/testing.go:748 +0xda
[WARNING] [08:44:39+0000] created by testing.(*T).Run
[WARNING] [08:44:39+0000] 	/usr/local/go/src/testing/testing.go:789 +0x2de
[WARNING] [08:44:39+0000] goroutine 165 [chan send, 23 minutes]:
[WARNING] [08:44:39+0000] testing.tRunner.func1(0xc4202d72c0)
[WARNING] [08:44:39+0000] 	/usr/local/go/src/testing/testing.go:741 +0x19b
[WARNING] [08:44:39+0000] testing.tRunner(0xc4202d72c0, 0xc4202e0700)
[WARNING] [08:44:39+0000] 	/usr/local/go/src/testing/testing.go:748 +0xda
[WARNING] [08:44:39+0000] created by testing.(*T).Run
[WARNING] [08:44:39+0000] 	/usr/local/go/src/testing/testing.go:789 +0x2de
[WARNING] [08:44:39+0000] goroutine 166 [chan send, 23 minutes]:
[WARNING] [08:44:39+0000] testing.tRunner.func1(0xc4202d73b0)
[WARNING] [08:44:39+0000] 	/usr/local/go/src/testing/testing.go:741 +0x19b
[WARNING] [08:44:39+0000] testing.tRunner(0xc4202d73b0, 0xc4202e0780)
[WARNING] [08:44:39+0000] 	/usr/local/go/src/testing/testing.go:748 +0xda
[WARNING] [08:44:39+0000] created by testing.(*T).Run
[WARNING] [08:44:39+0000] 	/usr/local/go/src/testing/testing.go:789 +0x2de
[WARNING] [08:44:39+0000] goroutine 167 [chan send, 24 minutes]:
[WARNING] [08:44:39+0000] testing.tRunner.func1(0xc4202d74a0)
[WARNING] [08:44:39+0000] 	/usr/local/go/src/testing/testing.go:741 +0x19b
[WARNING] [08:44:39+0000] testing.tRunner(0xc4202d74a0, 0xc4202e0800)
[WARNING] [08:44:39+0000] 	/usr/local/go/src/testing/testing.go:748 +0xda
[WARNING] [08:44:39+0000] created by testing.(*T).Run
[WARNING] [08:44:39+0000] 	/usr/local/go/src/testing/testing.go:789 +0x2de
[WARNING] [08:44:39+0000] goroutine 168 [chan send, 23 minutes]:
[WARNING] [08:44:39+0000] testing.tRunner.func1(0xc4202d7590)
[WARNING] [08:44:39+0000] 	/usr/local/go/src/testing/testing.go:741 +0x19b
[WARNING] [08:44:39+0000] testing.tRunner(0xc4202d7590, 0xc4202e0880)
[WARNING] [08:44:39+0000] 	/usr/local/go/src/testing/testing.go:748 +0xda
[WARNING] [08:44:39+0000] created by testing.(*T).Run
[WARNING] [08:44:39+0000] 	/usr/local/go/src/testing/testing.go:789 +0x2de
[WARNING] [08:44:39+0000] goroutine 169 [chan send, 23 minutes]:
[WARNING] [08:44:39+0000] testing.tRunner.func1(0xc4202d7680)
[WARNING] [08:44:39+0000] 	/usr/local/go/src/testing/testing.go:741 +0x19b
[WARNING] [08:44:39+0000] testing.tRunner(0xc4202d7680, 0xc4202e0900)
[WARNING] [08:44:39+0000] 	/usr/local/go/src/testing/testing.go:748 +0xda
[WARNING] [08:44:39+0000] created by testing.(*T).Run
[WARNING] [08:44:39+0000] 	/usr/local/go/src/testing/testing.go:789 +0x2de
[WARNING] [08:44:39+0000] goroutine 170 [chan send, 23 minutes]:
[WARNING] [08:44:39+0000] testing.tRunner.func1(0xc4202d7770)
[WARNING] [08:44:39+0000] 	/usr/local/go/src/testing/testing.go:741 +0x19b
[WARNING] [08:44:39+0000] testing.tRunner(0xc4202d7770, 0xc4202e0980)
[WARNING] [08:44:39+0000] 	/usr/local/go/src/testing/testing.go:748 +0xda
[WARNING] [08:44:39+0000] created by testing.(*T).Run
[WARNING] [08:44:39+0000] 	/usr/local/go/src/testing/testing.go:789 +0x2de
[WARNING] [08:44:39+0000] goroutine 171 [chan send, 24 minutes]:
[WARNING] [08:44:39+0000] testing.tRunner.func1(0xc4202d7860)
[WARNING] [08:44:39+0000] 	/usr/local/go/src/testing/testing.go:741 +0x19b
[WARNING] [08:44:39+0000] testing.tRunner(0xc4202d7860, 0xc4202e0a00)
[WARNING] [08:44:39+0000] 	/usr/local/go/src/testing/testing.go:748 +0xda
[WARNING] [08:44:39+0000] created by testing.(*T).Run
[WARNING] [08:44:39+0000] 	/usr/local/go/src/testing/testing.go:789 +0x2de
[WARNING] [08:44:39+0000] goroutine 172 [chan send, 24 minutes]:
[WARNING] [08:44:39+0000] testing.tRunner.func1(0xc4202d7950)
[WARNING] [08:44:39+0000] 	/usr/local/go/src/testing/testing.go:741 +0x19b
[WARNING] [08:44:39+0000] testing.tRunner(0xc4202d7950, 0xc4202e0a80)
[WARNING] [08:44:39+0000] 	/usr/local/go/src/testing/testing.go:748 +0xda
[WARNING] [08:44:39+0000] created by testing.(*T).Run
[WARNING] [08:44:39+0000] 	/usr/local/go/src/testing/testing.go:789 +0x2de
[WARNING] [08:44:39+0000] goroutine 173 [chan send, 24 minutes]:
[WARNING] [08:44:39+0000] testing.tRunner.func1(0xc4202d7a40)
[WARNING] [08:44:39+0000] 	/usr/local/go/src/testing/testing.go:741 +0x19b
[WARNING] [08:44:39+0000] testing.tRunner(0xc4202d7a40, 0xc4202e0b00)
[WARNING] [08:44:39+0000] 	/usr/local/go/src/testing/testing.go:748 +0xda
[WARNING] [08:44:39+0000] created by testing.(*T).Run
[WARNING] [08:44:39+0000] 	/usr/local/go/src/testing/testing.go:789 +0x2de
[WARNING] [08:44:39+0000] goroutine 174 [chan send, 24 minutes]:
[WARNING] [08:44:39+0000] testing.tRunner.func1(0xc4202d7b30)
[WARNING] [08:44:39+0000] 	/usr/local/go/src/testing/testing.go:741 +0x19b
[WARNING] [08:44:39+0000] testing.tRunner(0xc4202d7b30, 0xc4202e0b80)
[WARNING] [08:44:39+0000] 	/usr/local/go/src/testing/testing.go:748 +0xda
[WARNING] [08:44:39+0000] created by testing.(*T).Run
[WARNING] [08:44:39+0000] 	/usr/local/go/src/testing/testing.go:789 +0x2de
[WARNING] [08:44:39+0000] goroutine 175 [chan send, 24 minutes]:
[WARNING] [08:44:39+0000] testing.tRunner.func1(0xc4202d7c20)
[WARNING] [08:44:39+0000] 	/usr/local/go/src/testing/testing.go:741 +0x19b
[WARNING] [08:44:39+0000] testing.tRunner(0xc4202d7c20, 0xc4202e0c00)
[WARNING] [08:44:39+0000] 	/usr/local/go/src/testing/testing.go:748 +0xda
[WARNING] [08:44:39+0000] created by testing.(*T).Run
[WARNING] [08:44:39+0000] 	/usr/local/go/src/testing/testing.go:789 +0x2de
[WARNING] [08:44:39+0000] goroutine 176 [chan send, 24 minutes]:
[WARNING] [08:44:39+0000] testing.tRunner.func1(0xc4202d7d10)
[WARNING] [08:44:39+0000] 	/usr/local/go/src/testing/testing.go:741 +0x19b
[WARNING] [08:44:39+0000] testing.tRunner(0xc4202d7d10, 0xc4202e0c80)
[WARNING] [08:44:39+0000] 	/usr/local/go/src/testing/testing.go:748 +0xda
[WARNING] [08:44:39+0000] created by testing.(*T).Run
[WARNING] [08:44:39+0000] 	/usr/local/go/src/testing/testing.go:789 +0x2de
[WARNING] [08:44:39+0000] goroutine 177 [chan send, 25 minutes]:
[WARNING] [08:44:39+0000] testing.tRunner.func1(0xc4202d7e00)
[WARNING] [08:44:39+0000] 	/usr/local/go/src/testing/testing.go:741 +0x19b
[WARNING] [08:44:39+0000] testing.tRunner(0xc4202d7e00, 0xc4202e0d00)
[WARNING] [08:44:39+0000] 	/usr/local/go/src/testing/testing.go:748 +0xda
[WARNING] [08:44:39+0000] created by testing.(*T).Run
[WARNING] [08:44:39+0000] 	/usr/local/go/src/testing/testing.go:789 +0x2de
[WARNING] [08:44:39+0000] goroutine 178 [chan send, 25 minutes]:
[WARNING] [08:44:39+0000] testing.tRunner.func1(0xc4202d7ef0)
[WARNING] [08:44:39+0000] 	/usr/local/go/src/testing/testing.go:741 +0x19b
[WARNING] [08:44:39+0000] testing.tRunner(0xc4202d7ef0, 0xc4202e0d80)
[WARNING] [08:44:39+0000] 	/usr/local/go/src/testing/testing.go:748 +0xda
[WARNING] [08:44:39+0000] created by testing.(*T).Run
[WARNING] [08:44:39+0000] 	/usr/local/go/src/testing/testing.go:789 +0x2de
[WARNING] [08:44:39+0000] goroutine 179 [chan send, 24 minutes]:
[WARNING] [08:44:39+0000] testing.tRunner.func1(0xc420220000)
[WARNING] [08:44:39+0000] 	/usr/local/go/src/testing/testing.go:741 +0x19b
[WARNING] [08:44:39+0000] testing.tRunner(0xc420220000, 0xc4202e0e00)
[WARNING] [08:44:39+0000] 	/usr/local/go/src/testing/testing.go:748 +0xda
[WARNING] [08:44:39+0000] created by testing.(*T).Run
[WARNING] [08:44:39+0000] 	/usr/local/go/src/testing/testing.go:789 +0x2de
[WARNING] [08:44:39+0000] goroutine 180 [chan send, 25 minutes]:
[WARNING] [08:44:39+0000] testing.tRunner.func1(0xc4202200f0)
[WARNING] [08:44:39+0000] 	/usr/local/go/src/testing/testing.go:741 +0x19b
[WARNING] [08:44:39+0000] testing.tRunner(0xc4202200f0, 0xc4202e0e80)
[WARNING] [08:44:39+0000] 	/usr/local/go/src/testing/testing.go:748 +0xda
[WARNING] [08:44:39+0000] created by testing.(*T).Run
[WARNING] [08:44:39+0000] 	/usr/local/go/src/testing/testing.go:789 +0x2de
[WARNING] [08:44:39+0000] goroutine 181 [chan send, 25 minutes]:
[WARNING] [08:44:39+0000] testing.tRunner.func1(0xc4202201e0)
[WARNING] [08:44:39+0000] 	/usr/local/go/src/testing/testing.go:741 +0x19b
[WARNING] [08:44:39+0000] testing.tRunner(0xc4202201e0, 0xc4202e0f00)
[WARNING] [08:44:39+0000] 	/usr/local/go/src/testing/testing.go:748 +0xda
[WARNING] [08:44:39+0000] created by testing.(*T).Run
[WARNING] [08:44:39+0000] 	/usr/local/go/src/testing/testing.go:789 +0x2de
[WARNING] [08:44:39+0000] goroutine 182 [chan send, 25 minutes]:
[WARNING] [08:44:39+0000] testing.tRunner.func1(0xc4202202d0)
[WARNING] [08:44:39+0000] 	/usr/local/go/src/testing/testing.go:741 +0x19b
[WARNING] [08:44:39+0000] testing.tRunner(0xc4202202d0, 0xc4202e0f80)
[WARNING] [08:44:39+0000] 	/usr/local/go/src/testing/testing.go:748 +0xda
[WARNING] [08:44:39+0000] created by testing.(*T).Run
[WARNING] [08:44:39+0000] 	/usr/local/go/src/testing/testing.go:789 +0x2de
[WARNING] [08:44:39+0000] goroutine 183 [chan send, 25 minutes]:
[WARNING] [08:44:39+0000] testing.tRunner.func1(0xc4202203c0)
[WARNING] [08:44:39+0000] 	/usr/local/go/src/testing/testing.go:741 +0x19b
[WARNING] [08:44:39+0000] testing.tRunner(0xc4202203c0, 0xc4202e1000)
[WARNING] [08:44:39+0000] 	/usr/local/go/src/testing/testing.go:748 +0xda
[WARNING] [08:44:39+0000] created by testing.(*T).Run
[WARNING] [08:44:39+0000] 	/usr/local/go/src/testing/testing.go:789 +0x2de
[WARNING] [08:44:39+0000] goroutine 184 [chan send, 25 minutes]:
[WARNING] [08:44:39+0000] testing.tRunner.func1(0xc4202204b0)
[WARNING] [08:44:39+0000] 	/usr/local/go/src/testing/testing.go:741 +0x19b
[WARNING] [08:44:39+0000] testing.tRunner(0xc4202204b0, 0xc4202e1080)
[WARNING] [08:44:39+0000] 	/usr/local/go/src/testing/testing.go:748 +0xda
[WARNING] [08:44:39+0000] created by testing.(*T).Run
[WARNING] [08:44:39+0000] 	/usr/local/go/src/testing/testing.go:789 +0x2de
[WARNING] [08:44:39+0000] goroutine 185 [chan send, 25 minutes]:
[WARNING] [08:44:39+0000] testing.tRunner.func1(0xc4202205a0)
[WARNING] [08:44:39+0000] 	/usr/local/go/src/testing/testing.go:741 +0x19b
[WARNING] [08:44:39+0000] testing.tRunner(0xc4202205a0, 0xc4202e1100)
[WARNING] [08:44:39+0000] 	/usr/local/go/src/testing/testing.go:748 +0xda
[WARNING] [08:44:39+0000] created by testing.(*T).Run
[WARNING] [08:44:39+0000] 	/usr/local/go/src/testing/testing.go:789 +0x2de
[WARNING] [08:44:39+0000] goroutine 186 [chan send, 26 minutes]:
[WARNING] [08:44:39+0000] testing.tRunner.func1(0xc420220690)
[WARNING] [08:44:39+0000] 	/usr/local/go/src/testing/testing.go:741 +0x19b
[WARNING] [08:44:39+0000] testing.tRunner(0xc420220690, 0xc4202e1180)
[WARNING] [08:44:39+0000] 	/usr/local/go/src/testing/testing.go:748 +0xda
[WARNING] [08:44:39+0000] created by testing.(*T).Run
[WARNING] [08:44:39+0000] 	/usr/local/go/src/testing/testing.go:789 +0x2de
[WARNING] [08:44:39+0000] goroutine 187 [chan send, 26 minutes]:
[WARNING] [08:44:39+0000] testing.tRunner.func1(0xc420220780)
[WARNING] [08:44:39+0000] 	/usr/local/go/src/testing/testing.go:741 +0x19b
[WARNING] [08:44:39+0000] testing.tRunner(0xc420220780, 0xc4202e1200)
[WARNING] [08:44:39+0000] 	/usr/local/go/src/testing/testing.go:748 +0xda
[WARNING] [08:44:39+0000] created by testing.(*T).Run
[WARNING] [08:44:39+0000] 	/usr/local/go/src/testing/testing.go:789 +0x2de
[WARNING] [08:44:39+0000] goroutine 188 [chan send, 26 minutes]:
[WARNING] [08:44:39+0000] testing.tRunner.func1(0xc420220870)
[WARNING] [08:44:39+0000] 	/usr/local/go/src/testing/testing.go:741 +0x19b
[WARNING] [08:44:39+0000] testing.tRunner(0xc420220870, 0xc4202e1280)
[WARNING] [08:44:39+0000] 	/usr/local/go/src/testing/testing.go:748 +0xda
[WARNING] [08:44:39+0000] created by testing.(*T).Run
[WARNING] [08:44:39+0000] 	/usr/local/go/src/testing/testing.go:789 +0x2de
[WARNING] [08:44:39+0000] goroutine 189 [chan send, 26 minutes]:
[WARNING] [08:44:39+0000] testing.tRunner.func1(0xc420220960)
[WARNING] [08:44:39+0000] 	/usr/local/go/src/testing/testing.go:741 +0x19b
[WARNING] [08:44:39+0000] testing.tRunner(0xc420220960, 0xc4202e1300)
[WARNING] [08:44:39+0000] 	/usr/local/go/src/testing/testing.go:748 +0xda
[WARNING] [08:44:39+0000] created by testing.(*T).Run
[WARNING] [08:44:39+0000] 	/usr/local/go/src/testing/testing.go:789 +0x2de
[WARNING] [08:44:39+0000] goroutine 190 [chan send, 27 minutes]:
[WARNING] [08:44:39+0000] testing.tRunner.func1(0xc420220a50)
[WARNING] [08:44:39+0000] 	/usr/local/go/src/testing/testing.go:741 +0x19b
[WARNING] [08:44:39+0000] testing.tRunner(0xc420220a50, 0xc4202e1380)
[WARNING] [08:44:39+0000] 	/usr/local/go/src/testing/testing.go:748 +0xda
[WARNING] [08:44:39+0000] created by testing.(*T).Run
[WARNING] [08:44:39+0000] 	/usr/local/go/src/testing/testing.go:789 +0x2de
[WARNING] [08:44:39+0000] goroutine 191 [chan send, 27 minutes]:
[WARNING] [08:44:39+0000] testing.tRunner.func1(0xc420220b40)
[WARNING] [08:44:39+0000] 	/usr/local/go/src/testing/testing.go:741 +0x19b
[WARNING] [08:44:39+0000] testing.tRunner(0xc420220b40, 0xc4202e1400)
[WARNING] [08:44:39+0000] 	/usr/local/go/src/testing/testing.go:748 +0xda
[WARNING] [08:44:39+0000] created by testing.(*T).Run
[WARNING] [08:44:39+0000] 	/usr/local/go/src/testing/testing.go:789 +0x2de
[WARNING] [08:44:39+0000] goroutine 192 [chan send, 27 minutes]:
[WARNING] [08:44:39+0000] testing.tRunner.func1(0xc420220c30)
[WARNING] [08:44:39+0000] 	/usr/local/go/src/testing/testing.go:741 +0x19b
[WARNING] [08:44:39+0000] testing.tRunner(0xc420220c30, 0xc4202e1480)
[WARNING] [08:44:39+0000] 	/usr/local/go/src/testing/testing.go:748 +0xda
[WARNING] [08:44:39+0000] created by testing.(*T).Run
[WARNING] [08:44:39+0000] 	/usr/local/go/src/testing/testing.go:789 +0x2de
[WARNING] [08:44:39+0000] goroutine 193 [chan send, 27 minutes]:
[WARNING] [08:44:39+0000] testing.tRunner.func1(0xc420220d20)
[WARNING] [08:44:39+0000] 	/usr/local/go/src/testing/testing.go:741 +0x19b
[WARNING] [08:44:39+0000] testing.tRunner(0xc420220d20, 0xc4202e1500)
[WARNING] [08:44:39+0000] 	/usr/local/go/src/testing/testing.go:748 +0xda
[WARNING] [08:44:39+0000] created by testing.(*T).Run
[WARNING] [08:44:39+0000] 	/usr/local/go/src/testing/testing.go:789 +0x2de
[WARNING] [08:44:39+0000] goroutine 194 [chan send, 27 minutes]:
[WARNING] [08:44:39+0000] testing.tRunner.func1(0xc420220e10)
[WARNING] [08:44:39+0000] 	/usr/local/go/src/testing/testing.go:741 +0x19b
[WARNING] [08:44:39+0000] testing.tRunner(0xc420220e10, 0xc4202e1580)
[WARNING] [08:44:39+0000] 	/usr/local/go/src/testing/testing.go:748 +0xda
[WARNING] [08:44:39+0000] created by testing.(*T).Run
[WARNING] [08:44:39+0000] 	/usr/local/go/src/testing/testing.go:789 +0x2de
[WARNING] [08:44:39+0000] goroutine 195 [chan send, 27 minutes]:
[WARNING] [08:44:39+0000] testing.tRunner.func1(0xc420220f00)
[WARNING] [08:44:39+0000] 	/usr/local/go/src/testing/testing.go:741 +0x19b
[WARNING] [08:44:39+0000] testing.tRunner(0xc420220f00, 0xc4202e1600)
[WARNING] [08:44:39+0000] 	/usr/local/go/src/testing/testing.go:748 +0xda
[WARNING] [08:44:39+0000] created by testing.(*T).Run
[WARNING] [08:44:39+0000] 	/usr/local/go/src/testing/testing.go:789 +0x2de
[WARNING] [08:44:39+0000] goroutine 196 [chan send, 27 minutes]:
[WARNING] [08:44:39+0000] testing.tRunner.func1(0xc420220ff0)
[WARNING] [08:44:39+0000] 	/usr/local/go/src/testing/testing.go:741 +0x19b
[WARNING] [08:44:39+0000] testing.tRunner(0xc420220ff0, 0xc4202e1680)
[WARNING] [08:44:39+0000] 	/usr/local/go/src/testing/testing.go:748 +0xda
[WARNING] [08:44:39+0000] created by testing.(*T).Run
[WARNING] [08:44:39+0000] 	/usr/local/go/src/testing/testing.go:789 +0x2de
[WARNING] [08:44:39+0000] goroutine 197 [chan send, 27 minutes]:
[WARNING] [08:44:39+0000] testing.tRunner.func1(0xc4202210e0)
[WARNING] [08:44:39+0000] 	/usr/local/go/src/testing/testing.go:741 +0x19b
[WARNING] [08:44:39+0000] testing.tRunner(0xc4202210e0, 0xc4202e1700)
[WARNING] [08:44:39+0000] 	/usr/local/go/src/testing/testing.go:748 +0xda
[WARNING] [08:44:39+0000] created by testing.(*T).Run
[WARNING] [08:44:39+0000] 	/usr/local/go/src/testing/testing.go:789 +0x2de
[WARNING] [08:44:39+0000] goroutine 198 [chan send, 28 minutes]:
[WARNING] [08:44:39+0000] testing.tRunner.func1(0xc4202211d0)
[WARNING] [08:44:39+0000] 	/usr/local/go/src/testing/testing.go:741 +0x19b
[WARNING] [08:44:39+0000] testing.tRunner(0xc4202211d0, 0xc4202e1780)
[WARNING] [08:44:39+0000] 	/usr/local/go/src/testing/testing.go:748 +0xda
[WARNING] [08:44:39+0000] created by testing.(*T).Run
[WARNING] [08:44:39+0000] 	/usr/local/go/src/testing/testing.go:789 +0x2de
[WARNING] [08:44:39+0000] goroutine 199 [chan send, 27 minutes]:
[WARNING] [08:44:39+0000] testing.tRunner.func1(0xc4202212c0)
[WARNING] [08:44:39+0000] 	/usr/local/go/src/testing/testing.go:741 +0x19b
[WARNING] [08:44:39+0000] testing.tRunner(0xc4202212c0, 0xc4202e1800)
[WARNING] [08:44:39+0000] 	/usr/local/go/src/testing/testing.go:748 +0xda
[WARNING] [08:44:39+0000] created by testing.(*T).Run
[WARNING] [08:44:39+0000] 	/usr/local/go/src/testing/testing.go:789 +0x2de
[WARNING] [08:44:39+0000] goroutine 200 [chan send, 28 minutes]:
[WARNING] [08:44:39+0000] testing.tRunner.func1(0xc4202213b0)
[WARNING] [08:44:39+0000] 	/usr/local/go/src/testing/testing.go:741 +0x19b
[WARNING] [08:44:39+0000] testing.tRunner(0xc4202213b0, 0xc4202e1880)
[WARNING] [08:44:39+0000] 	/usr/local/go/src/testing/testing.go:748 +0xda
[WARNING] [08:44:39+0000] created by testing.(*T).Run
[WARNING] [08:44:39+0000] 	/usr/local/go/src/testing/testing.go:789 +0x2de
[WARNING] [08:44:39+0000] goroutine 201 [chan send, 28 minutes]:
[WARNING] [08:44:39+0000] testing.tRunner.func1(0xc4202214a0)
[WARNING] [08:44:39+0000] 	/usr/local/go/src/testing/testing.go:741 +0x19b
[WARNING] [08:44:39+0000] testing.tRunner(0xc4202214a0, 0xc4202e1900)
[WARNING] [08:44:39+0000] 	/usr/local/go/src/testing/testing.go:748 +0xda
[WARNING] [08:44:39+0000] created by testing.(*T).Run
[WARNING] [08:44:39+0000] 	/usr/local/go/src/testing/testing.go:789 +0x2de
[WARNING] [08:44:39+0000] goroutine 202 [chan send, 29 minutes]:
[WARNING] [08:44:39+0000] testing.tRunner.func1(0xc420221590)
[WARNING] [08:44:39+0000] 	/usr/local/go/src/testing/testing.go:741 +0x19b
[WARNING] [08:44:39+0000] testing.tRunner(0xc420221590, 0xc4202e1980)
[WARNING] [08:44:39+0000] 	/usr/local/go/src/testing/testing.go:748 +0xda
[WARNING] [08:44:39+0000] created by testing.(*T).Run
[WARNING] [08:44:39+0000] 	/usr/local/go/src/testing/testing.go:789 +0x2de
[WARNING] [08:44:39+0000] goroutine 203 [chan send, 29 minutes]:
[WARNING] [08:44:39+0000] testing.tRunner.func1(0xc420221680)
[WARNING] [08:44:39+0000] 	/usr/local/go/src/testing/testing.go:741 +0x19b
[WARNING] [08:44:39+0000] testing.tRunner(0xc420221680, 0xc4202e1a00)
[WARNING] [08:44:39+0000] 	/usr/local/go/src/testing/testing.go:748 +0xda
[WARNING] [08:44:39+0000] created by testing.(*T).Run
[WARNING] [08:44:39+0000] 	/usr/local/go/src/testing/testing.go:789 +0x2de
[WARNING] [08:44:39+0000] goroutine 204 [chan send, 29 minutes]:
[WARNING] [08:44:39+0000] testing.tRunner.func1(0xc420221770)
[WARNING] [08:44:39+0000] 	/usr/local/go/src/testing/testing.go:741 +0x19b
[WARNING] [08:44:39+0000] testing.tRunner(0xc420221770, 0xc4202e1a80)
[WARNING] [08:44:39+0000] 	/usr/local/go/src/testing/testing.go:748 +0xda
[WARNING] [08:44:39+0000] created by testing.(*T).Run
[WARNING] [08:44:39+0000] 	/usr/local/go/src/testing/testing.go:789 +0x2de
[WARNING] [08:44:39+0000] goroutine 205 [chan send, 29 minutes]:
[WARNING] [08:44:39+0000] testing.tRunner.func1(0xc420221860)
[WARNING] [08:44:39+0000] 	/usr/local/go/src/testing/testing.go:741 +0x19b
[WARNING] [08:44:39+0000] testing.tRunner(0xc420221860, 0xc4202e1b00)
[WARNING] [08:44:39+0000] 	/usr/local/go/src/testing/testing.go:748 +0xda
[WARNING] [08:44:39+0000] created by testing.(*T).Run
[WARNING] [08:44:39+0000] 	/usr/local/go/src/testing/testing.go:789 +0x2de
[WARNING] [08:44:39+0000] goroutine 206 [chan send, 29 minutes]:
[WARNING] [08:44:39+0000] testing.tRunner.func1(0xc420221950)
[WARNING] [08:44:39+0000] 	/usr/local/go/src/testing/testing.go:741 +0x19b
[WARNING] [08:44:39+0000] testing.tRunner(0xc420221950, 0xc4202e1b80)
[WARNING] [08:44:39+0000] 	/usr/local/go/src/testing/testing.go:748 +0xda
[WARNING] [08:44:39+0000] created by testing.(*T).Run
[WARNING] [08:44:39+0000] 	/usr/local/go/src/testing/testing.go:789 +0x2de
[WARNING] [08:44:39+0000] goroutine 207 [chan send, 29 minutes]:
[WARNING] [08:44:39+0000] testing.tRunner.func1(0xc420221a40)
[WARNING] [08:44:39+0000] 	/usr/local/go/src/testing/testing.go:741 +0x19b
[WARNING] [08:44:39+0000] testing.tRunner(0xc420221a40, 0xc4202e1c00)
[WARNING] [08:44:39+0000] 	/usr/local/go/src/testing/testing.go:748 +0xda
[WARNING] [08:44:39+0000] created by testing.(*T).Run
[WARNING] [08:44:39+0000] 	/usr/local/go/src/testing/testing.go:789 +0x2de
[WARNING] [08:44:39+0000] goroutine 208 [chan send, 29 minutes]:
[WARNING] [08:44:39+0000] testing.tRunner.func1(0xc420221b30)
[WARNING] [08:44:39+0000] 	/usr/local/go/src/testing/testing.go:741 +0x19b
[WARNING] [08:44:39+0000] testing.tRunner(0xc420221b30, 0xc4202e1c80)
[WARNING] [08:44:39+0000] 	/usr/local/go/src/testing/testing.go:748 +0xda
[WARNING] [08:44:39+0000] created by testing.(*T).Run
[WARNING] [08:44:39+0000] 	/usr/local/go/src/testing/testing.go:789 +0x2de
[WARNING] [08:44:39+0000] goroutine 209 [chan send, 29 minutes]:
[WARNING] [08:44:39+0000] testing.tRunner.func1(0xc420221c20)
[WARNING] [08:44:39+0000] 	/usr/local/go/src/testing/testing.go:741 +0x19b
[WARNING] [08:44:39+0000] testing.tRunner(0xc420221c20, 0xc4202e1d00)
[WARNING] [08:44:39+0000] 	/usr/local/go/src/testing/testing.go:748 +0xda
[WARNING] [08:44:39+0000] created by testing.(*T).Run
[WARNING] [08:44:39+0000] 	/usr/local/go/src/testing/testing.go:789 +0x2de
[WARNING] [08:44:39+0000] goroutine 210 [chan send, 30 minutes]:
[WARNING] [08:44:39+0000] testing.tRunner.func1(0xc420221d10)
[WARNING] [08:44:39+0000] 	/usr/local/go/src/testing/testing.go:741 +0x19b
[WARNING] [08:44:39+0000] testing.tRunner(0xc420221d10, 0xc4202e1d80)
[WARNING] [08:44:39+0000] 	/usr/local/go/src/testing/testing.go:748 +0xda
[WARNING] [08:44:39+0000] created by testing.(*T).Run
[WARNING] [08:44:39+0000] 	/usr/local/go/src/testing/testing.go:789 +0x2de
[WARNING] [08:44:39+0000] goroutine 211 [chan send, 30 minutes]:
[WARNING] [08:44:39+0000] testing.tRunner.func1(0xc420221e00)
[WARNING] [08:44:39+0000] 	/usr/local/go/src/testing/testing.go:741 +0x19b
[WARNING] [08:44:39+0000] testing.tRunner(0xc420221e00, 0xc4202e1e00)
[WARNING] [08:44:39+0000] 	/usr/local/go/src/testing/testing.go:748 +0xda
[WARNING] [08:44:39+0000] created by testing.(*T).Run
[WARNING] [08:44:39+0000] 	/usr/local/go/src/testing/testing.go:789 +0x2de
[WARNING] [08:44:39+0000] goroutine 212 [chan send, 30 minutes]:
[WARNING] [08:44:39+0000] testing.tRunner.func1(0xc420221ef0)
[WARNING] [08:44:39+0000] 	/usr/local/go/src/testing/testing.go:741 +0x19b
[WARNING] [08:44:39+0000] testing.tRunner(0xc420221ef0, 0xc4202e1e80)
[WARNING] [08:44:39+0000] 	/usr/local/go/src/testing/testing.go:748 +0xda
[WARNING] [08:44:39+0000] created by testing.(*T).Run
[WARNING] [08:44:39+0000] 	/usr/local/go/src/testing/testing.go:789 +0x2de
[WARNING] [08:44:39+0000] goroutine 384 [running]:
[WARNING] [08:44:39+0000] 	goroutine running on other thread; stack unavailable
[WARNING] [08:44:39+0000] created by os/exec.(*Cmd).Start
[WARNING] [08:44:39+0000] 	/usr/local/go/src/os/exec/exec.go:379 +0x646
[WARNING] [08:44:39+0000] goroutine 418 [IO wait]:
[WARNING] [08:44:39+0000] internal/poll.runtime_pollWait(0x7fa394af5af0, 0x72, 0x1)
[WARNING] [08:44:39+0000] 	/usr/local/go/src/runtime/netpoll.go:173 +0x57
[WARNING] [08:44:39+0000] internal/poll.(*pollDesc).wait(0xc4201c44c8, 0x72, 0xffffffffffffff01, 0x6a6b20, 0x6a51d0)
[WARNING] [08:44:39+0000] 	/usr/local/go/src/internal/poll/fd_poll_runtime.go:85 +0xae
[WARNING] [08:44:39+0000] internal/poll.(*pollDesc).waitRead(0xc4201c44c8, 0xc4204b5801, 0x3e53e, 0x3e53e)
[WARNING] [08:44:39+0000] 	/usr/local/go/src/internal/poll/fd_poll_runtime.go:90 +0x3d
[WARNING] [08:44:39+0000] internal/poll.(*FD).Read(0xc4201c44b0, 0xc4204b58c2, 0x3e53e, 0x3e53e, 0x0, 0x0, 0x0)
[WARNING] [08:44:39+0000] 	/usr/local/go/src/internal/poll/fd_unix.go:125 +0x18a
[WARNING] [08:44:39+0000] os.(*File).read(0xc42000c0a0, 0xc4204b58c2, 0x3e53e, 0x3e53e, 0x177, 0x0, 0x0)
[WARNING] [08:44:39+0000] 	/usr/local/go/src/os/file_unix.go:216 +0x4e
[WARNING] [08:44:39+0000] os.(*File).Read(0xc42000c0a0, 0xc4204b58c2, 0x3e53e, 0x3e53e, 0x177, 0x0, 0x0)
[WARNING] [08:44:39+0000] 	/usr/local/go/src/os/file.go:103 +0x6d
[WARNING] [08:44:39+0000] bytes.(*Buffer).ReadFrom(0xc4200b2230, 0x6a65e0, 0xc42000c0a0, 0x7fa3948f1028, 0xc4200b2230, 0xc42044e901)
[WARNING] [08:44:39+0000] 	/usr/local/go/src/bytes/buffer.go:209 +0x177
[WARNING] [08:44:39+0000] io.copyBuffer(0x6a63e0, 0xc4200b2230, 0x6a65e0, 0xc42000c0a0, 0x0, 0x0, 0x0, 0xff, 0xc4203b0f40, 0x45c136)
[WARNING] [08:44:39+0000] 	/usr/local/go/src/io/io.go:386 +0x2bb
[WARNING] [08:44:39+0000] io.Copy(0x6a63e0, 0xc4200b2230, 0x6a65e0, 0xc42000c0a0, 0x18546bd100000008, 0x5b027fae, 0xc4203b0f98)
[WARNING] [08:44:39+0000] 	/usr/local/go/src/io/io.go:362 +0x68
[WARNING] [08:44:39+0000] os/exec.(*Cmd).writerDescriptor.func1(0x4ddc00, 0xc4200b92c0)
[WARNING] [08:44:39+0000] 	/usr/local/go/src/os/exec/exec.go:264 +0x4d
[WARNING] [08:44:39+0000] os/exec.(*Cmd).Start.func1(0xc420092580, 0xc420266140)
[WARNING] [08:44:39+0000] 	/usr/local/go/src/os/exec/exec.go:380 +0x27
[WARNING] [08:44:39+0000] created by os/exec.(*Cmd).Start
[WARNING] [08:44:39+0000] 	/usr/local/go/src/os/exec/exec.go:379 +0x646
[WARNING] [08:44:39+0000] goroutine 417 [runnable]:
[WARNING] [08:44:39+0000] syscall.Syscall(0x0, 0x5, 0xc4225c4ed3, 0x1ef2d, 0xffffffffffffffff, 0x0, 0xb)
[WARNING] [08:44:39+0000] 	/usr/local/go/src/syscall/asm_linux_amd64.s:18 +0x5
[WARNING] [08:44:39+0000] syscall.read(0x5, 0xc4225c4ed3, 0x1ef2d, 0x1ef2d, 0xc420325c01, 0x0, 0x0)
[WARNING] [08:44:39+0000] 	/usr/local/go/src/syscall/zsyscall_linux_amd64.go:756 +0x55
[WARNING] [08:44:39+0000] syscall.Read(0x5, 0xc4225c4ed3, 0x1ef2d, 0x1ef2d, 0xee, 0x0, 0x0)
[WARNING] [08:44:39+0000] 	/usr/local/go/src/syscall/syscall_unix.go:162 +0x49
[WARNING] [08:44:39+0000] internal/poll.(*FD).Read(0xc4201c4280, 0xc4225c4ed3, 0x1ef2d, 0x1ef2d, 0x0, 0x0, 0x0)
[WARNING] [08:44:39+0000] 	/usr/local/go/src/internal/poll/fd_unix.go:121 +0x125
[WARNING] [08:44:39+0000] os.(*File).read(0xc42000c050, 0xc4225c4ed3, 0x1ef2d, 0x1ef2d, 0xee, 0x0, 0x0)
[WARNING] [08:44:39+0000] 	/usr/local/go/src/os/file_unix.go:216 +0x4e
[WARNING] [08:44:39+0000] os.(*File).Read(0xc42000c050, 0xc4225c4ed3, 0x1ef2d, 0x1ef2d, 0xee, 0x0, 0x0)
[WARNING] [08:44:39+0000] 	/usr/local/go/src/os/file.go:103 +0x6d
[WARNING] [08:44:39+0000] bytes.(*Buffer).ReadFrom(0xc4200b2150, 0x6a65e0, 0xc42000c050, 0x7fa3948f1028, 0xc4200b2150, 0xc42044e901)
[WARNING] [08:44:39+0000] 	/usr/local/go/src/bytes/buffer.go:209 +0x177
[WARNING] [08:44:39+0000] io.copyBuffer(0x6a63e0, 0xc4200b2150, 0x6a65e0, 0xc42000c050, 0x0, 0x0, 0x0, 0xff, 0xc4203b1740, 0x45c136)
[WARNING] [08:44:39+0000] 	/usr/local/go/src/io/io.go:386 +0x2bb
[WARNING] [08:44:39+0000] io.Copy(0x6a63e0, 0xc4200b2150, 0x6a65e0, 0xc42000c050, 0x1854933c00000008, 0x5b027fae, 0xc4203b1798)
[WARNING] [08:44:39+0000] 	/usr/local/go/src/io/io.go:362 +0x68
[WARNING] [08:44:39+0000] os/exec.(*Cmd).writerDescriptor.func1(0x4ddc00, 0xc4200b93b0)
[WARNING] [08:44:39+0000] 	/usr/local/go/src/os/exec/exec.go:264 +0x4d
[WARNING] [08:44:39+0000] os/exec.(*Cmd).Start.func1(0xc420092000, 0xc420266080)
[WARNING] [08:44:39+0000] 	/usr/local/go/src/os/exec/exec.go:380 +0x27
[WARNING] [08:44:39+0000] created by os/exec.(*Cmd).Start
[WARNING] [08:44:39+0000] 	/usr/local/go/src/os/exec/exec.go:379 +0x646 
[INFO] [08:44:39+0000] jUnit XML report placed at _output/scripts/test-integration/artifacts/gotest_report_OG4gX.xml
Of 0 tests executed in 0.000s, 0 succeeded, 0 failed, and 0 were skipped.
[WARNING] [08:44:39+0000] While the jUnit report found no failed tests, the `go test` process failed.
[WARNING] [08:44:39+0000] This usually means that the unit test suite failed to compile.
[ERROR] [08:44:39+0000] hack/test-go.sh exited with code 1 after 00h 31m 06s
[ERROR] [08:44:39+0000] PID 1254: hack/test-integration.sh:18: `COVERAGE_SPEC=" " DETECT_RACES=false TMPDIR="${BASETMPDIR}" TIMEOUT=45m GOTEST_FLAGS="${gotest_flags}" "${OS_ROOT}/hack/test-go.sh" "test/integration/runner"` exited with status 1.
[INFO] [08:44:39+0000] 		Stack Trace: 
[INFO] [08:44:39+0000] 		  1: hack/test-integration.sh:18: `COVERAGE_SPEC=" " DETECT_RACES=false TMPDIR="${BASETMPDIR}" TIMEOUT=45m GOTEST_FLAGS="${gotest_flags}" "${OS_ROOT}/hack/test-go.sh" "test/integration/runner"`
[INFO] [08:44:39+0000]   Exiting with code 1.
make: *** [test-integration] Error 1
[WARNING] [08:44:41+0000] Copying _output/local/releases from the container failed!
[WARNING] [08:44:41+0000] Error response from daemon: lstat /var/lib/docker/overlay2/cd4c065e1ea720ea529aacb20aaab52d929f45b6772d4578eed4921b6470ca03/merged/go/src/github.com/openshift/origin/_output/local/releases: no such file or directory
[ERROR] [08:44:41+0000] PID 10862: hack/lib/build/environment.sh:172: `return "${exitcode}"` exited with status 2.
[INFO] [08:44:41+0000] 		Stack Trace: 
[INFO] [08:44:41+0000] 		  1: hack/lib/build/environment.sh:172: `return "${exitcode}"`
[INFO] [08:44:41+0000] 		  2: hack/lib/build/environment.sh:281: os::build::environment::withsource
[INFO] [08:44:41+0000] 		  3: hack/env:42: os::build::environment::run
[INFO] [08:44:41+0000]   Exiting with code 2.
++ export status=FAILURE
++ status=FAILURE
+ set +o xtrace
########## FINISHED STAGE: FAILURE: RUN INTEGRATION TESTS [00h 43m 04s] ##########
Build step 'Execute shell' marked build as failure
[PostBuildScript] - Executing post build scripts.
[workspace] $ /bin/bash /tmp/jenkins7487926741496356520.sh
########## STARTING STAGE: DOWNLOAD ARTIFACTS FROM THE REMOTE HOST ##########
+ [[ -s /var/lib/jenkins/jobs/test_pull_request_origin_integration/workspace/activate ]]
+ source /var/lib/jenkins/jobs/test_pull_request_origin_integration/workspace/activate
++ export VIRTUAL_ENV=/var/lib/jenkins/origin-ci-tool/7a5c5e83c372ad2e6b3b64b3efa16fe2cb37ef83
++ VIRTUAL_ENV=/var/lib/jenkins/origin-ci-tool/7a5c5e83c372ad2e6b3b64b3efa16fe2cb37ef83
++ export PATH=/var/lib/jenkins/origin-ci-tool/7a5c5e83c372ad2e6b3b64b3efa16fe2cb37ef83/bin:/sbin:/usr/sbin:/bin:/usr/bin
++ PATH=/var/lib/jenkins/origin-ci-tool/7a5c5e83c372ad2e6b3b64b3efa16fe2cb37ef83/bin:/sbin:/usr/sbin:/bin:/usr/bin
++ unset PYTHON_HOME
++ export OCT_CONFIG_HOME=/var/lib/jenkins/jobs/test_pull_request_origin_integration/workspace/.config
++ OCT_CONFIG_HOME=/var/lib/jenkins/jobs/test_pull_request_origin_integration/workspace/.config
+ trap 'exit 0' EXIT
++ pwd
+ ARTIFACT_DIR=/var/lib/jenkins/jobs/test_pull_request_origin_integration/workspace/artifacts/gathered
+ rm -rf /var/lib/jenkins/jobs/test_pull_request_origin_integration/workspace/artifacts/gathered
+ mkdir -p /var/lib/jenkins/jobs/test_pull_request_origin_integration/workspace/artifacts/gathered
+ ssh -F /var/lib/jenkins/jobs/test_pull_request_origin_integration/workspace/.config/origin-ci-tool/inventory/.ssh_config openshiftdevel sudo stat /data/src/github.com/openshift/origin/_output/scripts
  File: ‘/data/src/github.com/openshift/origin/_output/scripts’
  Size: 61        	Blocks: 0          IO Block: 4096   directory
Device: ca02h/51714d	Inode: 42307019    Links: 5
Access: (2755/drwxr-sr-x)  Uid: ( 1001/  origin)   Gid: ( 1003/origin-git)
Context: unconfined_u:object_r:container_file_t:s0
Access: 1970-01-01 00:00:00.000000000 +0000
Modify: 2018-05-21 08:03:02.000000000 +0000
Change: 2018-05-21 08:44:41.737601543 +0000
 Birth: -
+ ssh -F /var/lib/jenkins/jobs/test_pull_request_origin_integration/workspace/.config/origin-ci-tool/inventory/.ssh_config openshiftdevel sudo chmod -R o+rX /data/src/github.com/openshift/origin/_output/scripts
+ scp -r -F /var/lib/jenkins/jobs/test_pull_request_origin_integration/workspace/.config/origin-ci-tool/inventory/.ssh_config openshiftdevel:/data/src/github.com/openshift/origin/_output/scripts /var/lib/jenkins/jobs/test_pull_request_origin_integration/workspace/artifacts/gathered
+ tree /var/lib/jenkins/jobs/test_pull_request_origin_integration/workspace/artifacts/gathered
/var/lib/jenkins/jobs/test_pull_request_origin_integration/workspace/artifacts/gathered
└── scripts
    ├── shell
    │   ├── artifacts
    │   ├── logs
    │   │   ├── a088dc5ab76b2d34d52ac051b1cfed1641eba070a5429b1af82e1741b0185306.json
    │   │   └── scripts.log
    │   └── openshift.local.home
    ├── test-integration
    │   ├── artifacts
    │   │   ├── gotest_report_OG4gX
    │   │   └── gotest_report_OG4gX.xml
    │   ├── logs
    │   │   ├── raw_test_output.log
    │   │   ├── scripts.log
    │   │   └── test-go-err.log
    │   └── openshift.local.home
    └── test-tools
        ├── artifacts
        ├── logs
        │   ├── raw_test_output.log
        │   └── scripts.log
        └── openshift.local.home

13 directories, 9 files
+ exit 0
[workspace] $ /bin/bash /tmp/jenkins3078678905506737493.sh
########## STARTING STAGE: GENERATE ARTIFACTS FROM THE REMOTE HOST ##########
+ [[ -s /var/lib/jenkins/jobs/test_pull_request_origin_integration/workspace/activate ]]
+ source /var/lib/jenkins/jobs/test_pull_request_origin_integration/workspace/activate
++ export VIRTUAL_ENV=/var/lib/jenkins/origin-ci-tool/7a5c5e83c372ad2e6b3b64b3efa16fe2cb37ef83
++ VIRTUAL_ENV=/var/lib/jenkins/origin-ci-tool/7a5c5e83c372ad2e6b3b64b3efa16fe2cb37ef83
++ export PATH=/var/lib/jenkins/origin-ci-tool/7a5c5e83c372ad2e6b3b64b3efa16fe2cb37ef83/bin:/sbin:/usr/sbin:/bin:/usr/bin
++ PATH=/var/lib/jenkins/origin-ci-tool/7a5c5e83c372ad2e6b3b64b3efa16fe2cb37ef83/bin:/sbin:/usr/sbin:/bin:/usr/bin
++ unset PYTHON_HOME
++ export OCT_CONFIG_HOME=/var/lib/jenkins/jobs/test_pull_request_origin_integration/workspace/.config
++ OCT_CONFIG_HOME=/var/lib/jenkins/jobs/test_pull_request_origin_integration/workspace/.config
+ trap 'exit 0' EXIT
++ pwd
+ ARTIFACT_DIR=/var/lib/jenkins/jobs/test_pull_request_origin_integration/workspace/artifacts/generated
+ rm -rf /var/lib/jenkins/jobs/test_pull_request_origin_integration/workspace/artifacts/generated
+ mkdir /var/lib/jenkins/jobs/test_pull_request_origin_integration/workspace/artifacts/generated
+ ssh -F /var/lib/jenkins/jobs/test_pull_request_origin_integration/workspace/.config/origin-ci-tool/inventory/.ssh_config openshiftdevel 'sudo docker version && sudo docker info && sudo docker images && sudo docker ps -a 2>&1'
  WARNING: You're not using the default seccomp profile
+ ssh -F /var/lib/jenkins/jobs/test_pull_request_origin_integration/workspace/.config/origin-ci-tool/inventory/.ssh_config openshiftdevel 'sudo cat /etc/sysconfig/docker /etc/sysconfig/docker-network /etc/sysconfig/docker-storage /etc/sysconfig/docker-storage-setup /etc/systemd/system/docker.service 2>&1'
+ true
+ ssh -F /var/lib/jenkins/jobs/test_pull_request_origin_integration/workspace/.config/origin-ci-tool/inventory/.ssh_config openshiftdevel 'sudo find /var/lib/docker/containers -name *.log | sudo xargs tail -vn +1 2>&1'
+ ssh -F /var/lib/jenkins/jobs/test_pull_request_origin_integration/workspace/.config/origin-ci-tool/inventory/.ssh_config openshiftdevel 'oc get --raw /metrics --server=https://$( uname --nodename ):10250 --config=/etc/origin/master/admin.kubeconfig 2>&1'
+ true
+ ssh -F /var/lib/jenkins/jobs/test_pull_request_origin_integration/workspace/.config/origin-ci-tool/inventory/.ssh_config openshiftdevel 'sudo ausearch -m AVC -m SELINUX_ERR -m USER_AVC 2>&1'
+ true
+ ssh -F /var/lib/jenkins/jobs/test_pull_request_origin_integration/workspace/.config/origin-ci-tool/inventory/.ssh_config openshiftdevel 'oc get --raw /metrics --config=/etc/origin/master/admin.kubeconfig 2>&1'
+ true
+ ssh -F /var/lib/jenkins/jobs/test_pull_request_origin_integration/workspace/.config/origin-ci-tool/inventory/.ssh_config openshiftdevel 'sudo df -T -h && sudo pvs && sudo vgs && sudo lvs && sudo findmnt --all 2>&1'
+ ssh -F /var/lib/jenkins/jobs/test_pull_request_origin_integration/workspace/.config/origin-ci-tool/inventory/.ssh_config openshiftdevel 'sudo yum list installed 2>&1'
+ ssh -F /var/lib/jenkins/jobs/test_pull_request_origin_integration/workspace/.config/origin-ci-tool/inventory/.ssh_config openshiftdevel 'sudo journalctl --dmesg --no-pager --all --lines=all 2>&1'
+ ssh -F /var/lib/jenkins/jobs/test_pull_request_origin_integration/workspace/.config/origin-ci-tool/inventory/.ssh_config openshiftdevel 'sudo journalctl _PID=1 --no-pager --all --lines=all 2>&1'
+ tree /var/lib/jenkins/jobs/test_pull_request_origin_integration/workspace/artifacts/generated
/var/lib/jenkins/jobs/test_pull_request_origin_integration/workspace/artifacts/generated
├── avc_denials.log
├── containers.log
├── dmesg.log
├── docker.config
├── docker.info
├── filesystem.info
├── installed_packages.log
├── master-metrics.log
├── node-metrics.log
└── pid1.journal

0 directories, 10 files
+ exit 0
[workspace] $ /bin/bash /tmp/jenkins2356259914287845027.sh
########## STARTING STAGE: FETCH SYSTEMD JOURNALS FROM THE REMOTE HOST ##########
+ [[ -s /var/lib/jenkins/jobs/test_pull_request_origin_integration/workspace/activate ]]
+ source /var/lib/jenkins/jobs/test_pull_request_origin_integration/workspace/activate
++ export VIRTUAL_ENV=/var/lib/jenkins/origin-ci-tool/7a5c5e83c372ad2e6b3b64b3efa16fe2cb37ef83
++ VIRTUAL_ENV=/var/lib/jenkins/origin-ci-tool/7a5c5e83c372ad2e6b3b64b3efa16fe2cb37ef83
++ export PATH=/var/lib/jenkins/origin-ci-tool/7a5c5e83c372ad2e6b3b64b3efa16fe2cb37ef83/bin:/sbin:/usr/sbin:/bin:/usr/bin
++ PATH=/var/lib/jenkins/origin-ci-tool/7a5c5e83c372ad2e6b3b64b3efa16fe2cb37ef83/bin:/sbin:/usr/sbin:/bin:/usr/bin
++ unset PYTHON_HOME
++ export OCT_CONFIG_HOME=/var/lib/jenkins/jobs/test_pull_request_origin_integration/workspace/.config
++ OCT_CONFIG_HOME=/var/lib/jenkins/jobs/test_pull_request_origin_integration/workspace/.config
+ trap 'exit 0' EXIT
++ pwd
+ ARTIFACT_DIR=/var/lib/jenkins/jobs/test_pull_request_origin_integration/workspace/artifacts/journals
+ rm -rf /var/lib/jenkins/jobs/test_pull_request_origin_integration/workspace/artifacts/journals
+ mkdir /var/lib/jenkins/jobs/test_pull_request_origin_integration/workspace/artifacts/journals
+ ssh -F /var/lib/jenkins/jobs/test_pull_request_origin_integration/workspace/.config/origin-ci-tool/inventory/.ssh_config openshiftdevel sudo journalctl --unit docker.service --no-pager --all --lines=all
+ ssh -F /var/lib/jenkins/jobs/test_pull_request_origin_integration/workspace/.config/origin-ci-tool/inventory/.ssh_config openshiftdevel sudo journalctl --unit dnsmasq.service --no-pager --all --lines=all
+ ssh -F /var/lib/jenkins/jobs/test_pull_request_origin_integration/workspace/.config/origin-ci-tool/inventory/.ssh_config openshiftdevel sudo journalctl --unit systemd-journald.service --no-pager --all --lines=all
+ tree /var/lib/jenkins/jobs/test_pull_request_origin_integration/workspace/artifacts/journals
/var/lib/jenkins/jobs/test_pull_request_origin_integration/workspace/artifacts/journals
├── dnsmasq.service
├── docker.service
└── systemd-journald.service

0 directories, 3 files
+ exit 0
[workspace] $ /bin/bash /tmp/jenkins5994681662108048872.sh
########## STARTING STAGE: ASSEMBLE GCS OUTPUT ##########
+ [[ -s /var/lib/jenkins/jobs/test_pull_request_origin_integration/workspace/activate ]]
+ source /var/lib/jenkins/jobs/test_pull_request_origin_integration/workspace/activate
++ export VIRTUAL_ENV=/var/lib/jenkins/origin-ci-tool/7a5c5e83c372ad2e6b3b64b3efa16fe2cb37ef83
++ VIRTUAL_ENV=/var/lib/jenkins/origin-ci-tool/7a5c5e83c372ad2e6b3b64b3efa16fe2cb37ef83
++ export PATH=/var/lib/jenkins/origin-ci-tool/7a5c5e83c372ad2e6b3b64b3efa16fe2cb37ef83/bin:/sbin:/usr/sbin:/bin:/usr/bin
++ PATH=/var/lib/jenkins/origin-ci-tool/7a5c5e83c372ad2e6b3b64b3efa16fe2cb37ef83/bin:/sbin:/usr/sbin:/bin:/usr/bin
++ unset PYTHON_HOME
++ export OCT_CONFIG_HOME=/var/lib/jenkins/jobs/test_pull_request_origin_integration/workspace/.config
++ OCT_CONFIG_HOME=/var/lib/jenkins/jobs/test_pull_request_origin_integration/workspace/.config
+ trap 'exit 0' EXIT
+ mkdir -p gcs/artifacts gcs/artifacts/generated gcs/artifacts/journals gcs/artifacts/gathered
++ python -c 'import json; import urllib; print json.load(urllib.urlopen('\''https://ci.openshift.redhat.com/jenkins/job/test_pull_request_origin_integration/17971/api/json'\''))['\''result'\'']'
+ result=FAILURE
+ cat
++ date +%s
+ cat /var/lib/jenkins/jobs/test_pull_request_origin_integration/builds/17971/log
+ cp artifacts/generated/avc_denials.log artifacts/generated/containers.log artifacts/generated/dmesg.log artifacts/generated/docker.config artifacts/generated/docker.info artifacts/generated/filesystem.info artifacts/generated/installed_packages.log artifacts/generated/master-metrics.log artifacts/generated/node-metrics.log artifacts/generated/pid1.journal gcs/artifacts/generated/
+ cp artifacts/journals/dnsmasq.service artifacts/journals/docker.service artifacts/journals/systemd-journald.service gcs/artifacts/journals/
+ cp -r artifacts/gathered/scripts gcs/artifacts/
++ pwd
+ scp -F /var/lib/jenkins/jobs/test_pull_request_origin_integration/workspace/.config/origin-ci-tool/inventory/.ssh_config -r /var/lib/jenkins/jobs/test_pull_request_origin_integration/workspace/gcs openshiftdevel:/data
+ scp -F /var/lib/jenkins/jobs/test_pull_request_origin_integration/workspace/.config/origin-ci-tool/inventory/.ssh_config /var/lib/jenkins/.config/gcloud/gcs-publisher-credentials.json openshiftdevel:/data/credentials.json
+ exit 0
[workspace] $ /bin/bash /tmp/jenkins3883824595270755272.sh
########## STARTING STAGE: PUSH THE ARTIFACTS AND METADATA ##########
+ [[ -s /var/lib/jenkins/jobs/test_pull_request_origin_integration/workspace/activate ]]
+ source /var/lib/jenkins/jobs/test_pull_request_origin_integration/workspace/activate
++ export VIRTUAL_ENV=/var/lib/jenkins/origin-ci-tool/7a5c5e83c372ad2e6b3b64b3efa16fe2cb37ef83
++ VIRTUAL_ENV=/var/lib/jenkins/origin-ci-tool/7a5c5e83c372ad2e6b3b64b3efa16fe2cb37ef83
++ export PATH=/var/lib/jenkins/origin-ci-tool/7a5c5e83c372ad2e6b3b64b3efa16fe2cb37ef83/bin:/sbin:/usr/sbin:/bin:/usr/bin
++ PATH=/var/lib/jenkins/origin-ci-tool/7a5c5e83c372ad2e6b3b64b3efa16fe2cb37ef83/bin:/sbin:/usr/sbin:/bin:/usr/bin
++ unset PYTHON_HOME
++ export OCT_CONFIG_HOME=/var/lib/jenkins/jobs/test_pull_request_origin_integration/workspace/.config
++ OCT_CONFIG_HOME=/var/lib/jenkins/jobs/test_pull_request_origin_integration/workspace/.config
++ mktemp
+ script=/tmp/tmp.tDEFbQILx6
+ cat
+ chmod +x /tmp/tmp.tDEFbQILx6
+ scp -F /var/lib/jenkins/jobs/test_pull_request_origin_integration/workspace/.config/origin-ci-tool/inventory/.ssh_config /tmp/tmp.tDEFbQILx6 openshiftdevel:/tmp/tmp.tDEFbQILx6
+ ssh -F /var/lib/jenkins/jobs/test_pull_request_origin_integration/workspace/.config/origin-ci-tool/inventory/.ssh_config -t openshiftdevel 'bash -l -c "timeout 300 /tmp/tmp.tDEFbQILx6"'
+ cd /home/origin
+ trap 'exit 0' EXIT
+ [[ -n {"type":"presubmit","job":"test_pull_request_origin_integration","buildid":"82857071-5ccc-11e8-ae4a-0a58ac100556","refs":{"org":"openshift","repo":"origin","base_ref":"master","base_sha":"d358f09d9f6b4274b6728119c9a4989040a06a32","pulls":[{"number":19759,"author":"wozniakjan","sha":"1ba7ac484864738d371f97e962beb737c4d8def8"}]}} ]]
++ jq --compact-output .buildid
+ [[ "82857071-5ccc-11e8-ae4a-0a58ac100556" =~ ^"[0-9]+"$ ]]
+ echo 'Using BUILD_NUMBER'
Using BUILD_NUMBER
++ jq --compact-output '.buildid |= "17971"'
+ JOB_SPEC='{"type":"presubmit","job":"test_pull_request_origin_integration","buildid":"17971","refs":{"org":"openshift","repo":"origin","base_ref":"master","base_sha":"d358f09d9f6b4274b6728119c9a4989040a06a32","pulls":[{"number":19759,"author":"wozniakjan","sha":"1ba7ac484864738d371f97e962beb737c4d8def8"}]}}'
+ docker run -e 'JOB_SPEC={"type":"presubmit","job":"test_pull_request_origin_integration","buildid":"17971","refs":{"org":"openshift","repo":"origin","base_ref":"master","base_sha":"d358f09d9f6b4274b6728119c9a4989040a06a32","pulls":[{"number":19759,"author":"wozniakjan","sha":"1ba7ac484864738d371f97e962beb737c4d8def8"}]}}' -v /data:/data:z registry.svc.ci.openshift.org/ci/gcsupload:latest --dry-run=false --gcs-path=gs://origin-ci-test --gcs-credentials-file=/data/credentials.json --path-strategy=single --default-org=openshift --default-repo=origin /data/gcs/artifacts /data/gcs/build-log.txt /data/gcs/finished.json
Unable to find image 'registry.svc.ci.openshift.org/ci/gcsupload:latest' locally
Trying to pull repository registry.svc.ci.openshift.org/ci/gcsupload ... 
latest: Pulling from registry.svc.ci.openshift.org/ci/gcsupload
6d987f6f4279: Already exists
4cccebe844ee: Already exists
cafcba51f636: Pulling fs layer
cafcba51f636: Verifying Checksum
cafcba51f636: Download complete
cafcba51f636: Pull complete
Digest: sha256:c452798b56e3f4649c557c3ff7273126042065e3be152689a1ffb880638e617d
Status: Downloaded newer image for registry.svc.ci.openshift.org/ci/gcsupload:latest
{"component":"gcsupload","level":"info","msg":"Gathering artifacts from artifact directory: /data/gcs/artifacts","time":"2018-05-21T08:45:02Z"}
{"component":"gcsupload","level":"info","msg":"Found /data/gcs/artifacts/generated/avc_denials.log in artifact directory. Uploading as artifacts/generated/avc_denials.log\n","time":"2018-05-21T08:45:02Z"}
{"component":"gcsupload","level":"info","msg":"Found /data/gcs/artifacts/generated/containers.log in artifact directory. Uploading as artifacts/generated/containers.log\n","time":"2018-05-21T08:45:02Z"}
{"component":"gcsupload","level":"info","msg":"Found /data/gcs/artifacts/generated/dmesg.log in artifact directory. Uploading as artifacts/generated/dmesg.log\n","time":"2018-05-21T08:45:02Z"}
{"component":"gcsupload","level":"info","msg":"Found /data/gcs/artifacts/generated/docker.config in artifact directory. Uploading as artifacts/generated/docker.config\n","time":"2018-05-21T08:45:02Z"}
{"component":"gcsupload","level":"info","msg":"Found /data/gcs/artifacts/generated/docker.info in artifact directory. Uploading as artifacts/generated/docker.info\n","time":"2018-05-21T08:45:02Z"}
{"component":"gcsupload","level":"info","msg":"Found /data/gcs/artifacts/generated/filesystem.info in artifact directory. Uploading as artifacts/generated/filesystem.info\n","time":"2018-05-21T08:45:02Z"}
{"component":"gcsupload","level":"info","msg":"Found /data/gcs/artifacts/generated/installed_packages.log in artifact directory. Uploading as artifacts/generated/installed_packages.log\n","time":"2018-05-21T08:45:02Z"}
{"component":"gcsupload","level":"info","msg":"Found /data/gcs/artifacts/generated/master-metrics.log in artifact directory. Uploading as artifacts/generated/master-metrics.log\n","time":"2018-05-21T08:45:02Z"}
{"component":"gcsupload","level":"info","msg":"Found /data/gcs/artifacts/generated/node-metrics.log in artifact directory. Uploading as artifacts/generated/node-metrics.log\n","time":"2018-05-21T08:45:02Z"}
{"component":"gcsupload","level":"info","msg":"Found /data/gcs/artifacts/generated/pid1.journal in artifact directory. Uploading as artifacts/generated/pid1.journal\n","time":"2018-05-21T08:45:02Z"}
{"component":"gcsupload","level":"info","msg":"Found /data/gcs/artifacts/journals/dnsmasq.service in artifact directory. Uploading as artifacts/journals/dnsmasq.service\n","time":"2018-05-21T08:45:02Z"}
{"component":"gcsupload","level":"info","msg":"Found /data/gcs/artifacts/journals/docker.service in artifact directory. Uploading as artifacts/journals/docker.service\n","time":"2018-05-21T08:45:02Z"}
{"component":"gcsupload","level":"info","msg":"Found /data/gcs/artifacts/journals/systemd-journald.service in artifact directory. Uploading as artifacts/journals/systemd-journald.service\n","time":"2018-05-21T08:45:02Z"}
{"component":"gcsupload","level":"info","msg":"Found /data/gcs/artifacts/scripts/shell/logs/a088dc5ab76b2d34d52ac051b1cfed1641eba070a5429b1af82e1741b0185306.json in artifact directory. Uploading as artifacts/scripts/shell/logs/a088dc5ab76b2d34d52ac051b1cfed1641eba070a5429b1af82e1741b0185306.json\n","time":"2018-05-21T08:45:02Z"}
{"component":"gcsupload","level":"info","msg":"Found /data/gcs/artifacts/scripts/shell/logs/scripts.log in artifact directory. Uploading as artifacts/scripts/shell/logs/scripts.log\n","time":"2018-05-21T08:45:02Z"}
{"component":"gcsupload","level":"info","msg":"Found /data/gcs/artifacts/scripts/test-integration/artifacts/gotest_report_OG4gX in artifact directory. Uploading as artifacts/scripts/test-integration/artifacts/gotest_report_OG4gX\n","time":"2018-05-21T08:45:02Z"}
{"component":"gcsupload","level":"info","msg":"Found /data/gcs/artifacts/scripts/test-integration/artifacts/gotest_report_OG4gX.xml in artifact directory. Uploading as artifacts/scripts/test-integration/artifacts/gotest_report_OG4gX.xml\n","time":"2018-05-21T08:45:02Z"}
{"component":"gcsupload","level":"info","msg":"Found /data/gcs/artifacts/scripts/test-integration/logs/raw_test_output.log in artifact directory. Uploading as artifacts/scripts/test-integration/logs/raw_test_output.log\n","time":"2018-05-21T08:45:02Z"}
{"component":"gcsupload","level":"info","msg":"Found /data/gcs/artifacts/scripts/test-integration/logs/scripts.log in artifact directory. Uploading as artifacts/scripts/test-integration/logs/scripts.log\n","time":"2018-05-21T08:45:02Z"}
{"component":"gcsupload","level":"info","msg":"Found /data/gcs/artifacts/scripts/test-integration/logs/test-go-err.log in artifact directory. Uploading as artifacts/scripts/test-integration/logs/test-go-err.log\n","time":"2018-05-21T08:45:02Z"}
{"component":"gcsupload","level":"info","msg":"Found /data/gcs/artifacts/scripts/test-tools/logs/raw_test_output.log in artifact directory. Uploading as artifacts/scripts/test-tools/logs/raw_test_output.log\n","time":"2018-05-21T08:45:02Z"}
{"component":"gcsupload","level":"info","msg":"Found /data/gcs/artifacts/scripts/test-tools/logs/scripts.log in artifact directory. Uploading as artifacts/scripts/test-tools/logs/scripts.log\n","time":"2018-05-21T08:45:02Z"}
{"component":"gcsupload","dest":"pr-logs/pull/19759/test_pull_request_origin_integration/17971/artifacts/generated/docker.config","level":"info","msg":"Queued for upload","time":"2018-05-21T08:45:02Z"}
{"component":"gcsupload","dest":"pr-logs/pull/19759/test_pull_request_origin_integration/17971/finished.json","level":"info","msg":"Queued for upload","time":"2018-05-21T08:45:02Z"}
{"component":"gcsupload","dest":"pr-logs/pull/19759/test_pull_request_origin_integration/17971/artifacts/generated/containers.log","level":"info","msg":"Queued for upload","time":"2018-05-21T08:45:02Z"}
{"component":"gcsupload","dest":"pr-logs/directory/test_pull_request_origin_integration/17971.txt","level":"info","msg":"Queued for upload","time":"2018-05-21T08:45:02Z"}
{"component":"gcsupload","dest":"pr-logs/pull/19759/test_pull_request_origin_integration/17971/artifacts/generated/filesystem.info","level":"info","msg":"Queued for upload","time":"2018-05-21T08:45:02Z"}
{"component":"gcsupload","dest":"pr-logs/pull/19759/test_pull_request_origin_integration/17971/artifacts/generated/node-metrics.log","level":"info","msg":"Queued for upload","time":"2018-05-21T08:45:02Z"}
{"component":"gcsupload","dest":"pr-logs/pull/19759/test_pull_request_origin_integration/17971/artifacts/journals/docker.service","level":"info","msg":"Queued for upload","time":"2018-05-21T08:45:02Z"}
{"component":"gcsupload","dest":"pr-logs/pull/19759/test_pull_request_origin_integration/17971/artifacts/generated/avc_denials.log","level":"info","msg":"Queued for upload","time":"2018-05-21T08:45:02Z"}
{"component":"gcsupload","dest":"pr-logs/pull/19759/test_pull_request_origin_integration/17971/artifacts/generated/docker.info","level":"info","msg":"Queued for upload","time":"2018-05-21T08:45:02Z"}
{"component":"gcsupload","dest":"pr-logs/pull/19759/test_pull_request_origin_integration/17971/artifacts/generated/installed_packages.log","level":"info","msg":"Queued for upload","time":"2018-05-21T08:45:02Z"}
{"component":"gcsupload","dest":"pr-logs/pull/19759/test_pull_request_origin_integration/17971/artifacts/scripts/shell/logs/scripts.log","level":"info","msg":"Queued for upload","time":"2018-05-21T08:45:02Z"}
{"component":"gcsupload","dest":"pr-logs/pull/19759/test_pull_request_origin_integration/17971/artifacts/scripts/test-integration/logs/raw_test_output.log","level":"info","msg":"Queued for upload","time":"2018-05-21T08:45:02Z"}
{"component":"gcsupload","dest":"pr-logs/pull/19759/test_pull_request_origin_integration/latest-build.txt","level":"info","msg":"Queued for upload","time":"2018-05-21T08:45:02Z"}
{"component":"gcsupload","dest":"pr-logs/pull/19759/test_pull_request_origin_integration/17971/artifacts/scripts/test-tools/logs/scripts.log","level":"info","msg":"Queued for upload","time":"2018-05-21T08:45:02Z"}
{"component":"gcsupload","dest":"pr-logs/pull/19759/test_pull_request_origin_integration/17971/build-log.txt","level":"info","msg":"Queued for upload","time":"2018-05-21T08:45:02Z"}
{"component":"gcsupload","dest":"pr-logs/pull/19759/test_pull_request_origin_integration/17971/artifacts/scripts/test-integration/logs/scripts.log","level":"info","msg":"Queued for upload","time":"2018-05-21T08:45:02Z"}
{"component":"gcsupload","dest":"pr-logs/pull/19759/test_pull_request_origin_integration/17971/artifacts/generated/dmesg.log","level":"info","msg":"Queued for upload","time":"2018-05-21T08:45:02Z"}
{"component":"gcsupload","dest":"pr-logs/pull/19759/test_pull_request_origin_integration/17971/artifacts/generated/pid1.journal","level":"info","msg":"Queued for upload","time":"2018-05-21T08:45:02Z"}
{"component":"gcsupload","dest":"pr-logs/pull/19759/test_pull_request_origin_integration/17971/artifacts/scripts/test-integration/artifacts/gotest_report_OG4gX","level":"info","msg":"Queued for upload","time":"2018-05-21T08:45:02Z"}
{"component":"gcsupload","dest":"pr-logs/directory/test_pull_request_origin_integration/latest-build.txt","level":"info","msg":"Queued for upload","time":"2018-05-21T08:45:02Z"}
{"component":"gcsupload","dest":"pr-logs/pull/19759/test_pull_request_origin_integration/17971/artifacts/scripts/shell/logs/a088dc5ab76b2d34d52ac051b1cfed1641eba070a5429b1af82e1741b0185306.json","level":"info","msg":"Queued for upload","time":"2018-05-21T08:45:02Z"}
{"component":"gcsupload","dest":"pr-logs/pull/19759/test_pull_request_origin_integration/17971/artifacts/scripts/test-tools/logs/raw_test_output.log","level":"info","msg":"Queued for upload","time":"2018-05-21T08:45:02Z"}
{"component":"gcsupload","dest":"pr-logs/pull/19759/test_pull_request_origin_integration/17971/artifacts/journals/systemd-journald.service","level":"info","msg":"Queued for upload","time":"2018-05-21T08:45:02Z"}
{"component":"gcsupload","dest":"pr-logs/pull/19759/test_pull_request_origin_integration/17971/artifacts/generated/master-metrics.log","level":"info","msg":"Queued for upload","time":"2018-05-21T08:45:02Z"}
{"component":"gcsupload","dest":"pr-logs/pull/19759/test_pull_request_origin_integration/17971/artifacts/journals/dnsmasq.service","level":"info","msg":"Queued for upload","time":"2018-05-21T08:45:02Z"}
{"component":"gcsupload","dest":"pr-logs/pull/19759/test_pull_request_origin_integration/17971/artifacts/scripts/test-integration/artifacts/gotest_report_OG4gX.xml","level":"info","msg":"Queued for upload","time":"2018-05-21T08:45:02Z"}
{"component":"gcsupload","dest":"pr-logs/pull/19759/test_pull_request_origin_integration/17971/artifacts/scripts/test-integration/logs/test-go-err.log","level":"info","msg":"Queued for upload","time":"2018-05-21T08:45:02Z"}
{"component":"gcsupload","dest":"pr-logs/pull/19759/test_pull_request_origin_integration/17971/artifacts/scripts/shell/logs/scripts.log","level":"info","msg":"Finished upload","time":"2018-05-21T08:45:03Z"}
{"component":"gcsupload","dest":"pr-logs/pull/19759/test_pull_request_origin_integration/17971/artifacts/generated/filesystem.info","level":"info","msg":"Finished upload","time":"2018-05-21T08:45:03Z"}
{"component":"gcsupload","dest":"pr-logs/pull/19759/test_pull_request_origin_integration/17971/artifacts/scripts/test-tools/logs/scripts.log","level":"info","msg":"Finished upload","time":"2018-05-21T08:45:03Z"}
{"component":"gcsupload","dest":"pr-logs/pull/19759/test_pull_request_origin_integration/17971/artifacts/generated/master-metrics.log","level":"info","msg":"Finished upload","time":"2018-05-21T08:45:03Z"}
{"component":"gcsupload","dest":"pr-logs/pull/19759/test_pull_request_origin_integration/17971/artifacts/generated/installed_packages.log","level":"info","msg":"Finished upload","time":"2018-05-21T08:45:03Z"}
{"component":"gcsupload","dest":"pr-logs/pull/19759/test_pull_request_origin_integration/17971/artifacts/generated/avc_denials.log","level":"info","msg":"Finished upload","time":"2018-05-21T08:45:03Z"}
{"component":"gcsupload","dest":"pr-logs/pull/19759/test_pull_request_origin_integration/17971/artifacts/journals/dnsmasq.service","level":"info","msg":"Finished upload","time":"2018-05-21T08:45:03Z"}
{"component":"gcsupload","dest":"pr-logs/pull/19759/test_pull_request_origin_integration/17971/artifacts/scripts/test-integration/logs/raw_test_output.log","level":"info","msg":"Finished upload","time":"2018-05-21T08:45:03Z"}
{"component":"gcsupload","dest":"pr-logs/pull/19759/test_pull_request_origin_integration/17971/artifacts/generated/containers.log","level":"info","msg":"Finished upload","time":"2018-05-21T08:45:03Z"}
{"component":"gcsupload","dest":"pr-logs/pull/19759/test_pull_request_origin_integration/17971/artifacts/scripts/test-tools/logs/raw_test_output.log","level":"info","msg":"Finished upload","time":"2018-05-21T08:45:03Z"}
{"component":"gcsupload","dest":"pr-logs/pull/19759/test_pull_request_origin_integration/17971/artifacts/scripts/test-integration/artifacts/gotest_report_OG4gX","level":"info","msg":"Finished upload","time":"2018-05-21T08:45:03Z"}
{"component":"gcsupload","dest":"pr-logs/pull/19759/test_pull_request_origin_integration/17971/finished.json","level":"info","msg":"Finished upload","time":"2018-05-21T08:45:03Z"}
{"component":"gcsupload","dest":"pr-logs/pull/19759/test_pull_request_origin_integration/17971/artifacts/generated/docker.info","level":"info","msg":"Finished upload","time":"2018-05-21T08:45:03Z"}
{"component":"gcsupload","dest":"pr-logs/pull/19759/test_pull_request_origin_integration/17971/artifacts/scripts/test-integration/artifacts/gotest_report_OG4gX.xml","level":"info","msg":"Finished upload","time":"2018-05-21T08:45:03Z"}
{"component":"gcsupload","dest":"pr-logs/pull/19759/test_pull_request_origin_integration/17971/artifacts/scripts/shell/logs/a088dc5ab76b2d34d52ac051b1cfed1641eba070a5429b1af82e1741b0185306.json","level":"info","msg":"Finished upload","time":"2018-05-21T08:45:03Z"}
{"component":"gcsupload","dest":"pr-logs/directory/test_pull_request_origin_integration/latest-build.txt","level":"info","msg":"Finished upload","time":"2018-05-21T08:45:03Z"}
{"component":"gcsupload","dest":"pr-logs/pull/19759/test_pull_request_origin_integration/17971/artifacts/generated/pid1.journal","level":"info","msg":"Finished upload","time":"2018-05-21T08:45:03Z"}
{"component":"gcsupload","dest":"pr-logs/pull/19759/test_pull_request_origin_integration/17971/artifacts/journals/docker.service","level":"info","msg":"Finished upload","time":"2018-05-21T08:45:03Z"}
{"component":"gcsupload","dest":"pr-logs/pull/19759/test_pull_request_origin_integration/17971/artifacts/generated/node-metrics.log","level":"info","msg":"Finished upload","time":"2018-05-21T08:45:03Z"}
{"component":"gcsupload","dest":"pr-logs/pull/19759/test_pull_request_origin_integration/17971/artifacts/scripts/test-integration/logs/test-go-err.log","level":"info","msg":"Finished upload","time":"2018-05-21T08:45:03Z"}
{"component":"gcsupload","dest":"pr-logs/pull/19759/test_pull_request_origin_integration/17971/artifacts/generated/dmesg.log","level":"info","msg":"Finished upload","time":"2018-05-21T08:45:03Z"}
{"component":"gcsupload","dest":"pr-logs/pull/19759/test_pull_request_origin_integration/17971/artifacts/generated/docker.config","level":"info","msg":"Finished upload","time":"2018-05-21T08:45:03Z"}
{"component":"gcsupload","dest":"pr-logs/pull/19759/test_pull_request_origin_integration/17971/build-log.txt","level":"info","msg":"Finished upload","time":"2018-05-21T08:45:03Z"}
{"component":"gcsupload","dest":"pr-logs/pull/19759/test_pull_request_origin_integration/17971/artifacts/scripts/test-integration/logs/scripts.log","level":"info","msg":"Finished upload","time":"2018-05-21T08:45:03Z"}
{"component":"gcsupload","dest":"pr-logs/pull/19759/test_pull_request_origin_integration/latest-build.txt","level":"info","msg":"Finished upload","time":"2018-05-21T08:45:03Z"}
{"component":"gcsupload","dest":"pr-logs/directory/test_pull_request_origin_integration/17971.txt","level":"info","msg":"Finished upload","time":"2018-05-21T08:45:03Z"}
{"component":"gcsupload","dest":"pr-logs/pull/19759/test_pull_request_origin_integration/17971/artifacts/journals/systemd-journald.service","level":"info","msg":"Finished upload","time":"2018-05-21T08:45:03Z"}
{"component":"gcsupload","level":"info","msg":"Finished upload to GCS","time":"2018-05-21T08:45:03Z"}
+ exit 0
+ set +o xtrace
########## FINISHED STAGE: SUCCESS: PUSH THE ARTIFACTS AND METADATA [00h 00m 09s] ##########
[workspace] $ /bin/bash /tmp/jenkins2095424799329789023.sh
########## STARTING STAGE: DEPROVISION CLOUD RESOURCES ##########
+ [[ -s /var/lib/jenkins/jobs/test_pull_request_origin_integration/workspace/activate ]]
+ source /var/lib/jenkins/jobs/test_pull_request_origin_integration/workspace/activate
++ export VIRTUAL_ENV=/var/lib/jenkins/origin-ci-tool/7a5c5e83c372ad2e6b3b64b3efa16fe2cb37ef83
++ VIRTUAL_ENV=/var/lib/jenkins/origin-ci-tool/7a5c5e83c372ad2e6b3b64b3efa16fe2cb37ef83
++ export PATH=/var/lib/jenkins/origin-ci-tool/7a5c5e83c372ad2e6b3b64b3efa16fe2cb37ef83/bin:/sbin:/usr/sbin:/bin:/usr/bin
++ PATH=/var/lib/jenkins/origin-ci-tool/7a5c5e83c372ad2e6b3b64b3efa16fe2cb37ef83/bin:/sbin:/usr/sbin:/bin:/usr/bin
++ unset PYTHON_HOME
++ export OCT_CONFIG_HOME=/var/lib/jenkins/jobs/test_pull_request_origin_integration/workspace/.config
++ OCT_CONFIG_HOME=/var/lib/jenkins/jobs/test_pull_request_origin_integration/workspace/.config
+ oct deprovision

PLAYBOOK: main.yml *************************************************************
4 plays in /var/lib/jenkins/origin-ci-tool/7a5c5e83c372ad2e6b3b64b3efa16fe2cb37ef83/lib/python2.7/site-packages/oct/ansible/oct/playbooks/deprovision/main.yml

PLAY [ensure we have the parameters necessary to deprovision virtual hosts] ****

TASK [ensure all required variables are set] ***********************************
task path: /var/lib/jenkins/origin-ci-tool/7a5c5e83c372ad2e6b3b64b3efa16fe2cb37ef83/lib/python2.7/site-packages/oct/ansible/oct/playbooks/deprovision/main.yml:9
skipping: [localhost] => (item=origin_ci_inventory_dir)  => {
    "changed": false, 
    "generated_timestamp": "2018-05-21 04:45:04.984348", 
    "item": "origin_ci_inventory_dir", 
    "skip_reason": "Conditional check failed", 
    "skipped": true
}
skipping: [localhost] => (item=origin_ci_aws_region)  => {
    "changed": false, 
    "generated_timestamp": "2018-05-21 04:45:04.990788", 
    "item": "origin_ci_aws_region", 
    "skip_reason": "Conditional check failed", 
    "skipped": true
}

PLAY [deprovision virtual hosts in EC2] ****************************************

TASK [Gathering Facts] *********************************************************
ok: [localhost]

TASK [deprovision a virtual EC2 host] ******************************************
task path: /var/lib/jenkins/origin-ci-tool/7a5c5e83c372ad2e6b3b64b3efa16fe2cb37ef83/lib/python2.7/site-packages/oct/ansible/oct/playbooks/deprovision/main.yml:28
included: /var/lib/jenkins/origin-ci-tool/7a5c5e83c372ad2e6b3b64b3efa16fe2cb37ef83/lib/python2.7/site-packages/oct/ansible/oct/playbooks/deprovision/roles/aws-down/tasks/main.yml for localhost

TASK [update the SSH configuration to remove AWS EC2 specifics] ****************
task path: /var/lib/jenkins/origin-ci-tool/7a5c5e83c372ad2e6b3b64b3efa16fe2cb37ef83/lib/python2.7/site-packages/oct/ansible/oct/playbooks/deprovision/roles/aws-down/tasks/main.yml:2
ok: [localhost] => {
    "changed": false, 
    "generated_timestamp": "2018-05-21 04:45:05.847735", 
    "msg": ""
}

TASK [rename EC2 instance for termination reaper] ******************************
task path: /var/lib/jenkins/origin-ci-tool/7a5c5e83c372ad2e6b3b64b3efa16fe2cb37ef83/lib/python2.7/site-packages/oct/ansible/oct/playbooks/deprovision/roles/aws-down/tasks/main.yml:8
changed: [localhost] => {
    "changed": true, 
    "generated_timestamp": "2018-05-21 04:45:06.679335", 
    "msg": "Tags {'Name': 'oct-terminate'} created for resource i-0d659da86e623d7f2."
}

TASK [tear down the EC2 instance] **********************************************
task path: /var/lib/jenkins/origin-ci-tool/7a5c5e83c372ad2e6b3b64b3efa16fe2cb37ef83/lib/python2.7/site-packages/oct/ansible/oct/playbooks/deprovision/roles/aws-down/tasks/main.yml:15
changed: [localhost] => {
    "changed": true, 
    "generated_timestamp": "2018-05-21 04:45:07.465245", 
    "instance_ids": [
        "i-0d659da86e623d7f2"
    ], 
    "instances": [
        {
            "ami_launch_index": "0", 
            "architecture": "x86_64", 
            "block_device_mapping": {
                "/dev/sda1": {
                    "delete_on_termination": true, 
                    "status": "attached", 
                    "volume_id": "vol-0b1b180817bc2e8df"
                }, 
                "/dev/sdb": {
                    "delete_on_termination": true, 
                    "status": "attached", 
                    "volume_id": "vol-093fb3a96fdd02227"
                }
            }, 
            "dns_name": "ec2-54-161-107-9.compute-1.amazonaws.com", 
            "ebs_optimized": false, 
            "groups": {
                "sg-7e73221a": "default"
            }, 
            "hypervisor": "xen", 
            "id": "i-0d659da86e623d7f2", 
            "image_id": "ami-0f07d2d9a03af96ec", 
            "instance_type": "m4.xlarge", 
            "kernel": null, 
            "key_name": "libra", 
            "launch_time": "2018-05-21T07:57:20.000Z", 
            "placement": "us-east-1d", 
            "private_dns_name": "ip-172-18-14-205.ec2.internal", 
            "private_ip": "172.18.14.205", 
            "public_dns_name": "ec2-54-161-107-9.compute-1.amazonaws.com", 
            "public_ip": "54.161.107.9", 
            "ramdisk": null, 
            "region": "us-east-1", 
            "root_device_name": "/dev/sda1", 
            "root_device_type": "ebs", 
            "state": "running", 
            "state_code": 16, 
            "tags": {
                "Name": "oct-terminate", 
                "openshift_etcd": "", 
                "openshift_master": "", 
                "openshift_node": ""
            }, 
            "tenancy": "default", 
            "virtualization_type": "hvm"
        }
    ], 
    "tagged_instances": []
}

TASK [remove the serialized host variables] ************************************
task path: /var/lib/jenkins/origin-ci-tool/7a5c5e83c372ad2e6b3b64b3efa16fe2cb37ef83/lib/python2.7/site-packages/oct/ansible/oct/playbooks/deprovision/roles/aws-down/tasks/main.yml:22
changed: [localhost] => {
    "changed": true, 
    "generated_timestamp": "2018-05-21 04:45:07.717555", 
    "path": "/var/lib/jenkins/jobs/test_pull_request_origin_integration/workspace/.config/origin-ci-tool/inventory/host_vars/172.18.14.205.yml", 
    "state": "absent"
}

PLAY [deprovision virtual hosts locally manged by Vagrant] *********************

TASK [Gathering Facts] *********************************************************
ok: [localhost]

PLAY [clean up local configuration for deprovisioned instances] ****************

TASK [remove inventory configuration directory] ********************************
task path: /var/lib/jenkins/origin-ci-tool/7a5c5e83c372ad2e6b3b64b3efa16fe2cb37ef83/lib/python2.7/site-packages/oct/ansible/oct/playbooks/deprovision/main.yml:61
changed: [localhost] => {
    "changed": true, 
    "generated_timestamp": "2018-05-21 04:45:08.191057", 
    "path": "/var/lib/jenkins/jobs/test_pull_request_origin_integration/workspace/.config/origin-ci-tool/inventory", 
    "state": "absent"
}

PLAY RECAP *********************************************************************
localhost                  : ok=8    changed=4    unreachable=0    failed=0   

+ set +o xtrace
########## FINISHED STAGE: SUCCESS: DEPROVISION CLOUD RESOURCES [00h 00m 05s] ##########
Archiving artifacts
[BFA] Scanning build for known causes...
[BFA] Found failure cause(s):
[BFA] Job Stage Failed
[BFA] Done. 0s
[WS-CLEANUP] Deleting project workspace...[WS-CLEANUP] done
Finished: FAILURE