Console Output

Started by user OpenShift CI Robot
[EnvInject] - Loading node environment variables.
Building in workspace /var/lib/jenkins/jobs/test_pull_request_origin_integration/workspace
[WS-CLEANUP] Deleting project workspace...
[workspace] $ /bin/bash /tmp/jenkins4497918857833176893.sh
########## STARTING STAGE: INSTALL THE ORIGIN-CI-TOOL ##########
+ [[ -s /var/lib/jenkins/jobs/test_pull_request_origin_integration/workspace/activate ]]
++ readlink /var/lib/jenkins/origin-ci-tool/latest
+ latest=/var/lib/jenkins/origin-ci-tool/7a5c5e83c372ad2e6b3b64b3efa16fe2cb37ef83
+ touch /var/lib/jenkins/origin-ci-tool/7a5c5e83c372ad2e6b3b64b3efa16fe2cb37ef83
+ cp /var/lib/jenkins/origin-ci-tool/7a5c5e83c372ad2e6b3b64b3efa16fe2cb37ef83/bin/activate /var/lib/jenkins/jobs/test_pull_request_origin_integration/workspace/activate
+ cat
+ source /var/lib/jenkins/jobs/test_pull_request_origin_integration/workspace/activate
++ export VIRTUAL_ENV=/var/lib/jenkins/origin-ci-tool/7a5c5e83c372ad2e6b3b64b3efa16fe2cb37ef83
++ VIRTUAL_ENV=/var/lib/jenkins/origin-ci-tool/7a5c5e83c372ad2e6b3b64b3efa16fe2cb37ef83
++ export PATH=/var/lib/jenkins/origin-ci-tool/7a5c5e83c372ad2e6b3b64b3efa16fe2cb37ef83/bin:/sbin:/usr/sbin:/bin:/usr/bin
++ PATH=/var/lib/jenkins/origin-ci-tool/7a5c5e83c372ad2e6b3b64b3efa16fe2cb37ef83/bin:/sbin:/usr/sbin:/bin:/usr/bin
++ unset PYTHON_HOME
++ export OCT_CONFIG_HOME=/var/lib/jenkins/jobs/test_pull_request_origin_integration/workspace/.config
++ OCT_CONFIG_HOME=/var/lib/jenkins/jobs/test_pull_request_origin_integration/workspace/.config
+ mkdir -p /var/lib/jenkins/jobs/test_pull_request_origin_integration/workspace/.config
+ rm -rf /var/lib/jenkins/jobs/test_pull_request_origin_integration/workspace/.config/origin-ci-tool
+ oct configure ansible-client verbosity 2
Option verbosity updated to be 2.
+ oct configure aws-client keypair_name libra
Option keypair_name updated to be libra.
+ oct configure aws-client private_key_path /var/lib/jenkins/.ssh/devenv.pem
Option private_key_path updated to be /var/lib/jenkins/.ssh/devenv.pem.
+ set +o xtrace
########## FINISHED STAGE: SUCCESS: INSTALL THE ORIGIN-CI-TOOL [00h 00m 01s] ##########
[workspace] $ /bin/bash /tmp/jenkins8678681406766157399.sh
########## STARTING STAGE: PROVISION CLOUD RESOURCES ##########
+ [[ -s /var/lib/jenkins/jobs/test_pull_request_origin_integration/workspace/activate ]]
+ source /var/lib/jenkins/jobs/test_pull_request_origin_integration/workspace/activate
++ export VIRTUAL_ENV=/var/lib/jenkins/origin-ci-tool/7a5c5e83c372ad2e6b3b64b3efa16fe2cb37ef83
++ VIRTUAL_ENV=/var/lib/jenkins/origin-ci-tool/7a5c5e83c372ad2e6b3b64b3efa16fe2cb37ef83
++ export PATH=/var/lib/jenkins/origin-ci-tool/7a5c5e83c372ad2e6b3b64b3efa16fe2cb37ef83/bin:/sbin:/usr/sbin:/bin:/usr/bin
++ PATH=/var/lib/jenkins/origin-ci-tool/7a5c5e83c372ad2e6b3b64b3efa16fe2cb37ef83/bin:/sbin:/usr/sbin:/bin:/usr/bin
++ unset PYTHON_HOME
++ export OCT_CONFIG_HOME=/var/lib/jenkins/jobs/test_pull_request_origin_integration/workspace/.config
++ OCT_CONFIG_HOME=/var/lib/jenkins/jobs/test_pull_request_origin_integration/workspace/.config
+ oct provision remote all-in-one --os rhel --stage base --provider aws --discrete-ssh-config --name test_pull_request_origin_integration_17972

PLAYBOOK: aws-up.yml ***********************************************************
2 plays in /var/lib/jenkins/origin-ci-tool/7a5c5e83c372ad2e6b3b64b3efa16fe2cb37ef83/lib/python2.7/site-packages/oct/ansible/oct/playbooks/provision/aws-up.yml

PLAY [ensure we have the parameters necessary to bring up the AWS EC2 instance] ***

TASK [ensure all required variables are set] ***********************************
task path: /var/lib/jenkins/origin-ci-tool/7a5c5e83c372ad2e6b3b64b3efa16fe2cb37ef83/lib/python2.7/site-packages/oct/ansible/oct/playbooks/provision/aws-up.yml:9
skipping: [localhost] => (item=origin_ci_inventory_dir)  => {
    "changed": false, 
    "generated_timestamp": "2018-05-21 04:59:31.617566", 
    "item": "origin_ci_inventory_dir", 
    "skip_reason": "Conditional check failed", 
    "skipped": true
}
skipping: [localhost] => (item=origin_ci_aws_keypair_name)  => {
    "changed": false, 
    "generated_timestamp": "2018-05-21 04:59:31.620148", 
    "item": "origin_ci_aws_keypair_name", 
    "skip_reason": "Conditional check failed", 
    "skipped": true
}
skipping: [localhost] => (item=origin_ci_aws_private_key_path)  => {
    "changed": false, 
    "generated_timestamp": "2018-05-21 04:59:31.624521", 
    "item": "origin_ci_aws_private_key_path", 
    "skip_reason": "Conditional check failed", 
    "skipped": true
}
skipping: [localhost] => (item=origin_ci_aws_region)  => {
    "changed": false, 
    "generated_timestamp": "2018-05-21 04:59:31.627686", 
    "item": "origin_ci_aws_region", 
    "skip_reason": "Conditional check failed", 
    "skipped": true
}
skipping: [localhost] => (item=origin_ci_aws_ami_tags)  => {
    "changed": false, 
    "generated_timestamp": "2018-05-21 04:59:31.633373", 
    "item": "origin_ci_aws_ami_tags", 
    "skip_reason": "Conditional check failed", 
    "skipped": true
}
skipping: [localhost] => (item=origin_ci_aws_instance_name)  => {
    "changed": false, 
    "generated_timestamp": "2018-05-21 04:59:31.636509", 
    "item": "origin_ci_aws_instance_name", 
    "skip_reason": "Conditional check failed", 
    "skipped": true
}
skipping: [localhost] => (item=origin_ci_aws_master_instance_type)  => {
    "changed": false, 
    "generated_timestamp": "2018-05-21 04:59:31.640758", 
    "item": "origin_ci_aws_master_instance_type", 
    "skip_reason": "Conditional check failed", 
    "skipped": true
}
skipping: [localhost] => (item=origin_ci_aws_identifying_tag_key)  => {
    "changed": false, 
    "generated_timestamp": "2018-05-21 04:59:31.643842", 
    "item": "origin_ci_aws_identifying_tag_key", 
    "skip_reason": "Conditional check failed", 
    "skipped": true
}
skipping: [localhost] => (item=origin_ci_aws_hostname)  => {
    "changed": false, 
    "generated_timestamp": "2018-05-21 04:59:31.648102", 
    "item": "origin_ci_aws_hostname", 
    "skip_reason": "Conditional check failed", 
    "skipped": true
}
skipping: [localhost] => (item=origin_ci_ssh_config_strategy)  => {
    "changed": false, 
    "generated_timestamp": "2018-05-21 04:59:31.651240", 
    "item": "origin_ci_ssh_config_strategy", 
    "skip_reason": "Conditional check failed", 
    "skipped": true
}
skipping: [localhost] => (item=openshift_schedulable)  => {
    "changed": false, 
    "generated_timestamp": "2018-05-21 04:59:31.655566", 
    "item": "openshift_schedulable", 
    "skip_reason": "Conditional check failed", 
    "skipped": true
}
skipping: [localhost] => (item=openshift_node_labels)  => {
    "changed": false, 
    "generated_timestamp": "2018-05-21 04:59:31.659377", 
    "item": "openshift_node_labels", 
    "skip_reason": "Conditional check failed", 
    "skipped": true
}

TASK [ensure all required variables are set] ***********************************
task path: /var/lib/jenkins/origin-ci-tool/7a5c5e83c372ad2e6b3b64b3efa16fe2cb37ef83/lib/python2.7/site-packages/oct/ansible/oct/playbooks/provision/aws-up.yml:27
skipping: [localhost] => (item=origin_ci_aws_master_subnet)  => {
    "changed": false, 
    "generated_timestamp": "2018-05-21 04:59:31.699356", 
    "item": "origin_ci_aws_master_subnet", 
    "skip_reason": "Conditional check failed", 
    "skipped": true
}
skipping: [localhost] => (item=origin_ci_aws_etcd_security_group)  => {
    "changed": false, 
    "generated_timestamp": "2018-05-21 04:59:31.704569", 
    "item": "origin_ci_aws_etcd_security_group", 
    "skip_reason": "Conditional check failed", 
    "skipped": true
}
skipping: [localhost] => (item=origin_ci_aws_node_security_group)  => {
    "changed": false, 
    "generated_timestamp": "2018-05-21 04:59:31.709983", 
    "item": "origin_ci_aws_node_security_group", 
    "skip_reason": "Conditional check failed", 
    "skipped": true
}
skipping: [localhost] => (item=origin_ci_aws_master_security_group)  => {
    "changed": false, 
    "generated_timestamp": "2018-05-21 04:59:31.715457", 
    "item": "origin_ci_aws_master_security_group", 
    "skip_reason": "Conditional check failed", 
    "skipped": true
}
skipping: [localhost] => (item=origin_ci_aws_master_external_elb_security_group)  => {
    "changed": false, 
    "generated_timestamp": "2018-05-21 04:59:31.720874", 
    "item": "origin_ci_aws_master_external_elb_security_group", 
    "skip_reason": "Conditional check failed", 
    "skipped": true
}
skipping: [localhost] => (item=origin_ci_aws_master_internal_elb_security_group)  => {
    "changed": false, 
    "generated_timestamp": "2018-05-21 04:59:31.726320", 
    "item": "origin_ci_aws_master_internal_elb_security_group", 
    "skip_reason": "Conditional check failed", 
    "skipped": true
}
skipping: [localhost] => (item=origin_ci_aws_router_security_group)  => {
    "changed": false, 
    "generated_timestamp": "2018-05-21 04:59:31.731774", 
    "item": "origin_ci_aws_router_security_group", 
    "skip_reason": "Conditional check failed", 
    "skipped": true
}
skipping: [localhost] => (item=origin_ci_aws_router_elb_security_group)  => {
    "changed": false, 
    "generated_timestamp": "2018-05-21 04:59:31.738085", 
    "item": "origin_ci_aws_router_elb_security_group", 
    "skip_reason": "Conditional check failed", 
    "skipped": true
}

PLAY [provision an AWS EC2 instance] *******************************************

TASK [Gathering Facts] *********************************************************
ok: [localhost]

TASK [inventory : initialize the inventory directory] **************************
task path: /var/lib/jenkins/origin-ci-tool/7a5c5e83c372ad2e6b3b64b3efa16fe2cb37ef83/lib/python2.7/site-packages/oct/ansible/oct/playbooks/provision/roles/inventory/tasks/main.yml:2
ok: [localhost] => {
    "changed": false, 
    "generated_timestamp": "2018-05-21 04:59:32.512222", 
    "gid": 995, 
    "group": "jenkins", 
    "mode": "0755", 
    "owner": "jenkins", 
    "path": "/var/lib/jenkins/jobs/test_pull_request_origin_integration/workspace/.config/origin-ci-tool/inventory", 
    "secontext": "system_u:object_r:var_lib_t:s0", 
    "size": 6, 
    "state": "directory", 
    "uid": 997
}

TASK [inventory : add the nested group mapping] ********************************
task path: /var/lib/jenkins/origin-ci-tool/7a5c5e83c372ad2e6b3b64b3efa16fe2cb37ef83/lib/python2.7/site-packages/oct/ansible/oct/playbooks/provision/roles/inventory/tasks/main.yml:7
changed: [localhost] => {
    "changed": true, 
    "checksum": "18aaee00994df38cc3a63b635893175235331a9c", 
    "dest": "/var/lib/jenkins/jobs/test_pull_request_origin_integration/workspace/.config/origin-ci-tool/inventory/nested_group_mappings", 
    "generated_timestamp": "2018-05-21 04:59:32.992469", 
    "gid": 995, 
    "group": "jenkins", 
    "md5sum": "b30c3226ea63efa3ff9c5e346c14a16e", 
    "mode": "0644", 
    "owner": "jenkins", 
    "secontext": "system_u:object_r:var_lib_t:s0", 
    "size": 93, 
    "src": "/var/lib/jenkins/.ansible/tmp/ansible-tmp-1526893172.76-54168225687145/source", 
    "state": "file", 
    "uid": 997
}

TASK [inventory : initialize the OSEv3 group variables directory] **************
task path: /var/lib/jenkins/origin-ci-tool/7a5c5e83c372ad2e6b3b64b3efa16fe2cb37ef83/lib/python2.7/site-packages/oct/ansible/oct/playbooks/provision/roles/inventory/tasks/main.yml:12
changed: [localhost] => {
    "changed": true, 
    "generated_timestamp": "2018-05-21 04:59:33.162418", 
    "gid": 995, 
    "group": "jenkins", 
    "mode": "0755", 
    "owner": "jenkins", 
    "path": "/var/lib/jenkins/jobs/test_pull_request_origin_integration/workspace/.config/origin-ci-tool/inventory/group_vars/OSEv3", 
    "secontext": "system_u:object_r:var_lib_t:s0", 
    "size": 6, 
    "state": "directory", 
    "uid": 997
}

TASK [inventory : initialize the host variables directory] *********************
task path: /var/lib/jenkins/origin-ci-tool/7a5c5e83c372ad2e6b3b64b3efa16fe2cb37ef83/lib/python2.7/site-packages/oct/ansible/oct/playbooks/provision/roles/inventory/tasks/main.yml:17
changed: [localhost] => {
    "changed": true, 
    "generated_timestamp": "2018-05-21 04:59:33.337777", 
    "gid": 995, 
    "group": "jenkins", 
    "mode": "0755", 
    "owner": "jenkins", 
    "path": "/var/lib/jenkins/jobs/test_pull_request_origin_integration/workspace/.config/origin-ci-tool/inventory/host_vars", 
    "secontext": "system_u:object_r:var_lib_t:s0", 
    "size": 6, 
    "state": "directory", 
    "uid": 997
}

TASK [inventory : add the default Origin installation configuration] ***********
task path: /var/lib/jenkins/origin-ci-tool/7a5c5e83c372ad2e6b3b64b3efa16fe2cb37ef83/lib/python2.7/site-packages/oct/ansible/oct/playbooks/provision/roles/inventory/tasks/main.yml:22
changed: [localhost] => {
    "changed": true, 
    "checksum": "4c06ba508f055c20f13426e8587342e8765a7b66", 
    "dest": "/var/lib/jenkins/jobs/test_pull_request_origin_integration/workspace/.config/origin-ci-tool/inventory/group_vars/OSEv3/general.yml", 
    "generated_timestamp": "2018-05-21 04:59:33.644340", 
    "gid": 995, 
    "group": "jenkins", 
    "md5sum": "8aec71c75f7d512b278ae7c6f2959b12", 
    "mode": "0644", 
    "owner": "jenkins", 
    "secontext": "system_u:object_r:var_lib_t:s0", 
    "size": 331, 
    "src": "/var/lib/jenkins/.ansible/tmp/ansible-tmp-1526893173.5-105329880884/source", 
    "state": "file", 
    "uid": 997
}

TASK [aws-up : determine if we are inside AWS EC2] *****************************
task path: /var/lib/jenkins/origin-ci-tool/7a5c5e83c372ad2e6b3b64b3efa16fe2cb37ef83/lib/python2.7/site-packages/oct/ansible/oct/playbooks/provision/roles/aws-up/tasks/main.yml:2
changed: [localhost] => {
    "changed": true, 
    "cmd": [
        "curl", 
        "-s", 
        "http://instance-data.ec2.internal"
    ], 
    "delta": "0:00:00.012016", 
    "end": "2018-05-21 04:59:33.874963", 
    "failed": false, 
    "failed_when_result": false, 
    "generated_timestamp": "2018-05-21 04:59:33.891187", 
    "rc": 0, 
    "start": "2018-05-21 04:59:33.862947", 
    "stderr": [], 
    "stdout": [
        "1.0", 
        "2007-01-19", 
        "2007-03-01", 
        "2007-08-29", 
        "2007-10-10", 
        "2007-12-15", 
        "2008-02-01", 
        "2008-09-01", 
        "2009-04-04", 
        "2011-01-01", 
        "2011-05-01", 
        "2012-01-12", 
        "2014-02-25", 
        "2014-11-05", 
        "2015-10-20", 
        "2016-04-19", 
        "2016-06-30", 
        "2016-09-02", 
        "latest"
    ], 
    "warnings": [
        "Consider using get_url or uri module rather than running curl"
    ]
}
 [WARNING]: Consider using get_url or uri module rather than running curl

TASK [aws-up : configure EC2 parameters for inventory when controlling from inside EC2] ***
task path: /var/lib/jenkins/origin-ci-tool/7a5c5e83c372ad2e6b3b64b3efa16fe2cb37ef83/lib/python2.7/site-packages/oct/ansible/oct/playbooks/provision/roles/aws-up/tasks/main.yml:7
ok: [localhost] => {
    "ansible_facts": {
        "origin_ci_aws_destination_variable": "private_dns_name", 
        "origin_ci_aws_host_address_variable": "private_ip", 
        "origin_ci_aws_vpc_destination_variable": "private_ip_address"
    }, 
    "changed": false, 
    "generated_timestamp": "2018-05-21 04:59:33.933470"
}

TASK [aws-up : determine where to put the AWS API cache] ***********************
task path: /var/lib/jenkins/origin-ci-tool/7a5c5e83c372ad2e6b3b64b3efa16fe2cb37ef83/lib/python2.7/site-packages/oct/ansible/oct/playbooks/provision/roles/aws-up/tasks/main.yml:14
ok: [localhost] => {
    "ansible_facts": {
        "origin_ci_aws_cache_dir": "/var/lib/jenkins/jobs/test_pull_request_origin_integration/workspace/.config/origin-ci-tool/inventory/.ec2_cache"
    }, 
    "changed": false, 
    "generated_timestamp": "2018-05-21 04:59:33.972061"
}

TASK [aws-up : ensure we have a place to put the AWS API cache] ****************
task path: /var/lib/jenkins/origin-ci-tool/7a5c5e83c372ad2e6b3b64b3efa16fe2cb37ef83/lib/python2.7/site-packages/oct/ansible/oct/playbooks/provision/roles/aws-up/tasks/main.yml:18
changed: [localhost] => {
    "changed": true, 
    "generated_timestamp": "2018-05-21 04:59:34.142522", 
    "gid": 995, 
    "group": "jenkins", 
    "mode": "0755", 
    "owner": "jenkins", 
    "path": "/var/lib/jenkins/jobs/test_pull_request_origin_integration/workspace/.config/origin-ci-tool/inventory/.ec2_cache", 
    "secontext": "system_u:object_r:var_lib_t:s0", 
    "size": 6, 
    "state": "directory", 
    "uid": 997
}

TASK [aws-up : place the EC2 dynamic inventory script] *************************
task path: /var/lib/jenkins/origin-ci-tool/7a5c5e83c372ad2e6b3b64b3efa16fe2cb37ef83/lib/python2.7/site-packages/oct/ansible/oct/playbooks/provision/roles/aws-up/tasks/main.yml:23
changed: [localhost] => {
    "changed": true, 
    "checksum": "625b8af723189db3b96ba0026d0f997a0025bc47", 
    "dest": "/var/lib/jenkins/jobs/test_pull_request_origin_integration/workspace/.config/origin-ci-tool/inventory/ec2.py", 
    "generated_timestamp": "2018-05-21 04:59:34.450646", 
    "gid": 995, 
    "group": "jenkins", 
    "md5sum": "cac06c14065dac74904232b89d4ba24c", 
    "mode": "0755", 
    "owner": "jenkins", 
    "secontext": "system_u:object_r:var_lib_t:s0", 
    "size": 63725, 
    "src": "/var/lib/jenkins/.ansible/tmp/ansible-tmp-1526893174.31-159879848106716/source", 
    "state": "file", 
    "uid": 997
}

TASK [aws-up : place the EC2 dynamic inventory configuration] ******************
task path: /var/lib/jenkins/origin-ci-tool/7a5c5e83c372ad2e6b3b64b3efa16fe2cb37ef83/lib/python2.7/site-packages/oct/ansible/oct/playbooks/provision/roles/aws-up/tasks/main.yml:29
changed: [localhost] => {
    "changed": true, 
    "checksum": "89dde820b4d462554c135053d9f59b1b00ae65e4", 
    "dest": "/var/lib/jenkins/jobs/test_pull_request_origin_integration/workspace/.config/origin-ci-tool/inventory/ec2.ini", 
    "generated_timestamp": "2018-05-21 04:59:34.756248", 
    "gid": 995, 
    "group": "jenkins", 
    "md5sum": "18c0946c324a59cc4a21a4f274a2d40e", 
    "mode": "0644", 
    "owner": "jenkins", 
    "secontext": "system_u:object_r:var_lib_t:s0", 
    "size": 397, 
    "src": "/var/lib/jenkins/.ansible/tmp/ansible-tmp-1526893174.49-242142463711697/source", 
    "state": "file", 
    "uid": 997
}

TASK [aws-up : place the EC2 tag to group mappings] ****************************
task path: /var/lib/jenkins/origin-ci-tool/7a5c5e83c372ad2e6b3b64b3efa16fe2cb37ef83/lib/python2.7/site-packages/oct/ansible/oct/playbooks/provision/roles/aws-up/tasks/main.yml:34
changed: [localhost] => {
    "changed": true, 
    "checksum": "b4205a33dc73f62bd4f77f35d045cf8e09ae62b0", 
    "dest": "/var/lib/jenkins/jobs/test_pull_request_origin_integration/workspace/.config/origin-ci-tool/inventory/tag_to_group_mappings", 
    "generated_timestamp": "2018-05-21 04:59:35.063545", 
    "gid": 995, 
    "group": "jenkins", 
    "md5sum": "bc3a567a1b6f342e1005182efc1b66be", 
    "mode": "0644", 
    "owner": "jenkins", 
    "secontext": "system_u:object_r:var_lib_t:s0", 
    "size": 287, 
    "src": "/var/lib/jenkins/.ansible/tmp/ansible-tmp-1526893174.92-20473676087676/source", 
    "state": "file", 
    "uid": 997
}

TASK [aws-up : list available AMIs] ********************************************
task path: /var/lib/jenkins/origin-ci-tool/7a5c5e83c372ad2e6b3b64b3efa16fe2cb37ef83/lib/python2.7/site-packages/oct/ansible/oct/playbooks/provision/roles/aws-up/tasks/main.yml:40
ok: [localhost] => {
    "changed": false, 
    "generated_timestamp": "2018-05-21 04:59:39.201296", 
    "results": [
        {
            "ami_id": "ami-0b00212ef9a4711c6", 
            "architecture": "x86_64", 
            "block_device_mapping": {
                "/dev/sda1": {
                    "delete_on_termination": true, 
                    "encrypted": false, 
                    "size": 75, 
                    "snapshot_id": "snap-025f30e04944d7765", 
                    "volume_type": "gp2"
                }, 
                "/dev/sdb": {
                    "delete_on_termination": true, 
                    "encrypted": false, 
                    "size": 50, 
                    "snapshot_id": "snap-05a9e7592d6fd1ff4", 
                    "volume_type": "gp2"
                }
            }, 
            "creationDate": "2018-04-23T19:08:06.000Z", 
            "description": "OpenShift Origin development AMI on rhel at the base stage.", 
            "hypervisor": "xen", 
            "is_public": false, 
            "location": "531415883065/ami_build_origin_int_rhel_base_627", 
            "name": "ami_build_origin_int_rhel_base_627", 
            "owner_id": "531415883065", 
            "platform": null, 
            "root_device_name": "/dev/sda1", 
            "root_device_type": "ebs", 
            "state": "available", 
            "tags": {
                "Name": "ami_build_origin_int_rhel_base_627", 
                "image_stage": "base", 
                "operating_system": "rhel", 
                "ready": "yes"
            }, 
            "virtualization_type": "hvm"
        }, 
        {
            "ami_id": "ami-0f07d2d9a03af96ec", 
            "architecture": "x86_64", 
            "block_device_mapping": {
                "/dev/sda1": {
                    "delete_on_termination": true, 
                    "encrypted": false, 
                    "size": 75, 
                    "snapshot_id": "snap-063172dcf238655bb", 
                    "volume_type": "gp2"
                }, 
                "/dev/sdb": {
                    "delete_on_termination": true, 
                    "encrypted": false, 
                    "size": 50, 
                    "snapshot_id": "snap-099109686bab2eed3", 
                    "volume_type": "gp2"
                }
            }, 
            "creationDate": "2018-05-09T18:01:02.000Z", 
            "description": "OpenShift Origin development AMI on rhel at the base stage.", 
            "hypervisor": "xen", 
            "is_public": false, 
            "location": "531415883065/ami_build_origin_int_rhel_base_630", 
            "name": "ami_build_origin_int_rhel_base_630", 
            "owner_id": "531415883065", 
            "platform": null, 
            "root_device_name": "/dev/sda1", 
            "root_device_type": "ebs", 
            "state": "available", 
            "tags": {
                "Name": "ami_build_origin_int_rhel_base_630", 
                "image_stage": "base", 
                "operating_system": "rhel", 
                "ready": "yes"
            }, 
            "virtualization_type": "hvm"
        }
    ]
}

TASK [aws-up : choose appropriate AMIs for use] ********************************
task path: /var/lib/jenkins/origin-ci-tool/7a5c5e83c372ad2e6b3b64b3efa16fe2cb37ef83/lib/python2.7/site-packages/oct/ansible/oct/playbooks/provision/roles/aws-up/tasks/main.yml:49
ok: [localhost] => (item={u'ami_id': u'ami-0b00212ef9a4711c6', u'root_device_type': u'ebs', u'description': u'OpenShift Origin development AMI on rhel at the base stage.', u'tags': {u'ready': u'yes', u'operating_system': u'rhel', u'image_stage': u'base', u'Name': u'ami_build_origin_int_rhel_base_627'}, u'hypervisor': u'xen', u'block_device_mapping': {u'/dev/sdb': {u'encrypted': False, u'snapshot_id': u'snap-05a9e7592d6fd1ff4', u'delete_on_termination': True, u'volume_type': u'gp2', u'size': 50}, u'/dev/sda1': {u'encrypted': False, u'snapshot_id': u'snap-025f30e04944d7765', u'delete_on_termination': True, u'volume_type': u'gp2', u'size': 75}}, u'architecture': u'x86_64', u'owner_id': u'531415883065', u'platform': None, u'state': u'available', u'location': u'531415883065/ami_build_origin_int_rhel_base_627', u'is_public': False, u'creationDate': u'2018-04-23T19:08:06.000Z', u'root_device_name': u'/dev/sda1', u'virtualization_type': u'hvm', u'name': u'ami_build_origin_int_rhel_base_627'}) => {
    "ansible_facts": {
        "origin_ci_aws_ami_id_candidate": "ami-0b00212ef9a4711c6"
    }, 
    "changed": false, 
    "generated_timestamp": "2018-05-21 04:59:39.254174", 
    "item": {
        "ami_id": "ami-0b00212ef9a4711c6", 
        "architecture": "x86_64", 
        "block_device_mapping": {
            "/dev/sda1": {
                "delete_on_termination": true, 
                "encrypted": false, 
                "size": 75, 
                "snapshot_id": "snap-025f30e04944d7765", 
                "volume_type": "gp2"
            }, 
            "/dev/sdb": {
                "delete_on_termination": true, 
                "encrypted": false, 
                "size": 50, 
                "snapshot_id": "snap-05a9e7592d6fd1ff4", 
                "volume_type": "gp2"
            }
        }, 
        "creationDate": "2018-04-23T19:08:06.000Z", 
        "description": "OpenShift Origin development AMI on rhel at the base stage.", 
        "hypervisor": "xen", 
        "is_public": false, 
        "location": "531415883065/ami_build_origin_int_rhel_base_627", 
        "name": "ami_build_origin_int_rhel_base_627", 
        "owner_id": "531415883065", 
        "platform": null, 
        "root_device_name": "/dev/sda1", 
        "root_device_type": "ebs", 
        "state": "available", 
        "tags": {
            "Name": "ami_build_origin_int_rhel_base_627", 
            "image_stage": "base", 
            "operating_system": "rhel", 
            "ready": "yes"
        }, 
        "virtualization_type": "hvm"
    }
}
ok: [localhost] => (item={u'ami_id': u'ami-0f07d2d9a03af96ec', u'root_device_type': u'ebs', u'description': u'OpenShift Origin development AMI on rhel at the base stage.', u'tags': {u'ready': u'yes', u'operating_system': u'rhel', u'image_stage': u'base', u'Name': u'ami_build_origin_int_rhel_base_630'}, u'hypervisor': u'xen', u'block_device_mapping': {u'/dev/sdb': {u'encrypted': False, u'snapshot_id': u'snap-099109686bab2eed3', u'delete_on_termination': True, u'volume_type': u'gp2', u'size': 50}, u'/dev/sda1': {u'encrypted': False, u'snapshot_id': u'snap-063172dcf238655bb', u'delete_on_termination': True, u'volume_type': u'gp2', u'size': 75}}, u'architecture': u'x86_64', u'owner_id': u'531415883065', u'platform': None, u'state': u'available', u'location': u'531415883065/ami_build_origin_int_rhel_base_630', u'is_public': False, u'creationDate': u'2018-05-09T18:01:02.000Z', u'root_device_name': u'/dev/sda1', u'virtualization_type': u'hvm', u'name': u'ami_build_origin_int_rhel_base_630'}) => {
    "ansible_facts": {
        "origin_ci_aws_ami_id_candidate": "ami-0f07d2d9a03af96ec"
    }, 
    "changed": false, 
    "generated_timestamp": "2018-05-21 04:59:39.260505", 
    "item": {
        "ami_id": "ami-0f07d2d9a03af96ec", 
        "architecture": "x86_64", 
        "block_device_mapping": {
            "/dev/sda1": {
                "delete_on_termination": true, 
                "encrypted": false, 
                "size": 75, 
                "snapshot_id": "snap-063172dcf238655bb", 
                "volume_type": "gp2"
            }, 
            "/dev/sdb": {
                "delete_on_termination": true, 
                "encrypted": false, 
                "size": 50, 
                "snapshot_id": "snap-099109686bab2eed3", 
                "volume_type": "gp2"
            }
        }, 
        "creationDate": "2018-05-09T18:01:02.000Z", 
        "description": "OpenShift Origin development AMI on rhel at the base stage.", 
        "hypervisor": "xen", 
        "is_public": false, 
        "location": "531415883065/ami_build_origin_int_rhel_base_630", 
        "name": "ami_build_origin_int_rhel_base_630", 
        "owner_id": "531415883065", 
        "platform": null, 
        "root_device_name": "/dev/sda1", 
        "root_device_type": "ebs", 
        "state": "available", 
        "tags": {
            "Name": "ami_build_origin_int_rhel_base_630", 
            "image_stage": "base", 
            "operating_system": "rhel", 
            "ready": "yes"
        }, 
        "virtualization_type": "hvm"
    }
}

TASK [aws-up : determine which AMI to use] *************************************
task path: /var/lib/jenkins/origin-ci-tool/7a5c5e83c372ad2e6b3b64b3efa16fe2cb37ef83/lib/python2.7/site-packages/oct/ansible/oct/playbooks/provision/roles/aws-up/tasks/main.yml:55
ok: [localhost] => {
    "ansible_facts": {
        "origin_ci_aws_ami_id": "ami-0f07d2d9a03af96ec"
    }, 
    "changed": false, 
    "generated_timestamp": "2018-05-21 04:59:39.303069"
}

TASK [aws-up : determine which subnets are available] **************************
task path: /var/lib/jenkins/origin-ci-tool/7a5c5e83c372ad2e6b3b64b3efa16fe2cb37ef83/lib/python2.7/site-packages/oct/ansible/oct/playbooks/provision/roles/aws-up/tasks/main.yml:60
ok: [localhost] => {
    "changed": false, 
    "generated_timestamp": "2018-05-21 04:59:39.846890", 
    "subnets": [
        {
            "availability_zone": "us-east-1d", 
            "available_ip_address_count": 3742, 
            "cidr_block": "172.18.0.0/20", 
            "default_for_az": "false", 
            "id": "subnet-cf57c596", 
            "map_public_ip_on_launch": "true", 
            "state": "available", 
            "tags": {
                "Name": "devenv-subnet-1", 
                "origin_ci_aws_cluster_component": "master_subnet"
            }, 
            "vpc_id": "vpc-69705d0c"
        }, 
        {
            "availability_zone": "us-east-1c", 
            "available_ip_address_count": 4075, 
            "cidr_block": "172.18.16.0/20", 
            "default_for_az": "false", 
            "id": "subnet-8bdb5ac2", 
            "map_public_ip_on_launch": "true", 
            "state": "available", 
            "tags": {
                "Name": "devenv-subnet-2", 
                "origin_ci_aws_cluster_component": "master_subnet"
            }, 
            "vpc_id": "vpc-69705d0c"
        }
    ]
}

TASK [aws-up : determine which subnets to use for the master] ******************
task path: /var/lib/jenkins/origin-ci-tool/7a5c5e83c372ad2e6b3b64b3efa16fe2cb37ef83/lib/python2.7/site-packages/oct/ansible/oct/playbooks/provision/roles/aws-up/tasks/main.yml:67
ok: [localhost] => {
    "ansible_facts": {
        "origin_ci_aws_master_subnet_ids": [
            "subnet-cf57c596", 
            "subnet-8bdb5ac2"
        ]
    }, 
    "changed": false, 
    "generated_timestamp": "2018-05-21 04:59:39.890430"
}

TASK [aws-up : determine which security groups are available] ******************
task path: /var/lib/jenkins/origin-ci-tool/7a5c5e83c372ad2e6b3b64b3efa16fe2cb37ef83/lib/python2.7/site-packages/oct/ansible/oct/playbooks/provision/roles/aws-up/tasks/main.yml:72
ok: [localhost] => {
    "changed": false, 
    "generated_timestamp": "2018-05-21 04:59:40.618732", 
    "security_groups": [
        {
            "description": "default VPC security group", 
            "group_id": "sg-7e73221a", 
            "group_name": "default", 
            "ip_permissions": [
                {
                    "ip_protocol": "-1", 
                    "ip_ranges": [], 
                    "ipv6_ranges": [], 
                    "prefix_list_ids": [], 
                    "user_id_group_pairs": [
                        {
                            "group_id": "sg-7e73221a", 
                            "user_id": "531415883065"
                        }
                    ]
                }, 
                {
                    "from_port": 80, 
                    "ip_protocol": "tcp", 
                    "ip_ranges": [
                        {
                            "cidr_ip": "54.241.19.245/32"
                        }, 
                        {
                            "cidr_ip": "97.65.119.184/29"
                        }, 
                        {
                            "cidr_ip": "107.20.219.35/32"
                        }, 
                        {
                            "cidr_ip": "108.166.48.153/32"
                        }, 
                        {
                            "cidr_ip": "212.199.177.64/27"
                        }, 
                        {
                            "cidr_ip": "212.72.208.162/32"
                        }
                    ], 
                    "ipv6_ranges": [], 
                    "prefix_list_ids": [], 
                    "to_port": 443, 
                    "user_id_group_pairs": []
                }, 
                {
                    "from_port": 53, 
                    "ip_protocol": "tcp", 
                    "ip_ranges": [
                        {
                            "cidr_ip": "119.254.120.64/26"
                        }, 
                        {
                            "cidr_ip": "209.132.176.0/20"
                        }, 
                        {
                            "cidr_ip": "209.132.186.34/32"
                        }, 
                        {
                            "cidr_ip": "213.175.37.10/32"
                        }, 
                        {
                            "cidr_ip": "62.40.79.66/32"
                        }, 
                        {
                            "cidr_ip": "66.187.224.0/20"
                        }, 
                        {
                            "cidr_ip": "66.187.239.0/24"
                        }, 
                        {
                            "cidr_ip": "38.140.108.0/24"
                        }, 
                        {
                            "cidr_ip": "213.175.37.9/32"
                        }, 
                        {
                            "cidr_ip": "38.99.12.232/29"
                        }, 
                        {
                            "cidr_ip": "4.14.33.72/30"
                        }, 
                        {
                            "cidr_ip": "4.14.35.88/29"
                        }, 
                        {
                            "cidr_ip": "50.227.40.96/29"
                        }
                    ], 
                    "ipv6_ranges": [], 
                    "prefix_list_ids": [], 
                    "to_port": 8444, 
                    "user_id_group_pairs": []
                }, 
                {
                    "from_port": 22, 
                    "ip_protocol": "tcp", 
                    "ip_ranges": [
                        {
                            "cidr_ip": "0.0.0.0/0"
                        }
                    ], 
                    "ipv6_ranges": [], 
                    "prefix_list_ids": [], 
                    "to_port": 22, 
                    "user_id_group_pairs": []
                }, 
                {
                    "from_port": 53, 
                    "ip_protocol": "udp", 
                    "ip_ranges": [
                        {
                            "cidr_ip": "209.132.176.0/20"
                        }, 
                        {
                            "cidr_ip": "66.187.224.0/20"
                        }, 
                        {
                            "cidr_ip": "66.187.239.0/24"
                        }
                    ], 
                    "ipv6_ranges": [], 
                    "prefix_list_ids": [], 
                    "to_port": 53, 
                    "user_id_group_pairs": []
                }, 
                {
                    "from_port": 0, 
                    "ip_protocol": "udp", 
                    "ip_ranges": [], 
                    "ipv6_ranges": [], 
                    "prefix_list_ids": [], 
                    "to_port": 65535, 
                    "user_id_group_pairs": [
                        {
                            "group_id": "sg-0d1a5377", 
                            "user_id": "531415883065"
                        }, 
                        {
                            "group_id": "sg-5875023f", 
                            "user_id": "531415883065"
                        }, 
                        {
                            "group_id": "sg-7e73221a", 
                            "user_id": "531415883065"
                        }, 
                        {
                            "group_id": "sg-e1760186", 
                            "user_id": "531415883065"
                        }
                    ]
                }, 
                {
                    "from_port": 3389, 
                    "ip_protocol": "tcp", 
                    "ip_ranges": [
                        {
                            "cidr_ip": "0.0.0.0/0"
                        }
                    ], 
                    "ipv6_ranges": [], 
                    "prefix_list_ids": [], 
                    "to_port": 3389, 
                    "user_id_group_pairs": []
                }, 
                {
                    "from_port": -1, 
                    "ip_protocol": "icmp", 
                    "ip_ranges": [
                        {
                            "cidr_ip": "0.0.0.0/0"
                        }
                    ], 
                    "ipv6_ranges": [], 
                    "prefix_list_ids": [], 
                    "to_port": -1, 
                    "user_id_group_pairs": []
                }
            ], 
            "ip_permissions_egress": [
                {
                    "ip_protocol": "-1", 
                    "ip_ranges": [
                        {
                            "cidr_ip": "0.0.0.0/0"
                        }
                    ], 
                    "ipv6_ranges": [], 
                    "prefix_list_ids": [], 
                    "user_id_group_pairs": []
                }
            ], 
            "owner_id": "531415883065", 
            "tags": {
                "Name": "devenv-vpc", 
                "openshift_infra": "true", 
                "origin_ci_aws_cluster_component": "master_security_group"
            }, 
            "vpc_id": "vpc-69705d0c"
        }
    ]
}

TASK [aws-up : determine which security group to use] **************************
task path: /var/lib/jenkins/origin-ci-tool/7a5c5e83c372ad2e6b3b64b3efa16fe2cb37ef83/lib/python2.7/site-packages/oct/ansible/oct/playbooks/provision/roles/aws-up/tasks/main.yml:79
ok: [localhost] => {
    "ansible_facts": {
        "origin_ci_aws_master_security_group_ids": [
            "sg-7e73221a"
        ]
    }, 
    "changed": false, 
    "generated_timestamp": "2018-05-21 04:59:40.665961"
}

TASK [aws-up : provision an AWS EC2 instance] **********************************
task path: /var/lib/jenkins/origin-ci-tool/7a5c5e83c372ad2e6b3b64b3efa16fe2cb37ef83/lib/python2.7/site-packages/oct/ansible/oct/playbooks/provision/roles/aws-up/tasks/main.yml:84
changed: [localhost] => {
    "changed": true, 
    "generated_timestamp": "2018-05-21 04:59:57.018607", 
    "instance_ids": [
        "i-0a24e2df8760bfda8"
    ], 
    "instances": [
        {
            "ami_launch_index": "0", 
            "architecture": "x86_64", 
            "block_device_mapping": {
                "/dev/sda1": {
                    "delete_on_termination": true, 
                    "status": "attached", 
                    "volume_id": "vol-0caa2ad2e247bf2a0"
                }, 
                "/dev/sdb": {
                    "delete_on_termination": true, 
                    "status": "attached", 
                    "volume_id": "vol-0cccab9e3a3dd298c"
                }
            }, 
            "dns_name": "ec2-54-145-171-42.compute-1.amazonaws.com", 
            "ebs_optimized": false, 
            "groups": {
                "sg-7e73221a": "default"
            }, 
            "hypervisor": "xen", 
            "id": "i-0a24e2df8760bfda8", 
            "image_id": "ami-0f07d2d9a03af96ec", 
            "instance_type": "m4.xlarge", 
            "kernel": null, 
            "key_name": "libra", 
            "launch_time": "2018-05-21T08:59:42.000Z", 
            "placement": "us-east-1d", 
            "private_dns_name": "ip-172-18-3-174.ec2.internal", 
            "private_ip": "172.18.3.174", 
            "public_dns_name": "ec2-54-145-171-42.compute-1.amazonaws.com", 
            "public_ip": "54.145.171.42", 
            "ramdisk": null, 
            "region": "us-east-1", 
            "root_device_name": "/dev/sda1", 
            "root_device_type": "ebs", 
            "state": "running", 
            "state_code": 16, 
            "tags": {
                "Name": "test_pull_request_origin_integration_17972", 
                "openshift_etcd": "", 
                "openshift_master": "", 
                "openshift_node": ""
            }, 
            "tenancy": "default", 
            "virtualization_type": "hvm"
        }
    ], 
    "tagged_instances": []
}

TASK [aws-up : determine the host address] *************************************
task path: /var/lib/jenkins/origin-ci-tool/7a5c5e83c372ad2e6b3b64b3efa16fe2cb37ef83/lib/python2.7/site-packages/oct/ansible/oct/playbooks/provision/roles/aws-up/tasks/main.yml:110
ok: [localhost] => {
    "ansible_facts": {
        "origin_ci_aws_host": "172.18.3.174"
    }, 
    "changed": false, 
    "generated_timestamp": "2018-05-21 04:59:57.063179"
}

TASK [aws-up : determine the default user to use for SSH] **********************
task path: /var/lib/jenkins/origin-ci-tool/7a5c5e83c372ad2e6b3b64b3efa16fe2cb37ef83/lib/python2.7/site-packages/oct/ansible/oct/playbooks/provision/roles/aws-up/tasks/main.yml:114
skipping: [localhost] => {
    "changed": false, 
    "generated_timestamp": "2018-05-21 04:59:57.100565", 
    "skip_reason": "Conditional check failed", 
    "skipped": true
}

TASK [aws-up : determine the default user to use for SSH] **********************
task path: /var/lib/jenkins/origin-ci-tool/7a5c5e83c372ad2e6b3b64b3efa16fe2cb37ef83/lib/python2.7/site-packages/oct/ansible/oct/playbooks/provision/roles/aws-up/tasks/main.yml:119
ok: [localhost] => {
    "ansible_facts": {
        "origin_ci_aws_ssh_user": "origin"
    }, 
    "changed": false, 
    "generated_timestamp": "2018-05-21 04:59:57.144613"
}

TASK [aws-up : update variables for the host] **********************************
task path: /var/lib/jenkins/origin-ci-tool/7a5c5e83c372ad2e6b3b64b3efa16fe2cb37ef83/lib/python2.7/site-packages/oct/ansible/oct/playbooks/provision/roles/aws-up/tasks/main.yml:124
changed: [localhost] => {
    "changed": true, 
    "checksum": "8175ddd3fb2db367f5ed75dd683d0d2c14b93434", 
    "dest": "/var/lib/jenkins/jobs/test_pull_request_origin_integration/workspace/.config/origin-ci-tool/inventory/host_vars/172.18.3.174.yml", 
    "generated_timestamp": "2018-05-21 04:59:57.469802", 
    "gid": 995, 
    "group": "jenkins", 
    "md5sum": "f1a86e07abf286470893b582c3d3c674", 
    "mode": "0644", 
    "owner": "jenkins", 
    "secontext": "system_u:object_r:var_lib_t:s0", 
    "size": 757, 
    "src": "/var/lib/jenkins/.ansible/tmp/ansible-tmp-1526893197.32-194389922011734/source", 
    "state": "file", 
    "uid": 997
}

TASK [aws-up : determine where updated SSH configuration should go] ************
task path: /var/lib/jenkins/origin-ci-tool/7a5c5e83c372ad2e6b3b64b3efa16fe2cb37ef83/lib/python2.7/site-packages/oct/ansible/oct/playbooks/provision/roles/aws-up/tasks/main.yml:141
ok: [localhost] => {
    "ansible_facts": {
        "origin_ci_ssh_config_files": [
            "/var/lib/jenkins/jobs/test_pull_request_origin_integration/workspace/.config/origin-ci-tool/inventory/.ssh_config"
        ]
    }, 
    "changed": false, 
    "generated_timestamp": "2018-05-21 04:59:57.513216"
}

TASK [aws-up : determine where updated SSH configuration should go] ************
task path: /var/lib/jenkins/origin-ci-tool/7a5c5e83c372ad2e6b3b64b3efa16fe2cb37ef83/lib/python2.7/site-packages/oct/ansible/oct/playbooks/provision/roles/aws-up/tasks/main.yml:146
skipping: [localhost] => {
    "changed": false, 
    "generated_timestamp": "2018-05-21 04:59:57.550232", 
    "skip_reason": "Conditional check failed", 
    "skipped": true
}

TASK [aws-up : ensure the targeted SSH configuration file exists] **************
task path: /var/lib/jenkins/origin-ci-tool/7a5c5e83c372ad2e6b3b64b3efa16fe2cb37ef83/lib/python2.7/site-packages/oct/ansible/oct/playbooks/provision/roles/aws-up/tasks/main.yml:151
changed: [localhost] => (item=/var/lib/jenkins/jobs/test_pull_request_origin_integration/workspace/.config/origin-ci-tool/inventory/.ssh_config) => {
    "changed": true, 
    "dest": "/var/lib/jenkins/jobs/test_pull_request_origin_integration/workspace/.config/origin-ci-tool/inventory/.ssh_config", 
    "generated_timestamp": "2018-05-21 04:59:57.761963", 
    "gid": 995, 
    "group": "jenkins", 
    "item": "/var/lib/jenkins/jobs/test_pull_request_origin_integration/workspace/.config/origin-ci-tool/inventory/.ssh_config", 
    "mode": "0644", 
    "owner": "jenkins", 
    "secontext": "system_u:object_r:var_lib_t:s0", 
    "size": 0, 
    "state": "file", 
    "uid": 997
}

TASK [aws-up : update the SSH configuration] ***********************************
task path: /var/lib/jenkins/origin-ci-tool/7a5c5e83c372ad2e6b3b64b3efa16fe2cb37ef83/lib/python2.7/site-packages/oct/ansible/oct/playbooks/provision/roles/aws-up/tasks/main.yml:157
changed: [localhost] => (item=/var/lib/jenkins/jobs/test_pull_request_origin_integration/workspace/.config/origin-ci-tool/inventory/.ssh_config) => {
    "changed": true, 
    "generated_timestamp": "2018-05-21 04:59:58.058046", 
    "item": "/var/lib/jenkins/jobs/test_pull_request_origin_integration/workspace/.config/origin-ci-tool/inventory/.ssh_config", 
    "msg": "Block inserted"
}

TASK [aws-up : wait for SSH to be available] ***********************************
task path: /var/lib/jenkins/origin-ci-tool/7a5c5e83c372ad2e6b3b64b3efa16fe2cb37ef83/lib/python2.7/site-packages/oct/ansible/oct/playbooks/provision/roles/aws-up/tasks/main.yml:175
ok: [localhost] => {
    "changed": false, 
    "elapsed": 102, 
    "generated_timestamp": "2018-05-21 05:01:40.439117", 
    "path": null, 
    "port": 22, 
    "search_regex": null, 
    "state": "started"
}

PLAY RECAP *********************************************************************
localhost                  : ok=28   changed=13   unreachable=0    failed=0   

+ set +o xtrace
########## FINISHED STAGE: SUCCESS: PROVISION CLOUD RESOURCES [00h 02m 10s] ##########
[workspace] $ /bin/bash /tmp/jenkins4718839987720533720.sh
########## STARTING STAGE: FORWARD GCS CREDENTIALS TO REMOTE HOST ##########
+ [[ -s /var/lib/jenkins/jobs/test_pull_request_origin_integration/workspace/activate ]]
+ source /var/lib/jenkins/jobs/test_pull_request_origin_integration/workspace/activate
++ export VIRTUAL_ENV=/var/lib/jenkins/origin-ci-tool/7a5c5e83c372ad2e6b3b64b3efa16fe2cb37ef83
++ VIRTUAL_ENV=/var/lib/jenkins/origin-ci-tool/7a5c5e83c372ad2e6b3b64b3efa16fe2cb37ef83
++ export PATH=/var/lib/jenkins/origin-ci-tool/7a5c5e83c372ad2e6b3b64b3efa16fe2cb37ef83/bin:/sbin:/usr/sbin:/bin:/usr/bin
++ PATH=/var/lib/jenkins/origin-ci-tool/7a5c5e83c372ad2e6b3b64b3efa16fe2cb37ef83/bin:/sbin:/usr/sbin:/bin:/usr/bin
++ unset PYTHON_HOME
++ export OCT_CONFIG_HOME=/var/lib/jenkins/jobs/test_pull_request_origin_integration/workspace/.config
++ OCT_CONFIG_HOME=/var/lib/jenkins/jobs/test_pull_request_origin_integration/workspace/.config
+ (( i = 0 ))
+ (( i < 10 ))
+ scp -F /var/lib/jenkins/jobs/test_pull_request_origin_integration/workspace/.config/origin-ci-tool/inventory/.ssh_config /var/lib/jenkins/.config/gcloud/gcs-publisher-credentials.json openshiftdevel:/data/credentials.json
+ break
+ set +o xtrace
########## FINISHED STAGE: SUCCESS: FORWARD GCS CREDENTIALS TO REMOTE HOST [00h 00m 03s] ##########
[workspace] $ /bin/bash /tmp/jenkins8141590794949430944.sh
########## STARTING STAGE: FORWARD PARAMETERS TO THE REMOTE HOST ##########
+ [[ -s /var/lib/jenkins/jobs/test_pull_request_origin_integration/workspace/activate ]]
+ source /var/lib/jenkins/jobs/test_pull_request_origin_integration/workspace/activate
++ export VIRTUAL_ENV=/var/lib/jenkins/origin-ci-tool/7a5c5e83c372ad2e6b3b64b3efa16fe2cb37ef83
++ VIRTUAL_ENV=/var/lib/jenkins/origin-ci-tool/7a5c5e83c372ad2e6b3b64b3efa16fe2cb37ef83
++ export PATH=/var/lib/jenkins/origin-ci-tool/7a5c5e83c372ad2e6b3b64b3efa16fe2cb37ef83/bin:/sbin:/usr/sbin:/bin:/usr/bin
++ PATH=/var/lib/jenkins/origin-ci-tool/7a5c5e83c372ad2e6b3b64b3efa16fe2cb37ef83/bin:/sbin:/usr/sbin:/bin:/usr/bin
++ unset PYTHON_HOME
++ export OCT_CONFIG_HOME=/var/lib/jenkins/jobs/test_pull_request_origin_integration/workspace/.config
++ OCT_CONFIG_HOME=/var/lib/jenkins/jobs/test_pull_request_origin_integration/workspace/.config
+ ssh -F /var/lib/jenkins/jobs/test_pull_request_origin_integration/workspace/.config/origin-ci-tool/inventory/.ssh_config openshiftdevel sudo chmod o+rw /etc/environment
+ ssh -F /var/lib/jenkins/jobs/test_pull_request_origin_integration/workspace/.config/origin-ci-tool/inventory/.ssh_config openshiftdevel 'echo '\''JOB_SPEC={"type":"presubmit","job":"test_pull_request_origin_integration","buildid":"38d35ec8-5cd5-11e8-ae4a-0a58ac100556","refs":{"org":"openshift","repo":"origin","base_ref":"master","base_sha":"23a04201b84307588e1d527b09c82714d9cbf788","pulls":[{"number":19759,"author":"wozniakjan","sha":"1ba7ac484864738d371f97e962beb737c4d8def8"}]}}'\'' >> /etc/environment'
+ ssh -F /var/lib/jenkins/jobs/test_pull_request_origin_integration/workspace/.config/origin-ci-tool/inventory/.ssh_config openshiftdevel 'echo '\''buildId=38d35ec8-5cd5-11e8-ae4a-0a58ac100556'\'' >> /etc/environment'
+ ssh -F /var/lib/jenkins/jobs/test_pull_request_origin_integration/workspace/.config/origin-ci-tool/inventory/.ssh_config openshiftdevel 'echo '\''BUILD_ID=38d35ec8-5cd5-11e8-ae4a-0a58ac100556'\'' >> /etc/environment'
+ ssh -F /var/lib/jenkins/jobs/test_pull_request_origin_integration/workspace/.config/origin-ci-tool/inventory/.ssh_config openshiftdevel 'echo '\''REPO_OWNER=openshift'\'' >> /etc/environment'
+ ssh -F /var/lib/jenkins/jobs/test_pull_request_origin_integration/workspace/.config/origin-ci-tool/inventory/.ssh_config openshiftdevel 'echo '\''REPO_NAME=origin'\'' >> /etc/environment'
+ ssh -F /var/lib/jenkins/jobs/test_pull_request_origin_integration/workspace/.config/origin-ci-tool/inventory/.ssh_config openshiftdevel 'echo '\''PULL_BASE_REF=master'\'' >> /etc/environment'
+ ssh -F /var/lib/jenkins/jobs/test_pull_request_origin_integration/workspace/.config/origin-ci-tool/inventory/.ssh_config openshiftdevel 'echo '\''PULL_BASE_SHA=23a04201b84307588e1d527b09c82714d9cbf788'\'' >> /etc/environment'
+ ssh -F /var/lib/jenkins/jobs/test_pull_request_origin_integration/workspace/.config/origin-ci-tool/inventory/.ssh_config openshiftdevel 'echo '\''PULL_REFS=master:23a04201b84307588e1d527b09c82714d9cbf788,19759:1ba7ac484864738d371f97e962beb737c4d8def8'\'' >> /etc/environment'
+ ssh -F /var/lib/jenkins/jobs/test_pull_request_origin_integration/workspace/.config/origin-ci-tool/inventory/.ssh_config openshiftdevel 'echo '\''PULL_NUMBER=19759'\'' >> /etc/environment'
+ ssh -F /var/lib/jenkins/jobs/test_pull_request_origin_integration/workspace/.config/origin-ci-tool/inventory/.ssh_config openshiftdevel 'echo '\''PULL_PULL_SHA=1ba7ac484864738d371f97e962beb737c4d8def8'\'' >> /etc/environment'
+ ssh -F /var/lib/jenkins/jobs/test_pull_request_origin_integration/workspace/.config/origin-ci-tool/inventory/.ssh_config openshiftdevel 'echo '\''JOB_SPEC={"type":"presubmit","job":"test_pull_request_origin_integration","buildid":"38d35ec8-5cd5-11e8-ae4a-0a58ac100556","refs":{"org":"openshift","repo":"origin","base_ref":"master","base_sha":"23a04201b84307588e1d527b09c82714d9cbf788","pulls":[{"number":19759,"author":"wozniakjan","sha":"1ba7ac484864738d371f97e962beb737c4d8def8"}]}}'\'' >> /etc/environment'
+ ssh -F /var/lib/jenkins/jobs/test_pull_request_origin_integration/workspace/.config/origin-ci-tool/inventory/.ssh_config openshiftdevel 'echo '\''BUILD_NUMBER=17972'\'' >> /etc/environment'
+ ssh -F /var/lib/jenkins/jobs/test_pull_request_origin_integration/workspace/.config/origin-ci-tool/inventory/.ssh_config openshiftdevel 'echo '\''CLONEREFS_ARGS='\'' >> /etc/environment'
+ set +o xtrace
########## FINISHED STAGE: SUCCESS: FORWARD PARAMETERS TO THE REMOTE HOST [00h 00m 05s] ##########
[workspace] $ /bin/bash /tmp/jenkins7797048033780814768.sh
########## STARTING STAGE: SYNC REPOSITORIES ##########
+ [[ -s /var/lib/jenkins/jobs/test_pull_request_origin_integration/workspace/activate ]]
+ source /var/lib/jenkins/jobs/test_pull_request_origin_integration/workspace/activate
++ export VIRTUAL_ENV=/var/lib/jenkins/origin-ci-tool/7a5c5e83c372ad2e6b3b64b3efa16fe2cb37ef83
++ VIRTUAL_ENV=/var/lib/jenkins/origin-ci-tool/7a5c5e83c372ad2e6b3b64b3efa16fe2cb37ef83
++ export PATH=/var/lib/jenkins/origin-ci-tool/7a5c5e83c372ad2e6b3b64b3efa16fe2cb37ef83/bin:/sbin:/usr/sbin:/bin:/usr/bin
++ PATH=/var/lib/jenkins/origin-ci-tool/7a5c5e83c372ad2e6b3b64b3efa16fe2cb37ef83/bin:/sbin:/usr/sbin:/bin:/usr/bin
++ unset PYTHON_HOME
++ export OCT_CONFIG_HOME=/var/lib/jenkins/jobs/test_pull_request_origin_integration/workspace/.config
++ OCT_CONFIG_HOME=/var/lib/jenkins/jobs/test_pull_request_origin_integration/workspace/.config
++ mktemp
+ script=/tmp/tmp.24O0Wm01PM
+ cat
+ chmod +x /tmp/tmp.24O0Wm01PM
+ scp -F /var/lib/jenkins/jobs/test_pull_request_origin_integration/workspace/.config/origin-ci-tool/inventory/.ssh_config /tmp/tmp.24O0Wm01PM openshiftdevel:/tmp/tmp.24O0Wm01PM
+ ssh -F /var/lib/jenkins/jobs/test_pull_request_origin_integration/workspace/.config/origin-ci-tool/inventory/.ssh_config -t openshiftdevel 'bash -l -c "timeout 14400 /tmp/tmp.24O0Wm01PM"'
+ cd /home/origin
++ jq --compact-output .buildid
Using BUILD_NUMBER
+ [[ "38d35ec8-5cd5-11e8-ae4a-0a58ac100556" =~ ^\[0-9]\+$ ]]
+ echo 'Using BUILD_NUMBER'
++ jq --compact-output '.buildid |= "17972"'
+ JOB_SPEC='{"type":"presubmit","job":"test_pull_request_origin_integration","buildid":"17972","refs":{"org":"openshift","repo":"origin","base_ref":"master","base_sha":"23a04201b84307588e1d527b09c82714d9cbf788","pulls":[{"number":19759,"author":"wozniakjan","sha":"1ba7ac484864738d371f97e962beb737c4d8def8"}]}}'
+ for image in ''\''registry.svc.ci.openshift.org/ci/clonerefs:latest'\''' ''\''registry.svc.ci.openshift.org/ci/initupload:latest'\'''
+ (( i = 0 ))
+ (( i < 5 ))
+ docker pull registry.svc.ci.openshift.org/ci/clonerefs:latest
Trying to pull repository registry.svc.ci.openshift.org/ci/clonerefs ... 
latest: Pulling from registry.svc.ci.openshift.org/ci/clonerefs
605ce1bd3f31: Pulling fs layer
348574f31df9: Pulling fs layer
78fd01391cb3: Pulling fs layer
2c57c2d18528: Pulling fs layer
2c57c2d18528: Waiting
348574f31df9: Verifying Checksum
348574f31df9: Download complete
605ce1bd3f31: Verifying Checksum
605ce1bd3f31: Download complete
78fd01391cb3: Verifying Checksum
78fd01391cb3: Download complete
2c57c2d18528: Verifying Checksum
2c57c2d18528: Download complete
605ce1bd3f31: Pull complete
348574f31df9: Pull complete
78fd01391cb3: Pull complete
2c57c2d18528: Pull complete
Digest: sha256:2de141b6ab7f1c592dc5468b03b043fc50127f2b5113a1464816a296ae1c5be1
Status: Downloaded newer image for registry.svc.ci.openshift.org/ci/clonerefs:latest
+ break
+ for image in ''\''registry.svc.ci.openshift.org/ci/clonerefs:latest'\''' ''\''registry.svc.ci.openshift.org/ci/initupload:latest'\'''
+ (( i = 0 ))
+ (( i < 5 ))
+ docker pull registry.svc.ci.openshift.org/ci/initupload:latest
Trying to pull repository registry.svc.ci.openshift.org/ci/initupload ... 
latest: Pulling from registry.svc.ci.openshift.org/ci/initupload
6d987f6f4279: Pulling fs layer
4cccebe844ee: Pulling fs layer
62223bf3aa34: Pulling fs layer
6d987f6f4279: Verifying Checksum
6d987f6f4279: Download complete
4cccebe844ee: Verifying Checksum
4cccebe844ee: Download complete
62223bf3aa34: Verifying Checksum
62223bf3aa34: Download complete
6d987f6f4279: Pull complete
4cccebe844ee: Pull complete
62223bf3aa34: Pull complete
Digest: sha256:a5ec461f7058dc025fd5273e69fcc4df2223201755bd1cc1fcb06f9100ba3ce3
Status: Downloaded newer image for registry.svc.ci.openshift.org/ci/initupload:latest
+ break
+ clonerefs_args=
+ docker run -v /data:/data:z registry.svc.ci.openshift.org/ci/clonerefs:latest --src-root=/data --log=/data/clone.json --repo=openshift,origin=master:23a04201b84307588e1d527b09c82714d9cbf788,19759:1ba7ac484864738d371f97e962beb737c4d8def8
{"component":"clonerefs","level":"info","msg":"Cloning refs","refs":{"org":"openshift","repo":"origin","base_ref":"master","base_sha":"23a04201b84307588e1d527b09c82714d9cbf788","pulls":[{"number":19759,"sha":"1ba7ac484864738d371f97e962beb737c4d8def8"}]},"time":"2018-05-21T09:03:21Z"}
{"command":"os.MkdirAll(/data/src/github.com/openshift/origin, 0755)","component":"clonerefs","error":null,"level":"info","msg":"Ran command","output":"","time":"2018-05-21T09:03:21Z"}
{"command":"git init","component":"clonerefs","error":null,"level":"info","msg":"Ran command","output":"Reinitialized existing shared Git repository in /data/src/github.com/openshift/origin/.git/\n","time":"2018-05-21T09:03:21Z"}
{"command":"git config user.name ci-robot","component":"clonerefs","error":null,"level":"info","msg":"Ran command","output":"","time":"2018-05-21T09:03:21Z"}
{"command":"git config user.email ci-robot@k8s.io","component":"clonerefs","error":null,"level":"info","msg":"Ran command","output":"","time":"2018-05-21T09:03:21Z"}
{"command":"git fetch https://github.com/openshift/origin.git --tags --prune","component":"clonerefs","error":null,"level":"info","msg":"Ran command","output":"From https://github.com/openshift/origin\n * branch                  HEAD       -\u003e FETCH_HEAD\n","time":"2018-05-21T09:03:40Z"}
{"command":"git fetch https://github.com/openshift/origin.git master","component":"clonerefs","error":null,"level":"info","msg":"Ran command","output":"From https://github.com/openshift/origin\n * branch                  master     -\u003e FETCH_HEAD\n","time":"2018-05-21T09:03:40Z"}
{"command":"git checkout 23a04201b84307588e1d527b09c82714d9cbf788","component":"clonerefs","error":null,"level":"info","msg":"Ran command","output":"Note: checking out '23a04201b84307588e1d527b09c82714d9cbf788'.\n\nYou are in 'detached HEAD' state. You can look around, make experimental\nchanges and commit them, and you can discard any commits you make in this\nstate without impacting any branches by performing another checkout.\n\nIf you want to create a new branch to retain commits you create, you may\ndo so (now or later) by using -b with the checkout command again. Example:\n\n  git checkout -b \u003cnew-branch-name\u003e\n\nHEAD is now at 23a04201b8... Merge pull request #19779 from openshift/revert-19720-oc-image-mirror-tests\n","time":"2018-05-21T09:05:36Z"}
{"command":"git branch --force master 23a04201b84307588e1d527b09c82714d9cbf788","component":"clonerefs","error":null,"level":"info","msg":"Ran command","output":"","time":"2018-05-21T09:05:36Z"}
{"command":"git checkout master","component":"clonerefs","error":null,"level":"info","msg":"Ran command","output":"Switched to branch 'master'\nYour branch is ahead of 'origin/master' by 148 commits.\n  (use \"git push\" to publish your local commits)\n","time":"2018-05-21T09:05:36Z"}
{"command":"git fetch https://github.com/openshift/origin.git pull/19759/head","component":"clonerefs","error":null,"level":"info","msg":"Ran command","output":"From https://github.com/openshift/origin\n * branch                  refs/pull/19759/head -\u003e FETCH_HEAD\n","time":"2018-05-21T09:05:37Z"}
{"command":"git merge 1ba7ac484864738d371f97e962beb737c4d8def8","component":"clonerefs","error":null,"level":"info","msg":"Ran command","output":"Merge made by the 'recursive' strategy.\n test/common/build/controllers.go | 29 ++++++++++++++++++++++++++++-\n test/util/client.go              | 23 +++++++++++++++++++----\n 2 files changed, 47 insertions(+), 5 deletions(-)\n","time":"2018-05-21T09:05:38Z"}
{"component":"clonerefs","level":"info","msg":"Finished cloning refs","time":"2018-05-21T09:05:38Z"}
+ docker run -e 'JOB_SPEC={"type":"presubmit","job":"test_pull_request_origin_integration","buildid":"17972","refs":{"org":"openshift","repo":"origin","base_ref":"master","base_sha":"23a04201b84307588e1d527b09c82714d9cbf788","pulls":[{"number":19759,"author":"wozniakjan","sha":"1ba7ac484864738d371f97e962beb737c4d8def8"}]}}' -v /data:/data:z registry.svc.ci.openshift.org/ci/initupload:latest --clone-log=/data/clone.json --dry-run=false --gcs-path=gs://origin-ci-test --gcs-credentials-file=/data/credentials.json --path-strategy=single --default-org=openshift --default-repo=origin
{"component":"initupload","dest":"pr-logs/directory/test_pull_request_origin_integration/17972.txt","level":"info","msg":"Queued for upload","time":"2018-05-21T09:05:40Z"}
{"component":"initupload","dest":"pr-logs/directory/test_pull_request_origin_integration/latest-build.txt","level":"info","msg":"Queued for upload","time":"2018-05-21T09:05:40Z"}
{"component":"initupload","dest":"pr-logs/pull/19759/test_pull_request_origin_integration/latest-build.txt","level":"info","msg":"Queued for upload","time":"2018-05-21T09:05:40Z"}
{"component":"initupload","dest":"pr-logs/pull/19759/test_pull_request_origin_integration/17972/clone-log.txt","level":"info","msg":"Queued for upload","time":"2018-05-21T09:05:40Z"}
{"component":"initupload","dest":"pr-logs/pull/19759/test_pull_request_origin_integration/17972/clone-records.json","level":"info","msg":"Queued for upload","time":"2018-05-21T09:05:40Z"}
{"component":"initupload","dest":"pr-logs/pull/19759/test_pull_request_origin_integration/17972/started.json","level":"info","msg":"Queued for upload","time":"2018-05-21T09:05:40Z"}
{"component":"initupload","dest":"pr-logs/pull/19759/test_pull_request_origin_integration/17972/clone-records.json","level":"info","msg":"Finished upload","time":"2018-05-21T09:05:40Z"}
{"component":"initupload","dest":"pr-logs/pull/19759/test_pull_request_origin_integration/latest-build.txt","level":"info","msg":"Finished upload","time":"2018-05-21T09:05:40Z"}
{"component":"initupload","dest":"pr-logs/directory/test_pull_request_origin_integration/17972.txt","level":"info","msg":"Finished upload","time":"2018-05-21T09:05:40Z"}
{"component":"initupload","dest":"pr-logs/pull/19759/test_pull_request_origin_integration/17972/clone-log.txt","level":"info","msg":"Finished upload","time":"2018-05-21T09:05:41Z"}
{"component":"initupload","dest":"pr-logs/directory/test_pull_request_origin_integration/latest-build.txt","level":"info","msg":"Finished upload","time":"2018-05-21T09:05:41Z"}
{"component":"initupload","dest":"pr-logs/pull/19759/test_pull_request_origin_integration/17972/started.json","level":"info","msg":"Finished upload","time":"2018-05-21T09:05:41Z"}
{"component":"initupload","level":"info","msg":"Finished upload to GCS","time":"2018-05-21T09:05:41Z"}
+ sudo chmod -R a+rwX /data
+ sudo chown -R origin:origin-git /data
+ set +o xtrace
########## FINISHED STAGE: SUCCESS: SYNC REPOSITORIES [00h 03m 55s] ##########
[workspace] $ /bin/bash /tmp/jenkins5236077094338707069.sh
########## STARTING STAGE: FORWARD PARAMETERS TO THE REMOTE HOST ##########
+ [[ -s /var/lib/jenkins/jobs/test_pull_request_origin_integration/workspace/activate ]]
+ source /var/lib/jenkins/jobs/test_pull_request_origin_integration/workspace/activate
++ export VIRTUAL_ENV=/var/lib/jenkins/origin-ci-tool/7a5c5e83c372ad2e6b3b64b3efa16fe2cb37ef83
++ VIRTUAL_ENV=/var/lib/jenkins/origin-ci-tool/7a5c5e83c372ad2e6b3b64b3efa16fe2cb37ef83
++ export PATH=/var/lib/jenkins/origin-ci-tool/7a5c5e83c372ad2e6b3b64b3efa16fe2cb37ef83/bin:/sbin:/usr/sbin:/bin:/usr/bin
++ PATH=/var/lib/jenkins/origin-ci-tool/7a5c5e83c372ad2e6b3b64b3efa16fe2cb37ef83/bin:/sbin:/usr/sbin:/bin:/usr/bin
++ unset PYTHON_HOME
++ export OCT_CONFIG_HOME=/var/lib/jenkins/jobs/test_pull_request_origin_integration/workspace/.config
++ OCT_CONFIG_HOME=/var/lib/jenkins/jobs/test_pull_request_origin_integration/workspace/.config
+ ssh -F /var/lib/jenkins/jobs/test_pull_request_origin_integration/workspace/.config/origin-ci-tool/inventory/.ssh_config openshiftdevel sudo chmod o+rw /etc/environment
+ ssh -F /var/lib/jenkins/jobs/test_pull_request_origin_integration/workspace/.config/origin-ci-tool/inventory/.ssh_config openshiftdevel 'echo '\''JOB_NAME=test_pull_request_origin_integration'\'' >> /etc/environment'
+ ssh -F /var/lib/jenkins/jobs/test_pull_request_origin_integration/workspace/.config/origin-ci-tool/inventory/.ssh_config openshiftdevel 'echo '\''BUILD_NUMBER=17972'\'' >> /etc/environment'
+ set +o xtrace
########## FINISHED STAGE: SUCCESS: FORWARD PARAMETERS TO THE REMOTE HOST [00h 00m 01s] ##########
[workspace] $ /bin/bash /tmp/jenkins7589235800531533089.sh
########## STARTING STAGE: USE A RAMDISK FOR ETCD ##########
+ [[ -s /var/lib/jenkins/jobs/test_pull_request_origin_integration/workspace/activate ]]
+ source /var/lib/jenkins/jobs/test_pull_request_origin_integration/workspace/activate
++ export VIRTUAL_ENV=/var/lib/jenkins/origin-ci-tool/7a5c5e83c372ad2e6b3b64b3efa16fe2cb37ef83
++ VIRTUAL_ENV=/var/lib/jenkins/origin-ci-tool/7a5c5e83c372ad2e6b3b64b3efa16fe2cb37ef83
++ export PATH=/var/lib/jenkins/origin-ci-tool/7a5c5e83c372ad2e6b3b64b3efa16fe2cb37ef83/bin:/sbin:/usr/sbin:/bin:/usr/bin
++ PATH=/var/lib/jenkins/origin-ci-tool/7a5c5e83c372ad2e6b3b64b3efa16fe2cb37ef83/bin:/sbin:/usr/sbin:/bin:/usr/bin
++ unset PYTHON_HOME
++ export OCT_CONFIG_HOME=/var/lib/jenkins/jobs/test_pull_request_origin_integration/workspace/.config
++ OCT_CONFIG_HOME=/var/lib/jenkins/jobs/test_pull_request_origin_integration/workspace/.config
++ mktemp
+ script=/tmp/tmp.RtqQpj4YOY
+ cat
+ chmod +x /tmp/tmp.RtqQpj4YOY
+ scp -F /var/lib/jenkins/jobs/test_pull_request_origin_integration/workspace/.config/origin-ci-tool/inventory/.ssh_config /tmp/tmp.RtqQpj4YOY openshiftdevel:/tmp/tmp.RtqQpj4YOY
+ ssh -F /var/lib/jenkins/jobs/test_pull_request_origin_integration/workspace/.config/origin-ci-tool/inventory/.ssh_config -t openshiftdevel 'bash -l -c "timeout 300 /tmp/tmp.RtqQpj4YOY"'
+ cd /home/origin
+ sudo su root
+ set +o xtrace
########## FINISHED STAGE: SUCCESS: USE A RAMDISK FOR ETCD [00h 00m 01s] ##########
[workspace] $ /bin/bash /tmp/jenkins3672817115990879063.sh
########## STARTING STAGE: TURN OFF UNNECESSARY RPM REPOS ##########
+ [[ -s /var/lib/jenkins/jobs/test_pull_request_origin_integration/workspace/activate ]]
+ source /var/lib/jenkins/jobs/test_pull_request_origin_integration/workspace/activate
++ export VIRTUAL_ENV=/var/lib/jenkins/origin-ci-tool/7a5c5e83c372ad2e6b3b64b3efa16fe2cb37ef83
++ VIRTUAL_ENV=/var/lib/jenkins/origin-ci-tool/7a5c5e83c372ad2e6b3b64b3efa16fe2cb37ef83
++ export PATH=/var/lib/jenkins/origin-ci-tool/7a5c5e83c372ad2e6b3b64b3efa16fe2cb37ef83/bin:/sbin:/usr/sbin:/bin:/usr/bin
++ PATH=/var/lib/jenkins/origin-ci-tool/7a5c5e83c372ad2e6b3b64b3efa16fe2cb37ef83/bin:/sbin:/usr/sbin:/bin:/usr/bin
++ unset PYTHON_HOME
++ export OCT_CONFIG_HOME=/var/lib/jenkins/jobs/test_pull_request_origin_integration/workspace/.config
++ OCT_CONFIG_HOME=/var/lib/jenkins/jobs/test_pull_request_origin_integration/workspace/.config
++ mktemp
+ script=/tmp/tmp.VWTkp1hqDV
+ cat
+ chmod +x /tmp/tmp.VWTkp1hqDV
+ scp -F /var/lib/jenkins/jobs/test_pull_request_origin_integration/workspace/.config/origin-ci-tool/inventory/.ssh_config /tmp/tmp.VWTkp1hqDV openshiftdevel:/tmp/tmp.VWTkp1hqDV
+ ssh -F /var/lib/jenkins/jobs/test_pull_request_origin_integration/workspace/.config/origin-ci-tool/inventory/.ssh_config -t openshiftdevel 'bash -l -c "timeout 300 /tmp/tmp.VWTkp1hqDV"'
+ cd /home/origin
+ sudo yum-config-manager --disable 'centos-paas-sig-openshift-origin*-rpms'
Loaded plugins: amazon-id, rhui-lb
+ sudo yum-config-manager --disable 'origin-deps-rhel7*'
Loaded plugins: amazon-id, rhui-lb
+ sudo yum-config-manager --disable 'rhel-7-server-ose*'
Loaded plugins: amazon-id, rhui-lb
======================= repo: rhel-7-server-ose-3.1-rpms =======================
[rhel-7-server-ose-3.1-rpms]
async = True
bandwidth = 0
base_persistdir = /var/lib/yum/repos/x86_64/7Server
baseurl = https://mirror.ops.rhcloud.com/enterprise/all/3.1/latest/x86_64/os,
   https://use-mirror1.ops.rhcloud.com/enterprise/all/3.1/latest/x86_64/os/,
   https://use-mirror2.ops.rhcloud.com/enterprise/all/3.1/latest/x86_64/os/,
   https://euw-mirror1.ops.rhcloud.com/enterprise/all/3.1/latest/x86_64/os/
cache = 0
cachedir = /var/cache/yum/x86_64/7Server/rhel-7-server-ose-3.1-rpms
check_config_file_age = True
compare_providers_priority = 80
cost = 1000
deltarpm_metadata_percentage = 100
deltarpm_percentage = 
enabled = False
enablegroups = True
exclude = 
failovermethod = priority
ftp_disable_epsv = False
gpgcadir = /var/lib/yum/repos/x86_64/7Server/rhel-7-server-ose-3.1-rpms/gpgcadir
gpgcakey = 
gpgcheck = False
gpgdir = /var/lib/yum/repos/x86_64/7Server/rhel-7-server-ose-3.1-rpms/gpgdir
gpgkey = file:///etc/pki/rpm-gpg/RPM-GPG-KEY-redhat-release,
   file:///etc/pki/rpm-gpg/RPM-GPG-KEY-redhat-beta,
   https://mirror.ops.rhcloud.com/libra/keys/RPM-GPG-KEY-redhat-openshifthosted
hdrdir = /var/cache/yum/x86_64/7Server/rhel-7-server-ose-3.1-rpms/headers
http_caching = all
includepkgs = 
ip_resolve = 
keepalive = True
keepcache = False
mddownloadpolicy = sqlite
mdpolicy = group:small
mediaid = 
metadata_expire = 21600
metadata_expire_filter = read-only:present
metalink = 
minrate = 0
mirrorlist = 
mirrorlist_expire = 86400
name = A repository of dependencies for Atomic OpenShift 3.1
old_base_cache_dir = 
password = 
persistdir = /var/lib/yum/repos/x86_64/7Server/rhel-7-server-ose-3.1-rpms
pkgdir = /var/cache/yum/x86_64/7Server/rhel-7-server-ose-3.1-rpms/packages
proxy = False
proxy_dict = 
proxy_password = 
proxy_username = 
repo_gpgcheck = False
retries = 10
skip_if_unavailable = False
ssl_check_cert_permissions = True
sslcacert = 
sslclientcert = /var/lib/yum/client-cert.pem
sslclientkey = /var/lib/yum/client-key.pem
sslverify = False
throttle = 0
timeout = 120.0
ui_id = rhel-7-server-ose-3.1-rpms
ui_repoid_vars = releasever,
   basearch
username = 

====================== repo: rhel-7-server-ose-3.11-rpms =======================
[rhel-7-server-ose-3.11-rpms]
async = True
bandwidth = 0
base_persistdir = /var/lib/yum/repos/x86_64/7Server
baseurl = https://mirror.ops.rhcloud.com/enterprise/all/3.11/latest/x86_64/os,
   https://use-mirror1.ops.rhcloud.com/enterprise/all/3.11/latest/x86_64/os/,
   https://use-mirror2.ops.rhcloud.com/enterprise/all/3.11/latest/x86_64/os/,
   https://euw-mirror1.ops.rhcloud.com/enterprise/all/3.11/latest/x86_64/os/
cache = 0
cachedir = /var/cache/yum/x86_64/7Server/rhel-7-server-ose-3.11-rpms
check_config_file_age = True
compare_providers_priority = 80
cost = 1000
deltarpm_metadata_percentage = 100
deltarpm_percentage = 
enabled = False
enablegroups = True
exclude = 
failovermethod = priority
ftp_disable_epsv = False
gpgcadir = /var/lib/yum/repos/x86_64/7Server/rhel-7-server-ose-3.11-rpms/gpgcadir
gpgcakey = 
gpgcheck = False
gpgdir = /var/lib/yum/repos/x86_64/7Server/rhel-7-server-ose-3.11-rpms/gpgdir
gpgkey = file:///etc/pki/rpm-gpg/RPM-GPG-KEY-redhat-release,
   file:///etc/pki/rpm-gpg/RPM-GPG-KEY-redhat-beta,
   https://mirror.ops.rhcloud.com/libra/keys/RPM-GPG-KEY-redhat-openshifthosted
hdrdir = /var/cache/yum/x86_64/7Server/rhel-7-server-ose-3.11-rpms/headers
http_caching = all
includepkgs = 
ip_resolve = 
keepalive = True
keepcache = False
mddownloadpolicy = sqlite
mdpolicy = group:small
mediaid = 
metadata_expire = 21600
metadata_expire_filter = read-only:present
metalink = 
minrate = 0
mirrorlist = 
mirrorlist_expire = 86400
name = A repository of dependencies for Atomic OpenShift 3.11
old_base_cache_dir = 
password = 
persistdir = /var/lib/yum/repos/x86_64/7Server/rhel-7-server-ose-3.11-rpms
pkgdir = /var/cache/yum/x86_64/7Server/rhel-7-server-ose-3.11-rpms/packages
proxy = False
proxy_dict = 
proxy_password = 
proxy_username = 
repo_gpgcheck = False
retries = 10
skip_if_unavailable = False
ssl_check_cert_permissions = True
sslcacert = 
sslclientcert = /var/lib/yum/client-cert.pem
sslclientkey = /var/lib/yum/client-key.pem
sslverify = False
throttle = 0
timeout = 120.0
ui_id = rhel-7-server-ose-3.11-rpms
ui_repoid_vars = releasever,
   basearch
username = 

====================== repo: rhel-7-server-ose-3.12-rpms =======================
[rhel-7-server-ose-3.12-rpms]
async = True
bandwidth = 0
base_persistdir = /var/lib/yum/repos/x86_64/7Server
baseurl = https://mirror.ops.rhcloud.com/enterprise/all/3.12/latest/x86_64/os,
   https://use-mirror1.ops.rhcloud.com/enterprise/all/3.12/latest/x86_64/os/,
   https://use-mirror2.ops.rhcloud.com/enterprise/all/3.12/latest/x86_64/os/,
   https://euw-mirror1.ops.rhcloud.com/enterprise/all/3.12/latest/x86_64/os/
cache = 0
cachedir = /var/cache/yum/x86_64/7Server/rhel-7-server-ose-3.12-rpms
check_config_file_age = True
compare_providers_priority = 80
cost = 1000
deltarpm_metadata_percentage = 100
deltarpm_percentage = 
enabled = False
enablegroups = True
exclude = 
failovermethod = priority
ftp_disable_epsv = False
gpgcadir = /var/lib/yum/repos/x86_64/7Server/rhel-7-server-ose-3.12-rpms/gpgcadir
gpgcakey = 
gpgcheck = False
gpgdir = /var/lib/yum/repos/x86_64/7Server/rhel-7-server-ose-3.12-rpms/gpgdir
gpgkey = file:///etc/pki/rpm-gpg/RPM-GPG-KEY-redhat-release,
   file:///etc/pki/rpm-gpg/RPM-GPG-KEY-redhat-beta,
   https://mirror.ops.rhcloud.com/libra/keys/RPM-GPG-KEY-redhat-openshifthosted
hdrdir = /var/cache/yum/x86_64/7Server/rhel-7-server-ose-3.12-rpms/headers
http_caching = all
includepkgs = 
ip_resolve = 
keepalive = True
keepcache = False
mddownloadpolicy = sqlite
mdpolicy = group:small
mediaid = 
metadata_expire = 21600
metadata_expire_filter = read-only:present
metalink = 
minrate = 0
mirrorlist = 
mirrorlist_expire = 86400
name = A repository of dependencies for Atomic OpenShift 3.12
old_base_cache_dir = 
password = 
persistdir = /var/lib/yum/repos/x86_64/7Server/rhel-7-server-ose-3.12-rpms
pkgdir = /var/cache/yum/x86_64/7Server/rhel-7-server-ose-3.12-rpms/packages
proxy = False
proxy_dict = 
proxy_password = 
proxy_username = 
repo_gpgcheck = False
retries = 10
skip_if_unavailable = False
ssl_check_cert_permissions = True
sslcacert = 
sslclientcert = /var/lib/yum/client-cert.pem
sslclientkey = /var/lib/yum/client-key.pem
sslverify = False
throttle = 0
timeout = 120.0
ui_id = rhel-7-server-ose-3.12-rpms
ui_repoid_vars = releasever,
   basearch
username = 

======================= repo: rhel-7-server-ose-3.6-rpms =======================
[rhel-7-server-ose-3.6-rpms]
async = True
bandwidth = 0
base_persistdir = /var/lib/yum/repos/x86_64/7Server
baseurl = https://mirror.ops.rhcloud.com/enterprise/all/3.6/latest/x86_64/os,
   https://use-mirror1.ops.rhcloud.com/enterprise/all/3.6/latest/x86_64/os/,
   https://use-mirror2.ops.rhcloud.com/enterprise/all/3.6/latest/x86_64/os/,
   https://euw-mirror1.ops.rhcloud.com/enterprise/all/3.6/latest/x86_64/os/
cache = 0
cachedir = /var/cache/yum/x86_64/7Server/rhel-7-server-ose-3.6-rpms
check_config_file_age = True
compare_providers_priority = 80
cost = 1000
deltarpm_metadata_percentage = 100
deltarpm_percentage = 
enabled = False
enablegroups = True
exclude = 
failovermethod = priority
ftp_disable_epsv = False
gpgcadir = /var/lib/yum/repos/x86_64/7Server/rhel-7-server-ose-3.6-rpms/gpgcadir
gpgcakey = 
gpgcheck = False
gpgdir = /var/lib/yum/repos/x86_64/7Server/rhel-7-server-ose-3.6-rpms/gpgdir
gpgkey = file:///etc/pki/rpm-gpg/RPM-GPG-KEY-redhat-release,
   file:///etc/pki/rpm-gpg/RPM-GPG-KEY-redhat-beta,
   https://mirror.ops.rhcloud.com/libra/keys/RPM-GPG-KEY-redhat-openshifthosted
hdrdir = /var/cache/yum/x86_64/7Server/rhel-7-server-ose-3.6-rpms/headers
http_caching = all
includepkgs = 
ip_resolve = 
keepalive = True
keepcache = False
mddownloadpolicy = sqlite
mdpolicy = group:small
mediaid = 
metadata_expire = 21600
metadata_expire_filter = read-only:present
metalink = 
minrate = 0
mirrorlist = 
mirrorlist_expire = 86400
name = A repository of dependencies for Atomic OpenShift 3.6
old_base_cache_dir = 
password = 
persistdir = /var/lib/yum/repos/x86_64/7Server/rhel-7-server-ose-3.6-rpms
pkgdir = /var/cache/yum/x86_64/7Server/rhel-7-server-ose-3.6-rpms/packages
proxy = False
proxy_dict = 
proxy_password = 
proxy_username = 
repo_gpgcheck = False
retries = 10
skip_if_unavailable = False
ssl_check_cert_permissions = True
sslcacert = 
sslclientcert = /var/lib/yum/client-cert.pem
sslclientkey = /var/lib/yum/client-key.pem
sslverify = False
throttle = 0
timeout = 120.0
ui_id = rhel-7-server-ose-3.6-rpms
ui_repoid_vars = releasever,
   basearch
username = 

======================= repo: rhel-7-server-ose-3.7-rpms =======================
[rhel-7-server-ose-3.7-rpms]
async = True
bandwidth = 0
base_persistdir = /var/lib/yum/repos/x86_64/7Server
baseurl = https://mirror.ops.rhcloud.com/enterprise/all/3.7/latest/x86_64/os,
   https://use-mirror1.ops.rhcloud.com/enterprise/all/3.7/latest/x86_64/os/,
   https://use-mirror2.ops.rhcloud.com/enterprise/all/3.7/latest/x86_64/os/,
   https://euw-mirror1.ops.rhcloud.com/enterprise/all/3.7/latest/x86_64/os/
cache = 0
cachedir = /var/cache/yum/x86_64/7Server/rhel-7-server-ose-3.7-rpms
check_config_file_age = True
compare_providers_priority = 80
cost = 1000
deltarpm_metadata_percentage = 100
deltarpm_percentage = 
enabled = False
enablegroups = True
exclude = 
failovermethod = priority
ftp_disable_epsv = False
gpgcadir = /var/lib/yum/repos/x86_64/7Server/rhel-7-server-ose-3.7-rpms/gpgcadir
gpgcakey = 
gpgcheck = False
gpgdir = /var/lib/yum/repos/x86_64/7Server/rhel-7-server-ose-3.7-rpms/gpgdir
gpgkey = file:///etc/pki/rpm-gpg/RPM-GPG-KEY-redhat-release,
   file:///etc/pki/rpm-gpg/RPM-GPG-KEY-redhat-beta,
   https://mirror.ops.rhcloud.com/libra/keys/RPM-GPG-KEY-redhat-openshifthosted
hdrdir = /var/cache/yum/x86_64/7Server/rhel-7-server-ose-3.7-rpms/headers
http_caching = all
includepkgs = 
ip_resolve = 
keepalive = True
keepcache = False
mddownloadpolicy = sqlite
mdpolicy = group:small
mediaid = 
metadata_expire = 21600
metadata_expire_filter = read-only:present
metalink = 
minrate = 0
mirrorlist = 
mirrorlist_expire = 86400
name = A repository of dependencies for Atomic OpenShift 3.7
old_base_cache_dir = 
password = 
persistdir = /var/lib/yum/repos/x86_64/7Server/rhel-7-server-ose-3.7-rpms
pkgdir = /var/cache/yum/x86_64/7Server/rhel-7-server-ose-3.7-rpms/packages
proxy = False
proxy_dict = 
proxy_password = 
proxy_username = 
repo_gpgcheck = False
retries = 10
skip_if_unavailable = False
ssl_check_cert_permissions = True
sslcacert = 
sslclientcert = /var/lib/yum/client-cert.pem
sslclientkey = /var/lib/yum/client-key.pem
sslverify = False
throttle = 0
timeout = 120.0
ui_id = rhel-7-server-ose-3.7-rpms
ui_repoid_vars = releasever,
   basearch
username = 

======================= repo: rhel-7-server-ose-3.8-rpms =======================
[rhel-7-server-ose-3.8-rpms]
async = True
bandwidth = 0
base_persistdir = /var/lib/yum/repos/x86_64/7Server
baseurl = https://mirror.ops.rhcloud.com/enterprise/all/3.8/latest/x86_64/os,
   https://use-mirror1.ops.rhcloud.com/enterprise/all/3.8/latest/x86_64/os/,
   https://use-mirror2.ops.rhcloud.com/enterprise/all/3.8/latest/x86_64/os/,
   https://euw-mirror1.ops.rhcloud.com/enterprise/all/3.8/latest/x86_64/os/
cache = 0
cachedir = /var/cache/yum/x86_64/7Server/rhel-7-server-ose-3.8-rpms
check_config_file_age = True
compare_providers_priority = 80
cost = 1000
deltarpm_metadata_percentage = 100
deltarpm_percentage = 
enabled = False
enablegroups = True
exclude = 
failovermethod = priority
ftp_disable_epsv = False
gpgcadir = /var/lib/yum/repos/x86_64/7Server/rhel-7-server-ose-3.8-rpms/gpgcadir
gpgcakey = 
gpgcheck = False
gpgdir = /var/lib/yum/repos/x86_64/7Server/rhel-7-server-ose-3.8-rpms/gpgdir
gpgkey = file:///etc/pki/rpm-gpg/RPM-GPG-KEY-redhat-release,
   file:///etc/pki/rpm-gpg/RPM-GPG-KEY-redhat-beta,
   https://mirror.ops.rhcloud.com/libra/keys/RPM-GPG-KEY-redhat-openshifthosted
hdrdir = /var/cache/yum/x86_64/7Server/rhel-7-server-ose-3.8-rpms/headers
http_caching = all
includepkgs = 
ip_resolve = 
keepalive = True
keepcache = False
mddownloadpolicy = sqlite
mdpolicy = group:small
mediaid = 
metadata_expire = 21600
metadata_expire_filter = read-only:present
metalink = 
minrate = 0
mirrorlist = 
mirrorlist_expire = 86400
name = A repository of dependencies for Atomic OpenShift 3.8
old_base_cache_dir = 
password = 
persistdir = /var/lib/yum/repos/x86_64/7Server/rhel-7-server-ose-3.8-rpms
pkgdir = /var/cache/yum/x86_64/7Server/rhel-7-server-ose-3.8-rpms/packages
proxy = False
proxy_dict = 
proxy_password = 
proxy_username = 
repo_gpgcheck = False
retries = 10
skip_if_unavailable = False
ssl_check_cert_permissions = True
sslcacert = 
sslclientcert = /var/lib/yum/client-cert.pem
sslclientkey = /var/lib/yum/client-key.pem
sslverify = False
throttle = 0
timeout = 120.0
ui_id = rhel-7-server-ose-3.8-rpms
ui_repoid_vars = releasever,
   basearch
username = 

======================= repo: rhel-7-server-ose-3.9-rpms =======================
[rhel-7-server-ose-3.9-rpms]
async = True
bandwidth = 0
base_persistdir = /var/lib/yum/repos/x86_64/7Server
baseurl = https://mirror.ops.rhcloud.com/enterprise/all/3.9/latest/x86_64/os,
   https://use-mirror1.ops.rhcloud.com/enterprise/all/3.9/latest/x86_64/os/,
   https://use-mirror2.ops.rhcloud.com/enterprise/all/3.9/latest/x86_64/os/,
   https://euw-mirror1.ops.rhcloud.com/enterprise/all/3.9/latest/x86_64/os/
cache = 0
cachedir = /var/cache/yum/x86_64/7Server/rhel-7-server-ose-3.9-rpms
check_config_file_age = True
compare_providers_priority = 80
cost = 1000
deltarpm_metadata_percentage = 100
deltarpm_percentage = 
enabled = False
enablegroups = True
exclude = 
failovermethod = priority
ftp_disable_epsv = False
gpgcadir = /var/lib/yum/repos/x86_64/7Server/rhel-7-server-ose-3.9-rpms/gpgcadir
gpgcakey = 
gpgcheck = False
gpgdir = /var/lib/yum/repos/x86_64/7Server/rhel-7-server-ose-3.9-rpms/gpgdir
gpgkey = file:///etc/pki/rpm-gpg/RPM-GPG-KEY-redhat-release,
   file:///etc/pki/rpm-gpg/RPM-GPG-KEY-redhat-beta,
   https://mirror.ops.rhcloud.com/libra/keys/RPM-GPG-KEY-redhat-openshifthosted
hdrdir = /var/cache/yum/x86_64/7Server/rhel-7-server-ose-3.9-rpms/headers
http_caching = all
includepkgs = 
ip_resolve = 
keepalive = True
keepcache = False
mddownloadpolicy = sqlite
mdpolicy = group:small
mediaid = 
metadata_expire = 21600
metadata_expire_filter = read-only:present
metalink = 
minrate = 0
mirrorlist = 
mirrorlist_expire = 86400
name = A repository of dependencies for Atomic OpenShift 3.9
old_base_cache_dir = 
password = 
persistdir = /var/lib/yum/repos/x86_64/7Server/rhel-7-server-ose-3.9-rpms
pkgdir = /var/cache/yum/x86_64/7Server/rhel-7-server-ose-3.9-rpms/packages
proxy = False
proxy_dict = 
proxy_password = 
proxy_username = 
repo_gpgcheck = False
retries = 10
skip_if_unavailable = False
ssl_check_cert_permissions = True
sslcacert = 
sslclientcert = /var/lib/yum/client-cert.pem
sslclientkey = /var/lib/yum/client-key.pem
sslverify = False
throttle = 0
timeout = 120.0
ui_id = rhel-7-server-ose-3.9-rpms
ui_repoid_vars = releasever,
   basearch
username = 

+ [[ test_pull_request_origin_integration == *update* ]]
+ set +o xtrace
########## FINISHED STAGE: SUCCESS: TURN OFF UNNECESSARY RPM REPOS [00h 00m 05s] ##########
[workspace] $ /bin/bash /tmp/jenkins7582659483529852098.sh
########## STARTING STAGE: ENABLE DOCKER TESTED REPO ##########
+ [[ -s /var/lib/jenkins/jobs/test_pull_request_origin_integration/workspace/activate ]]
+ source /var/lib/jenkins/jobs/test_pull_request_origin_integration/workspace/activate
++ export VIRTUAL_ENV=/var/lib/jenkins/origin-ci-tool/7a5c5e83c372ad2e6b3b64b3efa16fe2cb37ef83
++ VIRTUAL_ENV=/var/lib/jenkins/origin-ci-tool/7a5c5e83c372ad2e6b3b64b3efa16fe2cb37ef83
++ export PATH=/var/lib/jenkins/origin-ci-tool/7a5c5e83c372ad2e6b3b64b3efa16fe2cb37ef83/bin:/sbin:/usr/sbin:/bin:/usr/bin
++ PATH=/var/lib/jenkins/origin-ci-tool/7a5c5e83c372ad2e6b3b64b3efa16fe2cb37ef83/bin:/sbin:/usr/sbin:/bin:/usr/bin
++ unset PYTHON_HOME
++ export OCT_CONFIG_HOME=/var/lib/jenkins/jobs/test_pull_request_origin_integration/workspace/.config
++ OCT_CONFIG_HOME=/var/lib/jenkins/jobs/test_pull_request_origin_integration/workspace/.config
++ mktemp
+ script=/tmp/tmp.iPAeD6pzLg
+ cat
+ chmod +x /tmp/tmp.iPAeD6pzLg
+ scp -F /var/lib/jenkins/jobs/test_pull_request_origin_integration/workspace/.config/origin-ci-tool/inventory/.ssh_config /tmp/tmp.iPAeD6pzLg openshiftdevel:/tmp/tmp.iPAeD6pzLg
+ ssh -F /var/lib/jenkins/jobs/test_pull_request_origin_integration/workspace/.config/origin-ci-tool/inventory/.ssh_config -t openshiftdevel 'bash -l -c "timeout 300 /tmp/tmp.iPAeD6pzLg"'
+ cd /home/origin
+ [[ master == \m\a\s\t\e\r ]]
+ sudo touch /etc/yum.repos.d/dockertested.repo
+ sudo chmod a+rw /etc/yum.repos.d/dockertested.repo
+ cat
+ set +o xtrace
########## FINISHED STAGE: SUCCESS: ENABLE DOCKER TESTED REPO [00h 00m 01s] ##########
[workspace] $ /bin/bash /tmp/jenkins5101268255040855148.sh
########## STARTING STAGE: RUN INTEGRATION TESTS ##########
+ [[ -s /var/lib/jenkins/jobs/test_pull_request_origin_integration/workspace/activate ]]
+ source /var/lib/jenkins/jobs/test_pull_request_origin_integration/workspace/activate
++ export VIRTUAL_ENV=/var/lib/jenkins/origin-ci-tool/7a5c5e83c372ad2e6b3b64b3efa16fe2cb37ef83
++ VIRTUAL_ENV=/var/lib/jenkins/origin-ci-tool/7a5c5e83c372ad2e6b3b64b3efa16fe2cb37ef83
++ export PATH=/var/lib/jenkins/origin-ci-tool/7a5c5e83c372ad2e6b3b64b3efa16fe2cb37ef83/bin:/sbin:/usr/sbin:/bin:/usr/bin
++ PATH=/var/lib/jenkins/origin-ci-tool/7a5c5e83c372ad2e6b3b64b3efa16fe2cb37ef83/bin:/sbin:/usr/sbin:/bin:/usr/bin
++ unset PYTHON_HOME
++ export OCT_CONFIG_HOME=/var/lib/jenkins/jobs/test_pull_request_origin_integration/workspace/.config
++ OCT_CONFIG_HOME=/var/lib/jenkins/jobs/test_pull_request_origin_integration/workspace/.config
++ mktemp
+ script=/tmp/tmp.50aZJEBWcN
+ cat
+ chmod +x /tmp/tmp.50aZJEBWcN
+ scp -F /var/lib/jenkins/jobs/test_pull_request_origin_integration/workspace/.config/origin-ci-tool/inventory/.ssh_config /tmp/tmp.50aZJEBWcN openshiftdevel:/tmp/tmp.50aZJEBWcN
+ ssh -F /var/lib/jenkins/jobs/test_pull_request_origin_integration/workspace/.config/origin-ci-tool/inventory/.ssh_config -t openshiftdevel 'bash -l -c "timeout 7200 /tmp/tmp.50aZJEBWcN"'
+ cd /data/src/github.com/openshift/origin
+ OS_BUILD_ENV_PULL_IMAGE=true
+ OS_BUILD_ENV_TMP_VOLUME=/tmp
+ hack/env JUNIT_REPORT=true make test-tools test-integration
[INFO] [09:05:55+0000] Pulling the openshift/origin-release:golang-1.9 image to update it...
Trying to pull repository registry.access.redhat.com/openshift/origin-release ... 
Trying to pull repository docker.io/openshift/origin-release ... 
golang-1.9: Pulling from docker.io/openshift/origin-release
469cfcc7a4b3: Already exists
14ef6dc84597: Pulling fs layer
14ef6dc84597: Verifying Checksum
14ef6dc84597: Download complete
14ef6dc84597: Pull complete
Digest: sha256:560891274ff2c49817e8639350e44f3a020b34815d4df5f990d6a41c4530b618
Status: Downloaded newer image for docker.io/openshift/origin-release:golang-1.9
hack/test-tools.sh
[INFO] [09:07:37+0000] No compiled `junitreport` binary was found. Attempting to build one using:
[INFO] [09:07:37+0000]   $ hack/build-go.sh tools/junitreport
++ Building go targets for linux/amd64: tools/junitreport
[INFO] [09:07:45+0000] hack/build-go.sh exited with code 0 after 00h 00m 08s
Running hack/test-tools.sh:10: executing 'tools/junitreport/test/integration.sh' expecting success...
SUCCESS after 0.870s: hack/test-tools.sh:10: executing 'tools/junitreport/test/integration.sh' expecting success
test-tools: ok
hack/test-integration.sh 
++ Building go targets for linux/amd64: test/integration/integration.test
[INFO] [09:18:19+0000] hack/build-go.sh exited with code 0 after 00h 10m 32s
[INFO] [09:18:19+0000] [CLEANUP] Cleaning up temporary directories
[INFO] [09:18:19+0000] Running `go test`...
=== RUN   TestIntegration
=== RUN   TestIntegration/TestAccessOriginWebConsoleMultipleIdentityProviders
=== RUN   TestIntegration/TestAggregator
=== RUN   TestIntegration/TestAllowedSCCViaRBAC
=== RUN   TestIntegration/TestAlwaysPullImagesOff
=== RUN   TestIntegration/TestAlwaysPullImagesOn
=== RUN   TestIntegration/TestApiGroupPreferredVersions
=== RUN   TestIntegration/TestApiGroups
=== RUN   TestIntegration/TestAuditConfigEmbeded
=== RUN   TestIntegration/TestAuditConfigV1Alpha1File
=== RUN   TestIntegration/TestAuditConfigV1Beta1File
=== RUN   TestIntegration/TestAuthProxyOnAuthorize
=== RUN   TestIntegration/TestAuthorizationResolution
=== RUN   TestIntegration/TestAuthorizationResourceAccessReview
=== RUN   TestIntegration/TestAuthorizationRestrictedAccessForProjectAdmins
=== RUN   TestIntegration/TestAuthorizationSubjectAccessReview
=== RUN   TestIntegration/TestAuthorizationSubjectAccessReviewAPIGroup
=== RUN   TestIntegration/TestAutomaticCreationOfPullSecrets
=== RUN   TestIntegration/TestBasicFunctionalityWithAudit
=== RUN   TestIntegration/TestBasicGroupManipulation
=== RUN   TestIntegration/TestBasicUserBasedGroupManipulation
=== RUN   TestIntegration/TestBootstrapPolicyAuthenticatedUsersAgainstOpenshiftNamespace
=== RUN   TestIntegration/TestBootstrapPolicySelfSubjectAccessReviews
=== RUN   TestIntegration/TestBrowserSafeAuthorizer
=== RUN   TestIntegration/TestBuildCompletePodDeleteController
=== RUN   TestIntegration/TestBuildDefaultAnnotations
=== RUN   TestIntegration/TestBuildDefaultEnvironment
=== RUN   TestIntegration/TestBuildDefaultGitHTTPProxy
=== RUN   TestIntegration/TestBuildDefaultGitHTTPSProxy
=== RUN   TestIntegration/TestBuildDefaultLabels
=== RUN   TestIntegration/TestBuildDefaultNodeSelectors
=== RUN   TestIntegration/TestBuildDeleteController
=== RUN   TestIntegration/TestBuildOverrideAnnotations
=== RUN   TestIntegration/TestBuildOverrideForcePull
=== RUN   TestIntegration/TestBuildOverrideForcePullCustomStrategy
=== RUN   TestIntegration/TestBuildOverrideLabels
=== RUN   TestIntegration/TestBuildOverrideNodeSelectors
=== RUN   TestIntegration/TestBuildOverrideTolerations
=== RUN   TestIntegration/TestBuildRunningPodDeleteController
=== RUN   TestIntegration/TestCLIGetToken
=== RUN   TestIntegration/TestClusterQuota
=== RUN   TestIntegration/TestClusterReaderCoverage
=== RUN   TestIntegration/TestClusterResourceOverridePluginWithLimits
=== RUN   TestIntegration/TestClusterResourceOverridePluginWithNoLimits
=== RUN   TestIntegration/TestConcurrentBuildConfigControllers
=== RUN   TestIntegration/TestConcurrentBuildControllers
=== RUN   TestIntegration/TestConcurrentBuildControllersPodSync
=== RUN   TestIntegration/TestConcurrentBuildImageChangeTriggerControllers
=== RUN   TestIntegration/TestDNS
=== RUN   TestIntegration/TestDefaultWatchCacheSize
=== RUN   TestIntegration/TestDeployScale
=== RUN   TestIntegration/TestDeploymentConfigDefaults
=== RUN   TestIntegration/TestDiagNodeConditions
=== RUN   TestIntegration/TestDiscoveryGroupVersions
=== RUN   TestIntegration/TestDockercfgTokenDeletedController
=== RUN   TestIntegration/TestEndpointAdmission
=== RUN   TestIntegration/TestEnforcingServiceAccount
=== RUN   TestIntegration/TestEtcd3StoragePath
=== RUN   TestIntegration/TestExtensionAPIServerConfigMap
=== RUN   TestIntegration/TestExtensionsAPIDeletion
=== RUN   TestIntegration/TestExtensionsAPIDisabledAutoscaleBatchEnabled
=== RUN   TestIntegration/TestFrontProxy
=== RUN   TestIntegration/TestGCDefaults
=== RUN   TestIntegration/TestGroupCommands
=== RUN   TestIntegration/TestImageAddSignature
=== RUN   TestIntegration/TestImageRemoveSignature
=== RUN   TestIntegration/TestImageStreamAdmitSpecUpdate
=== RUN   TestIntegration/TestImageStreamAdmitStatusUpdate
=== RUN   TestIntegration/TestImageStreamCreate
=== RUN   TestIntegration/TestImageStreamImport
=== RUN   TestIntegration/TestImageStreamImportAuthenticated
=== RUN   TestIntegration/TestImageStreamImportDockerHub
=== RUN   TestIntegration/TestImageStreamImportOfMultiSegmentDockerReference
=== RUN   TestIntegration/TestImageStreamImportOfV1ImageFromV2Repository
=== RUN   TestIntegration/TestImageStreamImportQuayIO
=== RUN   TestIntegration/TestImageStreamImportRedHatRegistry
=== RUN   TestIntegration/TestImageStreamImportScheduled
=== RUN   TestIntegration/TestImageStreamImportTagsFromRepository
=== RUN   TestIntegration/TestImageStreamList
=== RUN   TestIntegration/TestImageStreamMappingCreate
=== RUN   TestIntegration/TestImageStreamTagLifecycleHook
=== RUN   TestIntegration/TestImageStreamTagsAdmission
=== RUN   TestIntegration/TestImageStreamWithoutDockerImageConfig
=== RUN   TestIntegration/TestIngressIPAllocation
=== RUN   TestIntegration/TestInvalidRoleRefs
=== RUN   TestIntegration/TestKubernetesAdmissionPluginConfigFile
=== RUN   TestIntegration/TestKubernetesAdmissionPluginEmbeddedConfig
=== RUN   TestIntegration/TestKubernetesAdmissionPluginOrderOverride
=== RUN   TestIntegration/TestLegacyClusterRoleBindingEndpoint
=== RUN   TestIntegration/TestLegacyClusterRoleEndpoint
=== RUN   TestIntegration/TestLegacyLocalRoleBindingEndpoint
=== RUN   TestIntegration/TestLegacyLocalRoleEndpoint
=== RUN   TestIntegration/TestLogin
=== RUN   TestIntegration/TestMasterTLSDefaults
=== RUN   TestIntegration/TestMasterTLSOverrides
=== RUN   TestIntegration/TestMetrics
=== RUN   TestIntegration/TestMultipleImageChangeBuildTriggers
=== RUN   TestIntegration/TestNamespaceLifecycleAdmission
=== RUN   TestIntegration/TestNewAppAddArguments
=== RUN   TestIntegration/TestNewAppBuildConfigEnvVarsAndSecrets
=== RUN   TestIntegration/TestNewAppBuildOutputCycleDetection
=== RUN   TestIntegration/TestNewAppDetectSource
=== RUN   TestIntegration/TestNewAppListAndSearch
=== RUN   TestIntegration/TestNewAppNewBuildEnvVars
=== RUN   TestIntegration/TestNewAppResolve
=== RUN   TestIntegration/TestNewAppRunAll
=== RUN   TestIntegration/TestNewAppRunBuilds
=== RUN   TestIntegration/TestNewAppSourceAuthRequired
=== RUN   TestIntegration/TestNodeAuthorizer
=== RUN   TestIntegration/TestOAuthBasicAuthPassword
=== RUN   TestIntegration/TestOAuthCertFallback
=== RUN   TestIntegration/TestOAuthDisabled
=== RUN   TestIntegration/TestOAuthExpiration
=== RUN   TestIntegration/TestOAuthHTPasswd
=== RUN   TestIntegration/TestOAuthLDAP
=== RUN   TestIntegration/TestOAuthOIDC
=== RUN   TestIntegration/TestOAuthRequestHeader
=== RUN   TestIntegration/TestOAuthRequestTokenEndpoint
=== RUN   TestIntegration/TestOAuthServerHeaders
=== RUN   TestIntegration/TestOAuthServiceAccountClient
=== RUN   TestIntegration/TestOAuthServiceAccountClientEvent
=== RUN   TestIntegration/TestOAuthStorage
=== RUN   TestIntegration/TestOAuthTimeout
=== RUN   TestIntegration/TestOAuthTimeoutNotEnabled
=== RUN   TestIntegration/TestOadmPodNetwork
=== RUN   TestIntegration/TestOauthExternal
=== RUN   TestIntegration/TestOldLocalResourceAccessReviewEndpoint
=== RUN   TestIntegration/TestOldLocalSubjectAccessReviewEndpoint
=== RUN   TestIntegration/TestOpenshiftAdmissionPluginConfigFile
=== RUN   TestIntegration/TestOpenshiftAdmissionPluginEmbeddedConfig
=== RUN   TestIntegration/TestOpenshiftAdmissionPluginOrderOverride
=== RUN   TestIntegration/TestOwnerRefRestriction
=== RUN   TestIntegration/TestPatchConflicts
=== RUN   TestIntegration/TestPodNodeConstraintsAdmissionPluginSetNodeNameClusterAdmin
=== RUN   TestIntegration/TestPodNodeConstraintsAdmissionPluginSetNodeNameNonAdmin
=== RUN   TestIntegration/TestPodNodeConstraintsAdmissionPluginSetNodeSelectorClusterAdmin
=== RUN   TestIntegration/TestPodNodeConstraintsAdmissionPluginSetNodeSelectorNonAdmin
=== RUN   TestIntegration/TestPodUpdateSCCEnforcement
=== RUN   TestIntegration/TestPolicyBasedRestrictionOfBuildConfigCreateAndInstantiateByStrategy
=== RUN   TestIntegration/TestPolicyBasedRestrictionOfBuildCreateAndCloneByStrategy
=== RUN   TestIntegration/TestPolicyCommands
=== RUN   TestIntegration/TestProjectIsNamespace
=== RUN   TestIntegration/TestProjectLifecycle
=== RUN   TestIntegration/TestProjectRequestError
=== RUN   TestIntegration/TestProjectRequestLimitAsSystemAdmin
=== RUN   TestIntegration/TestProjectRequestLimitEmptyConfig
=== RUN   TestIntegration/TestProjectRequestLimitMultiLevelConfig
=== RUN   TestIntegration/TestProjectRequestLimitSingleConfig
=== RUN   TestIntegration/TestProjectWatch
=== RUN   TestIntegration/TestRegistryClientAPIv1
=== RUN   TestIntegration/TestRegistryClientAPIv2ManifestV2Schema1
=== RUN   TestIntegration/TestRegistryClientAPIv2ManifestV2Schema2
=== RUN   TestIntegration/TestRegistryClientConnect
=== RUN   TestIntegration/TestRegistryClientConnectPulpRegistry
=== RUN   TestIntegration/TestRegistryClientDockerHubV1
=== RUN   TestIntegration/TestRegistryClientDockerHubV2
=== RUN   TestIntegration/TestRegistryClientQuayIOImage
=== RUN   TestIntegration/TestRegistryClientRegistryNotFound
=== RUN   TestIntegration/TestRegistryWhitelistingValidation
=== RUN   TestIntegration/TestRestrictUsers
=== RUN   TestIntegration/TestRootAPIPaths
=== RUN   TestIntegration/TestRootRedirect
=== RUN   TestIntegration/TestRouterFirstReloadSuppressionOnSync
=== RUN   TestIntegration/TestRouterNamespaceSync
=== RUN   TestIntegration/TestRunOnceDurationAdmissionPlugin
=== RUN   TestIntegration/TestRunOnceDurationAdmissionPluginProjectLimit
=== RUN   TestIntegration/TestSNI
=== RUN   TestIntegration/TestScopeEscalations
=== RUN   TestIntegration/TestScopedImpersonation
=== RUN   TestIntegration/TestScopedProjectAccess
=== RUN   TestIntegration/TestScopedTokens
=== RUN   TestIntegration/TestSelfSubjectAccessReviewsNonExistingNamespace
=== RUN   TestIntegration/TestServiceAccountAuthorization
=== RUN   TestIntegration/TestServiceServingCertSigner
=== RUN   TestIntegration/TestSimpleImageChangeBuildTriggerFromImageStreamTagCustom
=== RUN   TestIntegration/TestSimpleImageChangeBuildTriggerFromImageStreamTagCustomWithConfigChange
=== RUN   TestIntegration/TestSimpleImageChangeBuildTriggerFromImageStreamTagDocker
=== RUN   TestIntegration/TestSimpleImageChangeBuildTriggerFromImageStreamTagDockerWithConfigChange
=== RUN   TestIntegration/TestSimpleImageChangeBuildTriggerFromImageStreamTagSTI
=== RUN   TestIntegration/TestSimpleImageChangeBuildTriggerFromImageStreamTagSTIWithConfigChange
=== RUN   TestIntegration/TestStorageVersions
=== RUN   TestIntegration/TestTLSDefaults
=== RUN   TestIntegration/TestTLSOverrides
=== RUN   TestIntegration/TestTemplate
=== RUN   TestIntegration/TestTemplateTransformationFromConfig
=== RUN   TestIntegration/TestTokensWithIllegalScopes
=== RUN   TestIntegration/TestTriggers_MultipleICTs
=== RUN   TestIntegration/TestTriggers_configChange
=== RUN   TestIntegration/TestTriggers_imageChange
=== RUN   TestIntegration/TestTriggers_imageChange_nonAutomatic
=== RUN   TestIntegration/TestTriggers_manual
=== RUN   TestIntegration/TestUnprivilegedNewProject
=== RUN   TestIntegration/TestUnprivilegedNewProjectDenied
=== RUN   TestIntegration/TestUnprivilegedNewProjectFromTemplate
=== RUN   TestIntegration/TestUserInitialization
=== RUN   TestIntegration/TestWatchCacheSizeWithFlag
=== RUN   TestIntegration/TestWebhook
=== RUN   TestIntegration/TestWebhookGitHubPing
=== RUN   TestIntegration/TestWebhookGitHubPushWithImage
=== RUN   TestIntegration/TestWebhookGitHubPushWithImageStream
=== RUN   TestIntegration/TestWebhookTokenAuthn
=== RUN   TestIntegration/TestWellKnownOAuth
=== RUN   TestIntegration/TestWellKnownOAuthOff
exit status 2
FAIL	github.com/openshift/origin/test/integration/runner	2335.112s
[WARNING] [09:57:15+0000] `go test` had the following output to stderr:
[WARNING] [09:57:15+0000] fatal error: runtime: out of memory
[WARNING] [09:57:15+0000] runtime stack:
[WARNING] [09:57:15+0000] runtime.throw(0x5ceaca, 0x16)
[WARNING] [09:57:15+0000] 	/usr/local/go/src/runtime/panic.go:605 +0x95
[WARNING] [09:57:15+0000] runtime.sysMap(0xc799150000, 0x72700000, 0xc420462100, 0x6de938)
[WARNING] [09:57:15+0000] 	/usr/local/go/src/runtime/mem_linux.go:216 +0x1d0
[WARNING] [09:57:15+0000] runtime.(*mheap).sysAlloc(0x6c4be0, 0x72700000, 0xc420471e20)
[WARNING] [09:57:15+0000] 	/usr/local/go/src/runtime/malloc.go:470 +0xd7
[WARNING] [09:57:15+0000] runtime.(*mheap).grow(0x6c4be0, 0x39379, 0x0)
[WARNING] [09:57:15+0000] 	/usr/local/go/src/runtime/mheap.go:887 +0x60
[WARNING] [09:57:15+0000] runtime.(*mheap).allocSpanLocked(0x6c4be0, 0x39379, 0x6de948, 0x0)
[WARNING] [09:57:15+0000] 	/usr/local/go/src/runtime/mheap.go:800 +0x334
[WARNING] [09:57:15+0000] runtime.(*mheap).alloc_m(0x6c4be0, 0x39379, 0xffffffffffff0101, 0xc420462180)
[WARNING] [09:57:15+0000] 	/usr/local/go/src/runtime/mheap.go:666 +0x118
[WARNING] [09:57:15+0000] runtime.(*mheap).alloc.func1()
[WARNING] [09:57:15+0000] 	/usr/local/go/src/runtime/mheap.go:733 +0x4d
[WARNING] [09:57:15+0000] runtime.systemstack(0xc420471f08)
[WARNING] [09:57:15+0000] 	/usr/local/go/src/runtime/asm_amd64.s:360 +0xab
[WARNING] [09:57:15+0000] runtime.(*mheap).alloc(0x6c4be0, 0x39379, 0x7fb64b000101, 0xc420471f88)
[WARNING] [09:57:15+0000] 	/usr/local/go/src/runtime/mheap.go:732 +0xa1
[WARNING] [09:57:15+0000] runtime.largeAlloc(0x726f1158, 0x450100, 0xc6d63fa000)
[WARNING] [09:57:15+0000] 	/usr/local/go/src/runtime/malloc.go:827 +0x98
[WARNING] [09:57:15+0000] runtime.mallocgc.func1()
[WARNING] [09:57:15+0000] 	/usr/local/go/src/runtime/malloc.go:722 +0x46
[WARNING] [09:57:15+0000] runtime.systemstack(0xc420027900)
[WARNING] [09:57:15+0000] 	/usr/local/go/src/runtime/asm_amd64.s:344 +0x79
[WARNING] [09:57:15+0000] runtime.mstart()
[WARNING] [09:57:15+0000] 	/usr/local/go/src/runtime/proc.go:1125
[WARNING] [09:57:15+0000] goroutine 57 [running]:
[WARNING] [09:57:15+0000] runtime.systemstack_switch()
[WARNING] [09:57:15+0000] 	/usr/local/go/src/runtime/asm_amd64.s:298 fp=0xc4207bbc18 sp=0xc4207bbc10 pc=0x4584c0
[WARNING] [09:57:15+0000] runtime.mallocgc(0x726f1158, 0x0, 0x0, 0x0)
[WARNING] [09:57:15+0000] 	/usr/local/go/src/runtime/malloc.go:721 +0x7b8 fp=0xc4207bbcc0 sp=0xc4207bbc18 pc=0x4104f8
[WARNING] [09:57:15+0000] runtime.slicebytetostring(0x0, 0xc6d63fa000, 0x726f1158, 0xc2d2fe6b, 0x0, 0x0)
[WARNING] [09:57:15+0000] 	/usr/local/go/src/runtime/string.go:94 +0x9a fp=0xc4207bbcf0 sp=0xc4207bbcc0 pc=0x445bba
[WARNING] [09:57:15+0000] bytes.(*Buffer).String(...)
[WARNING] [09:57:15+0000] 	/usr/local/go/src/bytes/buffer.go:61
[WARNING] [09:57:15+0000] testing.(*common).decorate(0xc42020ad20, 0xc597a40000, 0x6f9310a5, 0x4c0420, 0xc421f54000)
[WARNING] [09:57:15+0000] 	/usr/local/go/src/testing/testing.go:388 +0x34a fp=0xc4207bbdd0 sp=0xc4207bbcf0 pc=0x4dc38a
[WARNING] [09:57:15+0000] testing.(*common).log(0xc42020ad20, 0xc597a40000, 0x6f9310a5)
[WARNING] [09:57:15+0000] 	/usr/local/go/src/testing/testing.go:551 +0x83 fp=0xc4207bbe48 sp=0xc4207bbdd0 pc=0x4dced3
[WARNING] [09:57:15+0000] testing.(*common).Error(0xc42020ad20, 0xc4207bbf38, 0x1, 0x1)
[WARNING] [09:57:15+0000] 	/usr/local/go/src/testing/testing.go:569 +0x61 fp=0xc4207bbe80 sp=0xc4207bbe48 pc=0x4dd181
[WARNING] [09:57:15+0000] github.com/openshift/origin/test/integration/runner.executeTests.func1(0xc42020ad20)
[WARNING] [09:57:15+0000] 	/go/src/github.com/openshift/origin/_output/local/go/src/github.com/openshift/origin/test/integration/runner/runner_test.go:125 +0x28b fp=0xc4207bbfa8 sp=0xc4207bbe80 pc=0x5681fb
[WARNING] [09:57:15+0000] testing.tRunner(0xc42020ad20, 0xc420401240)
[WARNING] [09:57:15+0000] 	/usr/local/go/src/testing/testing.go:746 +0xd0 fp=0xc4207bbfd0 sp=0xc4207bbfa8 pc=0x4ddc00
[WARNING] [09:57:15+0000] runtime.goexit()
[WARNING] [09:57:15+0000] 	/usr/local/go/src/runtime/asm_amd64.s:2337 +0x1 fp=0xc4207bbfd8 sp=0xc4207bbfd0 pc=0x45b061
[WARNING] [09:57:15+0000] created by testing.(*T).Run
[WARNING] [09:57:15+0000] 	/usr/local/go/src/testing/testing.go:789 +0x2de
[WARNING] [09:57:15+0000] goroutine 1 [chan receive, 38 minutes]:
[WARNING] [09:57:15+0000] testing.(*T).Run(0xc4200b8000, 0x5ccc98, 0xf, 0x5d58c0, 0x47a586)
[WARNING] [09:57:15+0000] 	/usr/local/go/src/testing/testing.go:790 +0x2fc
[WARNING] [09:57:15+0000] testing.runTests.func1(0xc4200b8000)
[WARNING] [09:57:15+0000] 	/usr/local/go/src/testing/testing.go:1004 +0x64
[WARNING] [09:57:15+0000] testing.tRunner(0xc4200b8000, 0xc420043de0)
[WARNING] [09:57:15+0000] 	/usr/local/go/src/testing/testing.go:746 +0xd0
[WARNING] [09:57:15+0000] testing.runTests(0xc42000a2c0, 0x6b6d00, 0x1, 0x1, 0x0)
[WARNING] [09:57:15+0000] 	/usr/local/go/src/testing/testing.go:1002 +0x2d8
[WARNING] [09:57:15+0000] testing.(*M).Run(0xc420043f18, 0xc420043f70)
[WARNING] [09:57:15+0000] 	/usr/local/go/src/testing/testing.go:921 +0x111
[WARNING] [09:57:15+0000] main.main()
[WARNING] [09:57:15+0000] 	github.com/openshift/origin/test/integration/runner/_test/_testmain.go:44 +0xdb
[WARNING] [09:57:15+0000] goroutine 6 [chan receive, 6 minutes]:
[WARNING] [09:57:15+0000] testing.tRunner.func1(0xc4200b80f0)
[WARNING] [09:57:15+0000] 	/usr/local/go/src/testing/testing.go:722 +0x131
[WARNING] [09:57:15+0000] testing.tRunner(0xc4200b80f0, 0x5d58c0)
[WARNING] [09:57:15+0000] 	/usr/local/go/src/testing/testing.go:748 +0xda
[WARNING] [09:57:15+0000] created by testing.(*T).Run
[WARNING] [09:57:15+0000] 	/usr/local/go/src/testing/testing.go:789 +0x2de
[WARNING] [09:57:15+0000] goroutine 58 [chan send, 15 minutes]:
[WARNING] [09:57:15+0000] testing.tRunner.func1(0xc42020ae10)
[WARNING] [09:57:15+0000] 	/usr/local/go/src/testing/testing.go:741 +0x19b
[WARNING] [09:57:15+0000] testing.tRunner(0xc42020ae10, 0xc4204012c0)
[WARNING] [09:57:15+0000] 	/usr/local/go/src/testing/testing.go:748 +0xda
[WARNING] [09:57:15+0000] created by testing.(*T).Run
[WARNING] [09:57:15+0000] 	/usr/local/go/src/testing/testing.go:789 +0x2de
[WARNING] [09:57:15+0000] goroutine 59 [chan send, 15 minutes]:
[WARNING] [09:57:15+0000] testing.tRunner.func1(0xc42020af00)
[WARNING] [09:57:15+0000] 	/usr/local/go/src/testing/testing.go:741 +0x19b
[WARNING] [09:57:15+0000] testing.tRunner(0xc42020af00, 0xc420401340)
[WARNING] [09:57:15+0000] 	/usr/local/go/src/testing/testing.go:748 +0xda
[WARNING] [09:57:15+0000] created by testing.(*T).Run
[WARNING] [09:57:15+0000] 	/usr/local/go/src/testing/testing.go:789 +0x2de
[WARNING] [09:57:15+0000] goroutine 60 [chan send, 15 minutes]:
[WARNING] [09:57:15+0000] testing.tRunner.func1(0xc42020aff0)
[WARNING] [09:57:15+0000] 	/usr/local/go/src/testing/testing.go:741 +0x19b
[WARNING] [09:57:15+0000] testing.tRunner(0xc42020aff0, 0xc4204013c0)
[WARNING] [09:57:15+0000] 	/usr/local/go/src/testing/testing.go:748 +0xda
[WARNING] [09:57:15+0000] created by testing.(*T).Run
[WARNING] [09:57:15+0000] 	/usr/local/go/src/testing/testing.go:789 +0x2de
[WARNING] [09:57:15+0000] goroutine 61 [chan send, 15 minutes]:
[WARNING] [09:57:15+0000] testing.tRunner.func1(0xc42020b0e0)
[WARNING] [09:57:15+0000] 	/usr/local/go/src/testing/testing.go:741 +0x19b
[WARNING] [09:57:15+0000] testing.tRunner(0xc42020b0e0, 0xc420401440)
[WARNING] [09:57:15+0000] 	/usr/local/go/src/testing/testing.go:748 +0xda
[WARNING] [09:57:15+0000] created by testing.(*T).Run
[WARNING] [09:57:15+0000] 	/usr/local/go/src/testing/testing.go:789 +0x2de
[WARNING] [09:57:15+0000] goroutine 62 [chan send, 24 minutes]:
[WARNING] [09:57:15+0000] testing.tRunner.func1(0xc42020b1d0)
[WARNING] [09:57:15+0000] 	/usr/local/go/src/testing/testing.go:741 +0x19b
[WARNING] [09:57:15+0000] testing.tRunner(0xc42020b1d0, 0xc4204014c0)
[WARNING] [09:57:15+0000] 	/usr/local/go/src/testing/testing.go:748 +0xda
[WARNING] [09:57:15+0000] created by testing.(*T).Run
[WARNING] [09:57:15+0000] 	/usr/local/go/src/testing/testing.go:789 +0x2de
[WARNING] [09:57:15+0000] goroutine 63 [chan send, 16 minutes]:
[WARNING] [09:57:15+0000] testing.tRunner.func1(0xc42020b2c0)
[WARNING] [09:57:15+0000] 	/usr/local/go/src/testing/testing.go:741 +0x19b
[WARNING] [09:57:15+0000] testing.tRunner(0xc42020b2c0, 0xc420401540)
[WARNING] [09:57:15+0000] 	/usr/local/go/src/testing/testing.go:748 +0xda
[WARNING] [09:57:15+0000] created by testing.(*T).Run
[WARNING] [09:57:15+0000] 	/usr/local/go/src/testing/testing.go:789 +0x2de
[WARNING] [09:57:15+0000] goroutine 64 [chan send, 16 minutes]:
[WARNING] [09:57:15+0000] testing.tRunner.func1(0xc42020b3b0)
[WARNING] [09:57:15+0000] 	/usr/local/go/src/testing/testing.go:741 +0x19b
[WARNING] [09:57:15+0000] testing.tRunner(0xc42020b3b0, 0xc4204015c0)
[WARNING] [09:57:15+0000] 	/usr/local/go/src/testing/testing.go:748 +0xda
[WARNING] [09:57:15+0000] created by testing.(*T).Run
[WARNING] [09:57:15+0000] 	/usr/local/go/src/testing/testing.go:789 +0x2de
[WARNING] [09:57:15+0000] goroutine 65 [chan send, 16 minutes]:
[WARNING] [09:57:15+0000] testing.tRunner.func1(0xc42020b4a0)
[WARNING] [09:57:15+0000] 	/usr/local/go/src/testing/testing.go:741 +0x19b
[WARNING] [09:57:15+0000] testing.tRunner(0xc42020b4a0, 0xc420401640)
[WARNING] [09:57:15+0000] 	/usr/local/go/src/testing/testing.go:748 +0xda
[WARNING] [09:57:15+0000] created by testing.(*T).Run
[WARNING] [09:57:15+0000] 	/usr/local/go/src/testing/testing.go:789 +0x2de
[WARNING] [09:57:15+0000] goroutine 66 [chan send, 16 minutes]:
[WARNING] [09:57:15+0000] testing.tRunner.func1(0xc42020b590)
[WARNING] [09:57:15+0000] 	/usr/local/go/src/testing/testing.go:741 +0x19b
[WARNING] [09:57:15+0000] testing.tRunner(0xc42020b590, 0xc4204016c0)
[WARNING] [09:57:15+0000] 	/usr/local/go/src/testing/testing.go:748 +0xda
[WARNING] [09:57:15+0000] created by testing.(*T).Run
[WARNING] [09:57:15+0000] 	/usr/local/go/src/testing/testing.go:789 +0x2de
[WARNING] [09:57:15+0000] goroutine 67 [chan send, 15 minutes]:
[WARNING] [09:57:15+0000] testing.tRunner.func1(0xc42020b680)
[WARNING] [09:57:15+0000] 	/usr/local/go/src/testing/testing.go:741 +0x19b
[WARNING] [09:57:15+0000] testing.tRunner(0xc42020b680, 0xc420401740)
[WARNING] [09:57:15+0000] 	/usr/local/go/src/testing/testing.go:748 +0xda
[WARNING] [09:57:15+0000] created by testing.(*T).Run
[WARNING] [09:57:15+0000] 	/usr/local/go/src/testing/testing.go:789 +0x2de
[WARNING] [09:57:15+0000] goroutine 68 [chan send, 16 minutes]:
[WARNING] [09:57:15+0000] testing.tRunner.func1(0xc42020b770)
[WARNING] [09:57:15+0000] 	/usr/local/go/src/testing/testing.go:741 +0x19b
[WARNING] [09:57:15+0000] testing.tRunner(0xc42020b770, 0xc4204017c0)
[WARNING] [09:57:15+0000] 	/usr/local/go/src/testing/testing.go:748 +0xda
[WARNING] [09:57:15+0000] created by testing.(*T).Run
[WARNING] [09:57:15+0000] 	/usr/local/go/src/testing/testing.go:789 +0x2de
[WARNING] [09:57:15+0000] goroutine 69 [chan send, 16 minutes]:
[WARNING] [09:57:15+0000] testing.tRunner.func1(0xc42020b860)
[WARNING] [09:57:15+0000] 	/usr/local/go/src/testing/testing.go:741 +0x19b
[WARNING] [09:57:15+0000] testing.tRunner(0xc42020b860, 0xc420401840)
[WARNING] [09:57:15+0000] 	/usr/local/go/src/testing/testing.go:748 +0xda
[WARNING] [09:57:15+0000] created by testing.(*T).Run
[WARNING] [09:57:15+0000] 	/usr/local/go/src/testing/testing.go:789 +0x2de
[WARNING] [09:57:15+0000] goroutine 70 [chan send, 16 minutes]:
[WARNING] [09:57:15+0000] testing.tRunner.func1(0xc42020b950)
[WARNING] [09:57:15+0000] 	/usr/local/go/src/testing/testing.go:741 +0x19b
[WARNING] [09:57:15+0000] testing.tRunner(0xc42020b950, 0xc4204018c0)
[WARNING] [09:57:15+0000] 	/usr/local/go/src/testing/testing.go:748 +0xda
[WARNING] [09:57:15+0000] created by testing.(*T).Run
[WARNING] [09:57:15+0000] 	/usr/local/go/src/testing/testing.go:789 +0x2de
[WARNING] [09:57:15+0000] goroutine 71 [chan send, 17 minutes]:
[WARNING] [09:57:15+0000] testing.tRunner.func1(0xc42020ba40)
[WARNING] [09:57:15+0000] 	/usr/local/go/src/testing/testing.go:741 +0x19b
[WARNING] [09:57:15+0000] testing.tRunner(0xc42020ba40, 0xc420401940)
[WARNING] [09:57:15+0000] 	/usr/local/go/src/testing/testing.go:748 +0xda
[WARNING] [09:57:15+0000] created by testing.(*T).Run
[WARNING] [09:57:15+0000] 	/usr/local/go/src/testing/testing.go:789 +0x2de
[WARNING] [09:57:15+0000] goroutine 72 [chan send, 17 minutes]:
[WARNING] [09:57:15+0000] testing.tRunner.func1(0xc42020bb30)
[WARNING] [09:57:15+0000] 	/usr/local/go/src/testing/testing.go:741 +0x19b
[WARNING] [09:57:15+0000] testing.tRunner(0xc42020bb30, 0xc4204019c0)
[WARNING] [09:57:15+0000] 	/usr/local/go/src/testing/testing.go:748 +0xda
[WARNING] [09:57:15+0000] created by testing.(*T).Run
[WARNING] [09:57:15+0000] 	/usr/local/go/src/testing/testing.go:789 +0x2de
[WARNING] [09:57:15+0000] goroutine 73 [chan send, 17 minutes]:
[WARNING] [09:57:15+0000] testing.tRunner.func1(0xc42020bc20)
[WARNING] [09:57:15+0000] 	/usr/local/go/src/testing/testing.go:741 +0x19b
[WARNING] [09:57:15+0000] testing.tRunner(0xc42020bc20, 0xc420401a40)
[WARNING] [09:57:15+0000] 	/usr/local/go/src/testing/testing.go:748 +0xda
[WARNING] [09:57:15+0000] created by testing.(*T).Run
[WARNING] [09:57:15+0000] 	/usr/local/go/src/testing/testing.go:789 +0x2de
[WARNING] [09:57:15+0000] goroutine 74 [chan send, 17 minutes]:
[WARNING] [09:57:15+0000] testing.tRunner.func1(0xc42020bd10)
[WARNING] [09:57:15+0000] 	/usr/local/go/src/testing/testing.go:741 +0x19b
[WARNING] [09:57:15+0000] testing.tRunner(0xc42020bd10, 0xc420401ac0)
[WARNING] [09:57:15+0000] 	/usr/local/go/src/testing/testing.go:748 +0xda
[WARNING] [09:57:15+0000] created by testing.(*T).Run
[WARNING] [09:57:15+0000] 	/usr/local/go/src/testing/testing.go:789 +0x2de
[WARNING] [09:57:15+0000] goroutine 75 [chan send, 18 minutes]:
[WARNING] [09:57:15+0000] testing.tRunner.func1(0xc42020be00)
[WARNING] [09:57:15+0000] 	/usr/local/go/src/testing/testing.go:741 +0x19b
[WARNING] [09:57:15+0000] testing.tRunner(0xc42020be00, 0xc420401b40)
[WARNING] [09:57:15+0000] 	/usr/local/go/src/testing/testing.go:748 +0xda
[WARNING] [09:57:15+0000] created by testing.(*T).Run
[WARNING] [09:57:15+0000] 	/usr/local/go/src/testing/testing.go:789 +0x2de
[WARNING] [09:57:15+0000] goroutine 76 [chan send, 18 minutes]:
[WARNING] [09:57:15+0000] testing.tRunner.func1(0xc42020bef0)
[WARNING] [09:57:15+0000] 	/usr/local/go/src/testing/testing.go:741 +0x19b
[WARNING] [09:57:15+0000] testing.tRunner(0xc42020bef0, 0xc420401bc0)
[WARNING] [09:57:15+0000] 	/usr/local/go/src/testing/testing.go:748 +0xda
[WARNING] [09:57:15+0000] created by testing.(*T).Run
[WARNING] [09:57:15+0000] 	/usr/local/go/src/testing/testing.go:789 +0x2de
[WARNING] [09:57:15+0000] goroutine 77 [chan send, 18 minutes]:
[WARNING] [09:57:15+0000] testing.tRunner.func1(0xc420298000)
[WARNING] [09:57:15+0000] 	/usr/local/go/src/testing/testing.go:741 +0x19b
[WARNING] [09:57:15+0000] testing.tRunner(0xc420298000, 0xc420401c40)
[WARNING] [09:57:15+0000] 	/usr/local/go/src/testing/testing.go:748 +0xda
[WARNING] [09:57:15+0000] created by testing.(*T).Run
[WARNING] [09:57:15+0000] 	/usr/local/go/src/testing/testing.go:789 +0x2de
[WARNING] [09:57:15+0000] goroutine 78 [chan send, 19 minutes]:
[WARNING] [09:57:15+0000] testing.tRunner.func1(0xc4202980f0)
[WARNING] [09:57:15+0000] 	/usr/local/go/src/testing/testing.go:741 +0x19b
[WARNING] [09:57:15+0000] testing.tRunner(0xc4202980f0, 0xc420401cc0)
[WARNING] [09:57:15+0000] 	/usr/local/go/src/testing/testing.go:748 +0xda
[WARNING] [09:57:15+0000] created by testing.(*T).Run
[WARNING] [09:57:15+0000] 	/usr/local/go/src/testing/testing.go:789 +0x2de
[WARNING] [09:57:15+0000] goroutine 79 [chan send, 19 minutes]:
[WARNING] [09:57:15+0000] testing.tRunner.func1(0xc4202981e0)
[WARNING] [09:57:15+0000] 	/usr/local/go/src/testing/testing.go:741 +0x19b
[WARNING] [09:57:15+0000] testing.tRunner(0xc4202981e0, 0xc420401d40)
[WARNING] [09:57:15+0000] 	/usr/local/go/src/testing/testing.go:748 +0xda
[WARNING] [09:57:15+0000] created by testing.(*T).Run
[WARNING] [09:57:15+0000] 	/usr/local/go/src/testing/testing.go:789 +0x2de
[WARNING] [09:57:15+0000] goroutine 80 [chan send, 19 minutes]:
[WARNING] [09:57:15+0000] testing.tRunner.func1(0xc4202982d0)
[WARNING] [09:57:15+0000] 	/usr/local/go/src/testing/testing.go:741 +0x19b
[WARNING] [09:57:15+0000] testing.tRunner(0xc4202982d0, 0xc420401dc0)
[WARNING] [09:57:15+0000] 	/usr/local/go/src/testing/testing.go:748 +0xda
[WARNING] [09:57:15+0000] created by testing.(*T).Run
[WARNING] [09:57:15+0000] 	/usr/local/go/src/testing/testing.go:789 +0x2de
[WARNING] [09:57:15+0000] goroutine 81 [chan send, 19 minutes]:
[WARNING] [09:57:15+0000] testing.tRunner.func1(0xc4202983c0)
[WARNING] [09:57:15+0000] 	/usr/local/go/src/testing/testing.go:741 +0x19b
[WARNING] [09:57:15+0000] testing.tRunner(0xc4202983c0, 0xc420401e40)
[WARNING] [09:57:15+0000] 	/usr/local/go/src/testing/testing.go:748 +0xda
[WARNING] [09:57:15+0000] created by testing.(*T).Run
[WARNING] [09:57:15+0000] 	/usr/local/go/src/testing/testing.go:789 +0x2de
[WARNING] [09:57:15+0000] goroutine 82 [chan send, 19 minutes]:
[WARNING] [09:57:15+0000] testing.tRunner.func1(0xc4202984b0)
[WARNING] [09:57:15+0000] 	/usr/local/go/src/testing/testing.go:741 +0x19b
[WARNING] [09:57:15+0000] testing.tRunner(0xc4202984b0, 0xc420401ec0)
[WARNING] [09:57:15+0000] 	/usr/local/go/src/testing/testing.go:748 +0xda
[WARNING] [09:57:15+0000] created by testing.(*T).Run
[WARNING] [09:57:15+0000] 	/usr/local/go/src/testing/testing.go:789 +0x2de
[WARNING] [09:57:15+0000] goroutine 83 [chan send, 19 minutes]:
[WARNING] [09:57:15+0000] testing.tRunner.func1(0xc4202985a0)
[WARNING] [09:57:15+0000] 	/usr/local/go/src/testing/testing.go:741 +0x19b
[WARNING] [09:57:15+0000] testing.tRunner(0xc4202985a0, 0xc420401f40)
[WARNING] [09:57:15+0000] 	/usr/local/go/src/testing/testing.go:748 +0xda
[WARNING] [09:57:15+0000] created by testing.(*T).Run
[WARNING] [09:57:15+0000] 	/usr/local/go/src/testing/testing.go:789 +0x2de
[WARNING] [09:57:15+0000] goroutine 84 [chan send, 19 minutes]:
[WARNING] [09:57:15+0000] testing.tRunner.func1(0xc420298690)
[WARNING] [09:57:15+0000] 	/usr/local/go/src/testing/testing.go:741 +0x19b
[WARNING] [09:57:15+0000] testing.tRunner(0xc420298690, 0xc420401fc0)
[WARNING] [09:57:15+0000] 	/usr/local/go/src/testing/testing.go:748 +0xda
[WARNING] [09:57:15+0000] created by testing.(*T).Run
[WARNING] [09:57:15+0000] 	/usr/local/go/src/testing/testing.go:789 +0x2de
[WARNING] [09:57:15+0000] goroutine 85 [chan send, 19 minutes]:
[WARNING] [09:57:15+0000] testing.tRunner.func1(0xc420298780)
[WARNING] [09:57:15+0000] 	/usr/local/go/src/testing/testing.go:741 +0x19b
[WARNING] [09:57:15+0000] testing.tRunner(0xc420298780, 0xc42029c040)
[WARNING] [09:57:15+0000] 	/usr/local/go/src/testing/testing.go:748 +0xda
[WARNING] [09:57:15+0000] created by testing.(*T).Run
[WARNING] [09:57:15+0000] 	/usr/local/go/src/testing/testing.go:789 +0x2de
[WARNING] [09:57:15+0000] goroutine 86 [chan send, 16 minutes]:
[WARNING] [09:57:15+0000] testing.tRunner.func1(0xc420298870)
[WARNING] [09:57:15+0000] 	/usr/local/go/src/testing/testing.go:741 +0x19b
[WARNING] [09:57:15+0000] testing.tRunner(0xc420298870, 0xc42029c0c0)
[WARNING] [09:57:15+0000] 	/usr/local/go/src/testing/testing.go:748 +0xda
[WARNING] [09:57:15+0000] created by testing.(*T).Run
[WARNING] [09:57:15+0000] 	/usr/local/go/src/testing/testing.go:789 +0x2de
[WARNING] [09:57:15+0000] goroutine 87 [chan send, 19 minutes]:
[WARNING] [09:57:15+0000] testing.tRunner.func1(0xc420298960)
[WARNING] [09:57:15+0000] 	/usr/local/go/src/testing/testing.go:741 +0x19b
[WARNING] [09:57:15+0000] testing.tRunner(0xc420298960, 0xc42029c140)
[WARNING] [09:57:15+0000] 	/usr/local/go/src/testing/testing.go:748 +0xda
[WARNING] [09:57:15+0000] created by testing.(*T).Run
[WARNING] [09:57:15+0000] 	/usr/local/go/src/testing/testing.go:789 +0x2de
[WARNING] [09:57:15+0000] goroutine 88 [chan send, 19 minutes]:
[WARNING] [09:57:15+0000] testing.tRunner.func1(0xc420298a50)
[WARNING] [09:57:15+0000] 	/usr/local/go/src/testing/testing.go:741 +0x19b
[WARNING] [09:57:15+0000] testing.tRunner(0xc420298a50, 0xc42029c1c0)
[WARNING] [09:57:15+0000] 	/usr/local/go/src/testing/testing.go:748 +0xda
[WARNING] [09:57:15+0000] created by testing.(*T).Run
[WARNING] [09:57:15+0000] 	/usr/local/go/src/testing/testing.go:789 +0x2de
[WARNING] [09:57:15+0000] goroutine 89 [chan send, 19 minutes]:
[WARNING] [09:57:15+0000] testing.tRunner.func1(0xc420298b40)
[WARNING] [09:57:15+0000] 	/usr/local/go/src/testing/testing.go:741 +0x19b
[WARNING] [09:57:15+0000] testing.tRunner(0xc420298b40, 0xc42029c240)
[WARNING] [09:57:15+0000] 	/usr/local/go/src/testing/testing.go:748 +0xda
[WARNING] [09:57:15+0000] created by testing.(*T).Run
[WARNING] [09:57:15+0000] 	/usr/local/go/src/testing/testing.go:789 +0x2de
[WARNING] [09:57:15+0000] goroutine 90 [chan send, 19 minutes]:
[WARNING] [09:57:15+0000] testing.tRunner.func1(0xc420298c30)
[WARNING] [09:57:15+0000] 	/usr/local/go/src/testing/testing.go:741 +0x19b
[WARNING] [09:57:15+0000] testing.tRunner(0xc420298c30, 0xc42029c2c0)
[WARNING] [09:57:15+0000] 	/usr/local/go/src/testing/testing.go:748 +0xda
[WARNING] [09:57:15+0000] created by testing.(*T).Run
[WARNING] [09:57:15+0000] 	/usr/local/go/src/testing/testing.go:789 +0x2de
[WARNING] [09:57:15+0000] goroutine 91 [chan send, 20 minutes]:
[WARNING] [09:57:15+0000] testing.tRunner.func1(0xc420298d20)
[WARNING] [09:57:15+0000] 	/usr/local/go/src/testing/testing.go:741 +0x19b
[WARNING] [09:57:15+0000] testing.tRunner(0xc420298d20, 0xc42029c340)
[WARNING] [09:57:15+0000] 	/usr/local/go/src/testing/testing.go:748 +0xda
[WARNING] [09:57:15+0000] created by testing.(*T).Run
[WARNING] [09:57:15+0000] 	/usr/local/go/src/testing/testing.go:789 +0x2de
[WARNING] [09:57:15+0000] goroutine 92 [chan send, 20 minutes]:
[WARNING] [09:57:15+0000] testing.tRunner.func1(0xc420298e10)
[WARNING] [09:57:15+0000] 	/usr/local/go/src/testing/testing.go:741 +0x19b
[WARNING] [09:57:15+0000] testing.tRunner(0xc420298e10, 0xc42029c3c0)
[WARNING] [09:57:15+0000] 	/usr/local/go/src/testing/testing.go:748 +0xda
[WARNING] [09:57:15+0000] created by testing.(*T).Run
[WARNING] [09:57:15+0000] 	/usr/local/go/src/testing/testing.go:789 +0x2de
[WARNING] [09:57:15+0000] goroutine 93 [chan send, 20 minutes]:
[WARNING] [09:57:15+0000] testing.tRunner.func1(0xc420298f00)
[WARNING] [09:57:15+0000] 	/usr/local/go/src/testing/testing.go:741 +0x19b
[WARNING] [09:57:15+0000] testing.tRunner(0xc420298f00, 0xc42029c440)
[WARNING] [09:57:15+0000] 	/usr/local/go/src/testing/testing.go:748 +0xda
[WARNING] [09:57:15+0000] created by testing.(*T).Run
[WARNING] [09:57:15+0000] 	/usr/local/go/src/testing/testing.go:789 +0x2de
[WARNING] [09:57:15+0000] goroutine 94 [chan send, 20 minutes]:
[WARNING] [09:57:15+0000] testing.tRunner.func1(0xc420298ff0)
[WARNING] [09:57:15+0000] 	/usr/local/go/src/testing/testing.go:741 +0x19b
[WARNING] [09:57:15+0000] testing.tRunner(0xc420298ff0, 0xc42029c4c0)
[WARNING] [09:57:15+0000] 	/usr/local/go/src/testing/testing.go:748 +0xda
[WARNING] [09:57:15+0000] created by testing.(*T).Run
[WARNING] [09:57:15+0000] 	/usr/local/go/src/testing/testing.go:789 +0x2de
[WARNING] [09:57:15+0000] goroutine 95 [chan send, 21 minutes]:
[WARNING] [09:57:15+0000] testing.tRunner.func1(0xc4202990e0)
[WARNING] [09:57:15+0000] 	/usr/local/go/src/testing/testing.go:741 +0x19b
[WARNING] [09:57:15+0000] testing.tRunner(0xc4202990e0, 0xc42029c540)
[WARNING] [09:57:15+0000] 	/usr/local/go/src/testing/testing.go:748 +0xda
[WARNING] [09:57:15+0000] created by testing.(*T).Run
[WARNING] [09:57:15+0000] 	/usr/local/go/src/testing/testing.go:789 +0x2de
[WARNING] [09:57:15+0000] goroutine 96 [chan send, 21 minutes]:
[WARNING] [09:57:15+0000] testing.tRunner.func1(0xc4202991d0)
[WARNING] [09:57:15+0000] 	/usr/local/go/src/testing/testing.go:741 +0x19b
[WARNING] [09:57:15+0000] testing.tRunner(0xc4202991d0, 0xc42029c5c0)
[WARNING] [09:57:15+0000] 	/usr/local/go/src/testing/testing.go:748 +0xda
[WARNING] [09:57:15+0000] created by testing.(*T).Run
[WARNING] [09:57:15+0000] 	/usr/local/go/src/testing/testing.go:789 +0x2de
[WARNING] [09:57:15+0000] goroutine 97 [chan send, 21 minutes]:
[WARNING] [09:57:15+0000] testing.tRunner.func1(0xc4202992c0)
[WARNING] [09:57:15+0000] 	/usr/local/go/src/testing/testing.go:741 +0x19b
[WARNING] [09:57:15+0000] testing.tRunner(0xc4202992c0, 0xc42029c640)
[WARNING] [09:57:15+0000] 	/usr/local/go/src/testing/testing.go:748 +0xda
[WARNING] [09:57:15+0000] created by testing.(*T).Run
[WARNING] [09:57:15+0000] 	/usr/local/go/src/testing/testing.go:789 +0x2de
[WARNING] [09:57:15+0000] goroutine 98 [chan send, 21 minutes]:
[WARNING] [09:57:15+0000] testing.tRunner.func1(0xc4202993b0)
[WARNING] [09:57:15+0000] 	/usr/local/go/src/testing/testing.go:741 +0x19b
[WARNING] [09:57:15+0000] testing.tRunner(0xc4202993b0, 0xc42029c6c0)
[WARNING] [09:57:15+0000] 	/usr/local/go/src/testing/testing.go:748 +0xda
[WARNING] [09:57:15+0000] created by testing.(*T).Run
[WARNING] [09:57:15+0000] 	/usr/local/go/src/testing/testing.go:789 +0x2de
[WARNING] [09:57:15+0000] goroutine 99 [chan send, 22 minutes]:
[WARNING] [09:57:15+0000] testing.tRunner.func1(0xc4202994a0)
[WARNING] [09:57:15+0000] 	/usr/local/go/src/testing/testing.go:741 +0x19b
[WARNING] [09:57:15+0000] testing.tRunner(0xc4202994a0, 0xc42029c740)
[WARNING] [09:57:15+0000] 	/usr/local/go/src/testing/testing.go:748 +0xda
[WARNING] [09:57:15+0000] created by testing.(*T).Run
[WARNING] [09:57:15+0000] 	/usr/local/go/src/testing/testing.go:789 +0x2de
[WARNING] [09:57:15+0000] goroutine 100 [chan send, 22 minutes]:
[WARNING] [09:57:15+0000] testing.tRunner.func1(0xc420299590)
[WARNING] [09:57:15+0000] 	/usr/local/go/src/testing/testing.go:741 +0x19b
[WARNING] [09:57:15+0000] testing.tRunner(0xc420299590, 0xc42029c7c0)
[WARNING] [09:57:15+0000] 	/usr/local/go/src/testing/testing.go:748 +0xda
[WARNING] [09:57:15+0000] created by testing.(*T).Run
[WARNING] [09:57:15+0000] 	/usr/local/go/src/testing/testing.go:789 +0x2de
[WARNING] [09:57:15+0000] goroutine 101 [chan send, 22 minutes]:
[WARNING] [09:57:15+0000] testing.tRunner.func1(0xc420299680)
[WARNING] [09:57:15+0000] 	/usr/local/go/src/testing/testing.go:741 +0x19b
[WARNING] [09:57:15+0000] testing.tRunner(0xc420299680, 0xc42029c840)
[WARNING] [09:57:15+0000] 	/usr/local/go/src/testing/testing.go:748 +0xda
[WARNING] [09:57:15+0000] created by testing.(*T).Run
[WARNING] [09:57:15+0000] 	/usr/local/go/src/testing/testing.go:789 +0x2de
[WARNING] [09:57:15+0000] goroutine 102 [chan send, 22 minutes]:
[WARNING] [09:57:15+0000] testing.tRunner.func1(0xc420299770)
[WARNING] [09:57:15+0000] 	/usr/local/go/src/testing/testing.go:741 +0x19b
[WARNING] [09:57:15+0000] testing.tRunner(0xc420299770, 0xc42029c8c0)
[WARNING] [09:57:15+0000] 	/usr/local/go/src/testing/testing.go:748 +0xda
[WARNING] [09:57:15+0000] created by testing.(*T).Run
[WARNING] [09:57:15+0000] 	/usr/local/go/src/testing/testing.go:789 +0x2de
[WARNING] [09:57:15+0000] goroutine 103 [chan send, 22 minutes]:
[WARNING] [09:57:15+0000] testing.tRunner.func1(0xc420299860)
[WARNING] [09:57:15+0000] 	/usr/local/go/src/testing/testing.go:741 +0x19b
[WARNING] [09:57:15+0000] testing.tRunner(0xc420299860, 0xc42029c940)
[WARNING] [09:57:15+0000] 	/usr/local/go/src/testing/testing.go:748 +0xda
[WARNING] [09:57:15+0000] created by testing.(*T).Run
[WARNING] [09:57:15+0000] 	/usr/local/go/src/testing/testing.go:789 +0x2de
[WARNING] [09:57:15+0000] goroutine 104 [chan send, 23 minutes]:
[WARNING] [09:57:15+0000] testing.tRunner.func1(0xc420299950)
[WARNING] [09:57:15+0000] 	/usr/local/go/src/testing/testing.go:741 +0x19b
[WARNING] [09:57:15+0000] testing.tRunner(0xc420299950, 0xc42029c9c0)
[WARNING] [09:57:15+0000] 	/usr/local/go/src/testing/testing.go:748 +0xda
[WARNING] [09:57:15+0000] created by testing.(*T).Run
[WARNING] [09:57:15+0000] 	/usr/local/go/src/testing/testing.go:789 +0x2de
[WARNING] [09:57:15+0000] goroutine 105 [chan send, 23 minutes]:
[WARNING] [09:57:15+0000] testing.tRunner.func1(0xc420299a40)
[WARNING] [09:57:15+0000] 	/usr/local/go/src/testing/testing.go:741 +0x19b
[WARNING] [09:57:15+0000] testing.tRunner(0xc420299a40, 0xc42029ca40)
[WARNING] [09:57:15+0000] 	/usr/local/go/src/testing/testing.go:748 +0xda
[WARNING] [09:57:15+0000] created by testing.(*T).Run
[WARNING] [09:57:15+0000] 	/usr/local/go/src/testing/testing.go:789 +0x2de
[WARNING] [09:57:15+0000] goroutine 106 [chan send, 23 minutes]:
[WARNING] [09:57:15+0000] testing.tRunner.func1(0xc420299b30)
[WARNING] [09:57:15+0000] 	/usr/local/go/src/testing/testing.go:741 +0x19b
[WARNING] [09:57:15+0000] testing.tRunner(0xc420299b30, 0xc42029cac0)
[WARNING] [09:57:15+0000] 	/usr/local/go/src/testing/testing.go:748 +0xda
[WARNING] [09:57:15+0000] created by testing.(*T).Run
[WARNING] [09:57:15+0000] 	/usr/local/go/src/testing/testing.go:789 +0x2de
[WARNING] [09:57:15+0000] goroutine 107 [chan send, 23 minutes]:
[WARNING] [09:57:15+0000] testing.tRunner.func1(0xc420299c20)
[WARNING] [09:57:15+0000] 	/usr/local/go/src/testing/testing.go:741 +0x19b
[WARNING] [09:57:15+0000] testing.tRunner(0xc420299c20, 0xc42029cb40)
[WARNING] [09:57:15+0000] 	/usr/local/go/src/testing/testing.go:748 +0xda
[WARNING] [09:57:15+0000] created by testing.(*T).Run
[WARNING] [09:57:15+0000] 	/usr/local/go/src/testing/testing.go:789 +0x2de
[WARNING] [09:57:15+0000] goroutine 108 [chan send, 23 minutes]:
[WARNING] [09:57:15+0000] testing.tRunner.func1(0xc420299d10)
[WARNING] [09:57:15+0000] 	/usr/local/go/src/testing/testing.go:741 +0x19b
[WARNING] [09:57:15+0000] testing.tRunner(0xc420299d10, 0xc42029cbc0)
[WARNING] [09:57:15+0000] 	/usr/local/go/src/testing/testing.go:748 +0xda
[WARNING] [09:57:15+0000] created by testing.(*T).Run
[WARNING] [09:57:15+0000] 	/usr/local/go/src/testing/testing.go:789 +0x2de
[WARNING] [09:57:15+0000] goroutine 109 [chan send, 23 minutes]:
[WARNING] [09:57:15+0000] testing.tRunner.func1(0xc420299e00)
[WARNING] [09:57:15+0000] 	/usr/local/go/src/testing/testing.go:741 +0x19b
[WARNING] [09:57:15+0000] testing.tRunner(0xc420299e00, 0xc42029cc40)
[WARNING] [09:57:15+0000] 	/usr/local/go/src/testing/testing.go:748 +0xda
[WARNING] [09:57:15+0000] created by testing.(*T).Run
[WARNING] [09:57:15+0000] 	/usr/local/go/src/testing/testing.go:789 +0x2de
[WARNING] [09:57:15+0000] goroutine 110 [chan send, 24 minutes]:
[WARNING] [09:57:15+0000] testing.tRunner.func1(0xc420299ef0)
[WARNING] [09:57:15+0000] 	/usr/local/go/src/testing/testing.go:741 +0x19b
[WARNING] [09:57:15+0000] testing.tRunner(0xc420299ef0, 0xc42029ccc0)
[WARNING] [09:57:15+0000] 	/usr/local/go/src/testing/testing.go:748 +0xda
[WARNING] [09:57:15+0000] created by testing.(*T).Run
[WARNING] [09:57:15+0000] 	/usr/local/go/src/testing/testing.go:789 +0x2de
[WARNING] [09:57:15+0000] goroutine 111 [chan send, 24 minutes]:
[WARNING] [09:57:15+0000] testing.tRunner.func1(0xc4202e8000)
[WARNING] [09:57:15+0000] 	/usr/local/go/src/testing/testing.go:741 +0x19b
[WARNING] [09:57:15+0000] testing.tRunner(0xc4202e8000, 0xc42029cd40)
[WARNING] [09:57:15+0000] 	/usr/local/go/src/testing/testing.go:748 +0xda
[WARNING] [09:57:15+0000] created by testing.(*T).Run
[WARNING] [09:57:15+0000] 	/usr/local/go/src/testing/testing.go:789 +0x2de
[WARNING] [09:57:15+0000] goroutine 112 [chan send, 38 minutes]:
[WARNING] [09:57:15+0000] testing.tRunner.func1(0xc4202e80f0)
[WARNING] [09:57:15+0000] 	/usr/local/go/src/testing/testing.go:741 +0x19b
[WARNING] [09:57:15+0000] testing.tRunner(0xc4202e80f0, 0xc42029cdc0)
[WARNING] [09:57:15+0000] 	/usr/local/go/src/testing/testing.go:748 +0xda
[WARNING] [09:57:15+0000] created by testing.(*T).Run
[WARNING] [09:57:15+0000] 	/usr/local/go/src/testing/testing.go:789 +0x2de
[WARNING] [09:57:15+0000] goroutine 113 [chan send, 24 minutes]:
[WARNING] [09:57:15+0000] testing.tRunner.func1(0xc4202e81e0)
[WARNING] [09:57:15+0000] 	/usr/local/go/src/testing/testing.go:741 +0x19b
[WARNING] [09:57:15+0000] testing.tRunner(0xc4202e81e0, 0xc42029ce40)
[WARNING] [09:57:15+0000] 	/usr/local/go/src/testing/testing.go:748 +0xda
[WARNING] [09:57:15+0000] created by testing.(*T).Run
[WARNING] [09:57:15+0000] 	/usr/local/go/src/testing/testing.go:789 +0x2de
[WARNING] [09:57:15+0000] goroutine 114 [chan send, 24 minutes]:
[WARNING] [09:57:15+0000] testing.tRunner.func1(0xc4202e82d0)
[WARNING] [09:57:15+0000] 	/usr/local/go/src/testing/testing.go:741 +0x19b
[WARNING] [09:57:15+0000] testing.tRunner(0xc4202e82d0, 0xc42029cec0)
[WARNING] [09:57:15+0000] 	/usr/local/go/src/testing/testing.go:748 +0xda
[WARNING] [09:57:15+0000] created by testing.(*T).Run
[WARNING] [09:57:15+0000] 	/usr/local/go/src/testing/testing.go:789 +0x2de
[WARNING] [09:57:15+0000] goroutine 115 [chan send, 24 minutes]:
[WARNING] [09:57:15+0000] testing.tRunner.func1(0xc4202e83c0)
[WARNING] [09:57:15+0000] 	/usr/local/go/src/testing/testing.go:741 +0x19b
[WARNING] [09:57:15+0000] testing.tRunner(0xc4202e83c0, 0xc42029cf40)
[WARNING] [09:57:15+0000] 	/usr/local/go/src/testing/testing.go:748 +0xda
[WARNING] [09:57:15+0000] created by testing.(*T).Run
[WARNING] [09:57:15+0000] 	/usr/local/go/src/testing/testing.go:789 +0x2de
[WARNING] [09:57:15+0000] goroutine 116 [chan send, 24 minutes]:
[WARNING] [09:57:15+0000] testing.tRunner.func1(0xc4202e84b0)
[WARNING] [09:57:15+0000] 	/usr/local/go/src/testing/testing.go:741 +0x19b
[WARNING] [09:57:15+0000] testing.tRunner(0xc4202e84b0, 0xc42029cfc0)
[WARNING] [09:57:15+0000] 	/usr/local/go/src/testing/testing.go:748 +0xda
[WARNING] [09:57:15+0000] created by testing.(*T).Run
[WARNING] [09:57:15+0000] 	/usr/local/go/src/testing/testing.go:789 +0x2de
[WARNING] [09:57:15+0000] goroutine 117 [chan send, 24 minutes]:
[WARNING] [09:57:15+0000] testing.tRunner.func1(0xc4202e85a0)
[WARNING] [09:57:15+0000] 	/usr/local/go/src/testing/testing.go:741 +0x19b
[WARNING] [09:57:15+0000] testing.tRunner(0xc4202e85a0, 0xc42029d040)
[WARNING] [09:57:15+0000] 	/usr/local/go/src/testing/testing.go:748 +0xda
[WARNING] [09:57:15+0000] created by testing.(*T).Run
[WARNING] [09:57:15+0000] 	/usr/local/go/src/testing/testing.go:789 +0x2de
[WARNING] [09:57:15+0000] goroutine 118 [chan send, 23 minutes]:
[WARNING] [09:57:15+0000] testing.tRunner.func1(0xc4202e8690)
[WARNING] [09:57:15+0000] 	/usr/local/go/src/testing/testing.go:741 +0x19b
[WARNING] [09:57:15+0000] testing.tRunner(0xc4202e8690, 0xc42029d0c0)
[WARNING] [09:57:15+0000] 	/usr/local/go/src/testing/testing.go:748 +0xda
[WARNING] [09:57:15+0000] created by testing.(*T).Run
[WARNING] [09:57:15+0000] 	/usr/local/go/src/testing/testing.go:789 +0x2de
[WARNING] [09:57:15+0000] goroutine 119 [chan send, 24 minutes]:
[WARNING] [09:57:15+0000] testing.tRunner.func1(0xc4202e8780)
[WARNING] [09:57:15+0000] 	/usr/local/go/src/testing/testing.go:741 +0x19b
[WARNING] [09:57:15+0000] testing.tRunner(0xc4202e8780, 0xc42029d140)
[WARNING] [09:57:15+0000] 	/usr/local/go/src/testing/testing.go:748 +0xda
[WARNING] [09:57:15+0000] created by testing.(*T).Run
[WARNING] [09:57:15+0000] 	/usr/local/go/src/testing/testing.go:789 +0x2de
[WARNING] [09:57:15+0000] goroutine 120 [chan send, 24 minutes]:
[WARNING] [09:57:15+0000] testing.tRunner.func1(0xc4202e8870)
[WARNING] [09:57:15+0000] 	/usr/local/go/src/testing/testing.go:741 +0x19b
[WARNING] [09:57:15+0000] testing.tRunner(0xc4202e8870, 0xc42029d1c0)
[WARNING] [09:57:15+0000] 	/usr/local/go/src/testing/testing.go:748 +0xda
[WARNING] [09:57:15+0000] created by testing.(*T).Run
[WARNING] [09:57:15+0000] 	/usr/local/go/src/testing/testing.go:789 +0x2de
[WARNING] [09:57:15+0000] goroutine 121 [chan send, 24 minutes]:
[WARNING] [09:57:15+0000] testing.tRunner.func1(0xc4202e8960)
[WARNING] [09:57:15+0000] 	/usr/local/go/src/testing/testing.go:741 +0x19b
[WARNING] [09:57:15+0000] testing.tRunner(0xc4202e8960, 0xc42029d240)
[WARNING] [09:57:15+0000] 	/usr/local/go/src/testing/testing.go:748 +0xda
[WARNING] [09:57:15+0000] created by testing.(*T).Run
[WARNING] [09:57:15+0000] 	/usr/local/go/src/testing/testing.go:789 +0x2de
[WARNING] [09:57:15+0000] goroutine 122 [chan send, 24 minutes]:
[WARNING] [09:57:15+0000] testing.tRunner.func1(0xc4202e8a50)
[WARNING] [09:57:15+0000] 	/usr/local/go/src/testing/testing.go:741 +0x19b
[WARNING] [09:57:15+0000] testing.tRunner(0xc4202e8a50, 0xc42029d2c0)
[WARNING] [09:57:15+0000] 	/usr/local/go/src/testing/testing.go:748 +0xda
[WARNING] [09:57:15+0000] created by testing.(*T).Run
[WARNING] [09:57:15+0000] 	/usr/local/go/src/testing/testing.go:789 +0x2de
[WARNING] [09:57:15+0000] goroutine 123 [chan send, 24 minutes]:
[WARNING] [09:57:15+0000] testing.tRunner.func1(0xc4202e8b40)
[WARNING] [09:57:15+0000] 	/usr/local/go/src/testing/testing.go:741 +0x19b
[WARNING] [09:57:15+0000] testing.tRunner(0xc4202e8b40, 0xc42029d340)
[WARNING] [09:57:15+0000] 	/usr/local/go/src/testing/testing.go:748 +0xda
[WARNING] [09:57:15+0000] created by testing.(*T).Run
[WARNING] [09:57:15+0000] 	/usr/local/go/src/testing/testing.go:789 +0x2de
[WARNING] [09:57:15+0000] goroutine 124 [chan send, 25 minutes]:
[WARNING] [09:57:15+0000] testing.tRunner.func1(0xc4202e8c30)
[WARNING] [09:57:15+0000] 	/usr/local/go/src/testing/testing.go:741 +0x19b
[WARNING] [09:57:15+0000] testing.tRunner(0xc4202e8c30, 0xc42029d3c0)
[WARNING] [09:57:15+0000] 	/usr/local/go/src/testing/testing.go:748 +0xda
[WARNING] [09:57:15+0000] created by testing.(*T).Run
[WARNING] [09:57:15+0000] 	/usr/local/go/src/testing/testing.go:789 +0x2de
[WARNING] [09:57:15+0000] goroutine 125 [chan send, 25 minutes]:
[WARNING] [09:57:15+0000] testing.tRunner.func1(0xc4202e8d20)
[WARNING] [09:57:15+0000] 	/usr/local/go/src/testing/testing.go:741 +0x19b
[WARNING] [09:57:15+0000] testing.tRunner(0xc4202e8d20, 0xc42029d440)
[WARNING] [09:57:15+0000] 	/usr/local/go/src/testing/testing.go:748 +0xda
[WARNING] [09:57:15+0000] created by testing.(*T).Run
[WARNING] [09:57:15+0000] 	/usr/local/go/src/testing/testing.go:789 +0x2de
[WARNING] [09:57:15+0000] goroutine 126 [chan send, 26 minutes]:
[WARNING] [09:57:15+0000] testing.tRunner.func1(0xc4202e8e10)
[WARNING] [09:57:15+0000] 	/usr/local/go/src/testing/testing.go:741 +0x19b
[WARNING] [09:57:15+0000] testing.tRunner(0xc4202e8e10, 0xc42029d4c0)
[WARNING] [09:57:15+0000] 	/usr/local/go/src/testing/testing.go:748 +0xda
[WARNING] [09:57:15+0000] created by testing.(*T).Run
[WARNING] [09:57:15+0000] 	/usr/local/go/src/testing/testing.go:789 +0x2de
[WARNING] [09:57:15+0000] goroutine 127 [chan send, 26 minutes]:
[WARNING] [09:57:15+0000] testing.tRunner.func1(0xc4202e8f00)
[WARNING] [09:57:15+0000] 	/usr/local/go/src/testing/testing.go:741 +0x19b
[WARNING] [09:57:15+0000] testing.tRunner(0xc4202e8f00, 0xc42029d540)
[WARNING] [09:57:15+0000] 	/usr/local/go/src/testing/testing.go:748 +0xda
[WARNING] [09:57:15+0000] created by testing.(*T).Run
[WARNING] [09:57:15+0000] 	/usr/local/go/src/testing/testing.go:789 +0x2de
[WARNING] [09:57:15+0000] goroutine 128 [chan send, 26 minutes]:
[WARNING] [09:57:15+0000] testing.tRunner.func1(0xc4202e8ff0)
[WARNING] [09:57:15+0000] 	/usr/local/go/src/testing/testing.go:741 +0x19b
[WARNING] [09:57:15+0000] testing.tRunner(0xc4202e8ff0, 0xc42029d5c0)
[WARNING] [09:57:15+0000] 	/usr/local/go/src/testing/testing.go:748 +0xda
[WARNING] [09:57:15+0000] created by testing.(*T).Run
[WARNING] [09:57:15+0000] 	/usr/local/go/src/testing/testing.go:789 +0x2de
[WARNING] [09:57:15+0000] goroutine 129 [chan send, 26 minutes]:
[WARNING] [09:57:15+0000] testing.tRunner.func1(0xc4202e90e0)
[WARNING] [09:57:15+0000] 	/usr/local/go/src/testing/testing.go:741 +0x19b
[WARNING] [09:57:15+0000] testing.tRunner(0xc4202e90e0, 0xc42029d640)
[WARNING] [09:57:15+0000] 	/usr/local/go/src/testing/testing.go:748 +0xda
[WARNING] [09:57:15+0000] created by testing.(*T).Run
[WARNING] [09:57:15+0000] 	/usr/local/go/src/testing/testing.go:789 +0x2de
[WARNING] [09:57:15+0000] goroutine 130 [chan send, 26 minutes]:
[WARNING] [09:57:15+0000] testing.tRunner.func1(0xc4202e91d0)
[WARNING] [09:57:15+0000] 	/usr/local/go/src/testing/testing.go:741 +0x19b
[WARNING] [09:57:15+0000] testing.tRunner(0xc4202e91d0, 0xc42029d6c0)
[WARNING] [09:57:15+0000] 	/usr/local/go/src/testing/testing.go:748 +0xda
[WARNING] [09:57:15+0000] created by testing.(*T).Run
[WARNING] [09:57:15+0000] 	/usr/local/go/src/testing/testing.go:789 +0x2de
[WARNING] [09:57:15+0000] goroutine 131 [chan send, 27 minutes]:
[WARNING] [09:57:15+0000] testing.tRunner.func1(0xc4202e92c0)
[WARNING] [09:57:15+0000] 	/usr/local/go/src/testing/testing.go:741 +0x19b
[WARNING] [09:57:15+0000] testing.tRunner(0xc4202e92c0, 0xc42029d740)
[WARNING] [09:57:15+0000] 	/usr/local/go/src/testing/testing.go:748 +0xda
[WARNING] [09:57:15+0000] created by testing.(*T).Run
[WARNING] [09:57:15+0000] 	/usr/local/go/src/testing/testing.go:789 +0x2de
[WARNING] [09:57:15+0000] goroutine 132 [chan send, 19 minutes]:
[WARNING] [09:57:15+0000] testing.tRunner.func1(0xc4202e93b0)
[WARNING] [09:57:15+0000] 	/usr/local/go/src/testing/testing.go:741 +0x19b
[WARNING] [09:57:15+0000] testing.tRunner(0xc4202e93b0, 0xc42029d7c0)
[WARNING] [09:57:15+0000] 	/usr/local/go/src/testing/testing.go:748 +0xda
[WARNING] [09:57:15+0000] created by testing.(*T).Run
[WARNING] [09:57:15+0000] 	/usr/local/go/src/testing/testing.go:789 +0x2de
[WARNING] [09:57:15+0000] goroutine 133 [chan send, 22 minutes]:
[WARNING] [09:57:15+0000] testing.tRunner.func1(0xc4202e94a0)
[WARNING] [09:57:15+0000] 	/usr/local/go/src/testing/testing.go:741 +0x19b
[WARNING] [09:57:15+0000] testing.tRunner(0xc4202e94a0, 0xc42029d840)
[WARNING] [09:57:15+0000] 	/usr/local/go/src/testing/testing.go:748 +0xda
[WARNING] [09:57:15+0000] created by testing.(*T).Run
[WARNING] [09:57:15+0000] 	/usr/local/go/src/testing/testing.go:789 +0x2de
[WARNING] [09:57:15+0000] goroutine 134 [chan send, 27 minutes]:
[WARNING] [09:57:15+0000] testing.tRunner.func1(0xc4202e9590)
[WARNING] [09:57:15+0000] 	/usr/local/go/src/testing/testing.go:741 +0x19b
[WARNING] [09:57:15+0000] testing.tRunner(0xc4202e9590, 0xc42029d8c0)
[WARNING] [09:57:15+0000] 	/usr/local/go/src/testing/testing.go:748 +0xda
[WARNING] [09:57:15+0000] created by testing.(*T).Run
[WARNING] [09:57:15+0000] 	/usr/local/go/src/testing/testing.go:789 +0x2de
[WARNING] [09:57:15+0000] goroutine 135 [chan send, 27 minutes]:
[WARNING] [09:57:15+0000] testing.tRunner.func1(0xc4202e9680)
[WARNING] [09:57:15+0000] 	/usr/local/go/src/testing/testing.go:741 +0x19b
[WARNING] [09:57:15+0000] testing.tRunner(0xc4202e9680, 0xc42029d940)
[WARNING] [09:57:15+0000] 	/usr/local/go/src/testing/testing.go:748 +0xda
[WARNING] [09:57:15+0000] created by testing.(*T).Run
[WARNING] [09:57:15+0000] 	/usr/local/go/src/testing/testing.go:789 +0x2de
[WARNING] [09:57:15+0000] goroutine 136 [chan send, 27 minutes]:
[WARNING] [09:57:15+0000] testing.tRunner.func1(0xc4202e9770)
[WARNING] [09:57:15+0000] 	/usr/local/go/src/testing/testing.go:741 +0x19b
[WARNING] [09:57:15+0000] testing.tRunner(0xc4202e9770, 0xc42029d9c0)
[WARNING] [09:57:15+0000] 	/usr/local/go/src/testing/testing.go:748 +0xda
[WARNING] [09:57:15+0000] created by testing.(*T).Run
[WARNING] [09:57:15+0000] 	/usr/local/go/src/testing/testing.go:789 +0x2de
[WARNING] [09:57:15+0000] goroutine 137 [chan send, 28 minutes]:
[WARNING] [09:57:15+0000] testing.tRunner.func1(0xc4202e9860)
[WARNING] [09:57:15+0000] 	/usr/local/go/src/testing/testing.go:741 +0x19b
[WARNING] [09:57:15+0000] testing.tRunner(0xc4202e9860, 0xc42029da40)
[WARNING] [09:57:15+0000] 	/usr/local/go/src/testing/testing.go:748 +0xda
[WARNING] [09:57:15+0000] created by testing.(*T).Run
[WARNING] [09:57:15+0000] 	/usr/local/go/src/testing/testing.go:789 +0x2de
[WARNING] [09:57:15+0000] goroutine 138 [chan send, 28 minutes]:
[WARNING] [09:57:15+0000] testing.tRunner.func1(0xc4202e9950)
[WARNING] [09:57:15+0000] 	/usr/local/go/src/testing/testing.go:741 +0x19b
[WARNING] [09:57:15+0000] testing.tRunner(0xc4202e9950, 0xc42029dac0)
[WARNING] [09:57:15+0000] 	/usr/local/go/src/testing/testing.go:748 +0xda
[WARNING] [09:57:15+0000] created by testing.(*T).Run
[WARNING] [09:57:15+0000] 	/usr/local/go/src/testing/testing.go:789 +0x2de
[WARNING] [09:57:15+0000] goroutine 139 [chan send, 28 minutes]:
[WARNING] [09:57:15+0000] testing.tRunner.func1(0xc4202e9a40)
[WARNING] [09:57:15+0000] 	/usr/local/go/src/testing/testing.go:741 +0x19b
[WARNING] [09:57:15+0000] testing.tRunner(0xc4202e9a40, 0xc42029db40)
[WARNING] [09:57:15+0000] 	/usr/local/go/src/testing/testing.go:748 +0xda
[WARNING] [09:57:15+0000] created by testing.(*T).Run
[WARNING] [09:57:15+0000] 	/usr/local/go/src/testing/testing.go:789 +0x2de
[WARNING] [09:57:15+0000] goroutine 140 [chan send, 28 minutes]:
[WARNING] [09:57:15+0000] testing.tRunner.func1(0xc4202e9b30)
[WARNING] [09:57:15+0000] 	/usr/local/go/src/testing/testing.go:741 +0x19b
[WARNING] [09:57:15+0000] testing.tRunner(0xc4202e9b30, 0xc42029dbc0)
[WARNING] [09:57:15+0000] 	/usr/local/go/src/testing/testing.go:748 +0xda
[WARNING] [09:57:15+0000] created by testing.(*T).Run
[WARNING] [09:57:15+0000] 	/usr/local/go/src/testing/testing.go:789 +0x2de
[WARNING] [09:57:15+0000] goroutine 141 [chan send, 28 minutes]:
[WARNING] [09:57:15+0000] testing.tRunner.func1(0xc4202e9c20)
[WARNING] [09:57:15+0000] 	/usr/local/go/src/testing/testing.go:741 +0x19b
[WARNING] [09:57:15+0000] testing.tRunner(0xc4202e9c20, 0xc42029dc40)
[WARNING] [09:57:15+0000] 	/usr/local/go/src/testing/testing.go:748 +0xda
[WARNING] [09:57:15+0000] created by testing.(*T).Run
[WARNING] [09:57:15+0000] 	/usr/local/go/src/testing/testing.go:789 +0x2de
[WARNING] [09:57:15+0000] goroutine 142 [chan send, 28 minutes]:
[WARNING] [09:57:15+0000] testing.tRunner.func1(0xc4202e9d10)
[WARNING] [09:57:15+0000] 	/usr/local/go/src/testing/testing.go:741 +0x19b
[WARNING] [09:57:15+0000] testing.tRunner(0xc4202e9d10, 0xc42029dcc0)
[WARNING] [09:57:15+0000] 	/usr/local/go/src/testing/testing.go:748 +0xda
[WARNING] [09:57:15+0000] created by testing.(*T).Run
[WARNING] [09:57:15+0000] 	/usr/local/go/src/testing/testing.go:789 +0x2de
[WARNING] [09:57:15+0000] goroutine 143 [chan send, 28 minutes]:
[WARNING] [09:57:15+0000] testing.tRunner.func1(0xc4202e9e00)
[WARNING] [09:57:15+0000] 	/usr/local/go/src/testing/testing.go:741 +0x19b
[WARNING] [09:57:15+0000] testing.tRunner(0xc4202e9e00, 0xc42029dd40)
[WARNING] [09:57:15+0000] 	/usr/local/go/src/testing/testing.go:748 +0xda
[WARNING] [09:57:15+0000] created by testing.(*T).Run
[WARNING] [09:57:15+0000] 	/usr/local/go/src/testing/testing.go:789 +0x2de
[WARNING] [09:57:15+0000] goroutine 144 [chan send, 29 minutes]:
[WARNING] [09:57:15+0000] testing.tRunner.func1(0xc4202e9ef0)
[WARNING] [09:57:15+0000] 	/usr/local/go/src/testing/testing.go:741 +0x19b
[WARNING] [09:57:15+0000] testing.tRunner(0xc4202e9ef0, 0xc42029ddc0)
[WARNING] [09:57:15+0000] 	/usr/local/go/src/testing/testing.go:748 +0xda
[WARNING] [09:57:15+0000] created by testing.(*T).Run
[WARNING] [09:57:15+0000] 	/usr/local/go/src/testing/testing.go:789 +0x2de
[WARNING] [09:57:15+0000] goroutine 145 [chan send, 29 minutes]:
[WARNING] [09:57:15+0000] testing.tRunner.func1(0xc42028a000)
[WARNING] [09:57:15+0000] 	/usr/local/go/src/testing/testing.go:741 +0x19b
[WARNING] [09:57:15+0000] testing.tRunner(0xc42028a000, 0xc42029de40)
[WARNING] [09:57:15+0000] 	/usr/local/go/src/testing/testing.go:748 +0xda
[WARNING] [09:57:15+0000] created by testing.(*T).Run
[WARNING] [09:57:15+0000] 	/usr/local/go/src/testing/testing.go:789 +0x2de
[WARNING] [09:57:15+0000] goroutine 146 [chan send, 29 minutes]:
[WARNING] [09:57:15+0000] testing.tRunner.func1(0xc42028a0f0)
[WARNING] [09:57:15+0000] 	/usr/local/go/src/testing/testing.go:741 +0x19b
[WARNING] [09:57:15+0000] testing.tRunner(0xc42028a0f0, 0xc42029dec0)
[WARNING] [09:57:15+0000] 	/usr/local/go/src/testing/testing.go:748 +0xda
[WARNING] [09:57:15+0000] created by testing.(*T).Run
[WARNING] [09:57:15+0000] 	/usr/local/go/src/testing/testing.go:789 +0x2de
[WARNING] [09:57:15+0000] goroutine 147 [chan send, 29 minutes]:
[WARNING] [09:57:15+0000] testing.tRunner.func1(0xc42028a1e0)
[WARNING] [09:57:15+0000] 	/usr/local/go/src/testing/testing.go:741 +0x19b
[WARNING] [09:57:15+0000] testing.tRunner(0xc42028a1e0, 0xc42029df40)
[WARNING] [09:57:15+0000] 	/usr/local/go/src/testing/testing.go:748 +0xda
[WARNING] [09:57:15+0000] created by testing.(*T).Run
[WARNING] [09:57:15+0000] 	/usr/local/go/src/testing/testing.go:789 +0x2de
[WARNING] [09:57:15+0000] goroutine 148 [chan send, 29 minutes]:
[WARNING] [09:57:15+0000] testing.tRunner.func1(0xc42028a2d0)
[WARNING] [09:57:15+0000] 	/usr/local/go/src/testing/testing.go:741 +0x19b
[WARNING] [09:57:15+0000] testing.tRunner(0xc42028a2d0, 0xc42029dfc0)
[WARNING] [09:57:15+0000] 	/usr/local/go/src/testing/testing.go:748 +0xda
[WARNING] [09:57:15+0000] created by testing.(*T).Run
[WARNING] [09:57:15+0000] 	/usr/local/go/src/testing/testing.go:789 +0x2de
[WARNING] [09:57:15+0000] goroutine 149 [chan send, 29 minutes]:
[WARNING] [09:57:15+0000] testing.tRunner.func1(0xc42028a3c0)
[WARNING] [09:57:15+0000] 	/usr/local/go/src/testing/testing.go:741 +0x19b
[WARNING] [09:57:15+0000] testing.tRunner(0xc42028a3c0, 0xc42028c040)
[WARNING] [09:57:15+0000] 	/usr/local/go/src/testing/testing.go:748 +0xda
[WARNING] [09:57:15+0000] created by testing.(*T).Run
[WARNING] [09:57:15+0000] 	/usr/local/go/src/testing/testing.go:789 +0x2de
[WARNING] [09:57:15+0000] goroutine 150 [chan send, 30 minutes]:
[WARNING] [09:57:15+0000] testing.tRunner.func1(0xc42028a4b0)
[WARNING] [09:57:15+0000] 	/usr/local/go/src/testing/testing.go:741 +0x19b
[WARNING] [09:57:15+0000] testing.tRunner(0xc42028a4b0, 0xc42028c0c0)
[WARNING] [09:57:15+0000] 	/usr/local/go/src/testing/testing.go:748 +0xda
[WARNING] [09:57:15+0000] created by testing.(*T).Run
[WARNING] [09:57:15+0000] 	/usr/local/go/src/testing/testing.go:789 +0x2de
[WARNING] [09:57:15+0000] goroutine 151 [chan send, 30 minutes]:
[WARNING] [09:57:15+0000] testing.tRunner.func1(0xc42028a5a0)
[WARNING] [09:57:15+0000] 	/usr/local/go/src/testing/testing.go:741 +0x19b
[WARNING] [09:57:15+0000] testing.tRunner(0xc42028a5a0, 0xc42028c140)
[WARNING] [09:57:15+0000] 	/usr/local/go/src/testing/testing.go:748 +0xda
[WARNING] [09:57:15+0000] created by testing.(*T).Run
[WARNING] [09:57:15+0000] 	/usr/local/go/src/testing/testing.go:789 +0x2de
[WARNING] [09:57:15+0000] goroutine 152 [chan send, 30 minutes]:
[WARNING] [09:57:15+0000] testing.tRunner.func1(0xc42028a690)
[WARNING] [09:57:15+0000] 	/usr/local/go/src/testing/testing.go:741 +0x19b
[WARNING] [09:57:15+0000] testing.tRunner(0xc42028a690, 0xc42028c1c0)
[WARNING] [09:57:15+0000] 	/usr/local/go/src/testing/testing.go:748 +0xda
[WARNING] [09:57:15+0000] created by testing.(*T).Run
[WARNING] [09:57:15+0000] 	/usr/local/go/src/testing/testing.go:789 +0x2de
[WARNING] [09:57:15+0000] goroutine 153 [chan send, 30 minutes]:
[WARNING] [09:57:15+0000] testing.tRunner.func1(0xc42028a780)
[WARNING] [09:57:15+0000] 	/usr/local/go/src/testing/testing.go:741 +0x19b
[WARNING] [09:57:15+0000] testing.tRunner(0xc42028a780, 0xc42028c240)
[WARNING] [09:57:15+0000] 	/usr/local/go/src/testing/testing.go:748 +0xda
[WARNING] [09:57:15+0000] created by testing.(*T).Run
[WARNING] [09:57:15+0000] 	/usr/local/go/src/testing/testing.go:789 +0x2de
[WARNING] [09:57:15+0000] goroutine 154 [chan send, 30 minutes]:
[WARNING] [09:57:15+0000] testing.tRunner.func1(0xc42028a870)
[WARNING] [09:57:15+0000] 	/usr/local/go/src/testing/testing.go:741 +0x19b
[WARNING] [09:57:15+0000] testing.tRunner(0xc42028a870, 0xc42028c2c0)
[WARNING] [09:57:15+0000] 	/usr/local/go/src/testing/testing.go:748 +0xda
[WARNING] [09:57:15+0000] created by testing.(*T).Run
[WARNING] [09:57:15+0000] 	/usr/local/go/src/testing/testing.go:789 +0x2de
[WARNING] [09:57:15+0000] goroutine 155 [chan send, 31 minutes]:
[WARNING] [09:57:15+0000] testing.tRunner.func1(0xc42028a960)
[WARNING] [09:57:15+0000] 	/usr/local/go/src/testing/testing.go:741 +0x19b
[WARNING] [09:57:15+0000] testing.tRunner(0xc42028a960, 0xc42028c340)
[WARNING] [09:57:15+0000] 	/usr/local/go/src/testing/testing.go:748 +0xda
[WARNING] [09:57:15+0000] created by testing.(*T).Run
[WARNING] [09:57:15+0000] 	/usr/local/go/src/testing/testing.go:789 +0x2de
[WARNING] [09:57:15+0000] goroutine 156 [chan send, 31 minutes]:
[WARNING] [09:57:15+0000] testing.tRunner.func1(0xc42028aa50)
[WARNING] [09:57:15+0000] 	/usr/local/go/src/testing/testing.go:741 +0x19b
[WARNING] [09:57:15+0000] testing.tRunner(0xc42028aa50, 0xc42028c3c0)
[WARNING] [09:57:15+0000] 	/usr/local/go/src/testing/testing.go:748 +0xda
[WARNING] [09:57:15+0000] created by testing.(*T).Run
[WARNING] [09:57:15+0000] 	/usr/local/go/src/testing/testing.go:789 +0x2de
[WARNING] [09:57:15+0000] goroutine 157 [chan send, 31 minutes]:
[WARNING] [09:57:15+0000] testing.tRunner.func1(0xc42028ab40)
[WARNING] [09:57:15+0000] 	/usr/local/go/src/testing/testing.go:741 +0x19b
[WARNING] [09:57:15+0000] testing.tRunner(0xc42028ab40, 0xc42028c440)
[WARNING] [09:57:15+0000] 	/usr/local/go/src/testing/testing.go:748 +0xda
[WARNING] [09:57:15+0000] created by testing.(*T).Run
[WARNING] [09:57:15+0000] 	/usr/local/go/src/testing/testing.go:789 +0x2de
[WARNING] [09:57:15+0000] goroutine 158 [chan send, 30 minutes]:
[WARNING] [09:57:15+0000] testing.tRunner.func1(0xc42028ac30)
[WARNING] [09:57:15+0000] 	/usr/local/go/src/testing/testing.go:741 +0x19b
[WARNING] [09:57:15+0000] testing.tRunner(0xc42028ac30, 0xc42028c4c0)
[WARNING] [09:57:15+0000] 	/usr/local/go/src/testing/testing.go:748 +0xda
[WARNING] [09:57:15+0000] created by testing.(*T).Run
[WARNING] [09:57:15+0000] 	/usr/local/go/src/testing/testing.go:789 +0x2de
[WARNING] [09:57:15+0000] goroutine 159 [chan send, 31 minutes]:
[WARNING] [09:57:15+0000] testing.tRunner.func1(0xc42028ad20)
[WARNING] [09:57:15+0000] 	/usr/local/go/src/testing/testing.go:741 +0x19b
[WARNING] [09:57:15+0000] testing.tRunner(0xc42028ad20, 0xc42028c540)
[WARNING] [09:57:15+0000] 	/usr/local/go/src/testing/testing.go:748 +0xda
[WARNING] [09:57:15+0000] created by testing.(*T).Run
[WARNING] [09:57:15+0000] 	/usr/local/go/src/testing/testing.go:789 +0x2de
[WARNING] [09:57:15+0000] goroutine 160 [chan send, 31 minutes]:
[WARNING] [09:57:15+0000] testing.tRunner.func1(0xc42028ae10)
[WARNING] [09:57:15+0000] 	/usr/local/go/src/testing/testing.go:741 +0x19b
[WARNING] [09:57:15+0000] testing.tRunner(0xc42028ae10, 0xc42028c5c0)
[WARNING] [09:57:15+0000] 	/usr/local/go/src/testing/testing.go:748 +0xda
[WARNING] [09:57:15+0000] created by testing.(*T).Run
[WARNING] [09:57:15+0000] 	/usr/local/go/src/testing/testing.go:789 +0x2de
[WARNING] [09:57:15+0000] goroutine 161 [chan send, 31 minutes]:
[WARNING] [09:57:15+0000] testing.tRunner.func1(0xc42028af00)
[WARNING] [09:57:15+0000] 	/usr/local/go/src/testing/testing.go:741 +0x19b
[WARNING] [09:57:15+0000] testing.tRunner(0xc42028af00, 0xc42028c640)
[WARNING] [09:57:15+0000] 	/usr/local/go/src/testing/testing.go:748 +0xda
[WARNING] [09:57:15+0000] created by testing.(*T).Run
[WARNING] [09:57:15+0000] 	/usr/local/go/src/testing/testing.go:789 +0x2de
[WARNING] [09:57:15+0000] goroutine 162 [chan send, 31 minutes]:
[WARNING] [09:57:15+0000] testing.tRunner.func1(0xc42028aff0)
[WARNING] [09:57:15+0000] 	/usr/local/go/src/testing/testing.go:741 +0x19b
[WARNING] [09:57:15+0000] testing.tRunner(0xc42028aff0, 0xc42028c6c0)
[WARNING] [09:57:15+0000] 	/usr/local/go/src/testing/testing.go:748 +0xda
[WARNING] [09:57:15+0000] created by testing.(*T).Run
[WARNING] [09:57:15+0000] 	/usr/local/go/src/testing/testing.go:789 +0x2de
[WARNING] [09:57:15+0000] goroutine 163 [chan send, 31 minutes]:
[WARNING] [09:57:15+0000] testing.tRunner.func1(0xc42028b0e0)
[WARNING] [09:57:15+0000] 	/usr/local/go/src/testing/testing.go:741 +0x19b
[WARNING] [09:57:15+0000] testing.tRunner(0xc42028b0e0, 0xc42028c740)
[WARNING] [09:57:15+0000] 	/usr/local/go/src/testing/testing.go:748 +0xda
[WARNING] [09:57:15+0000] created by testing.(*T).Run
[WARNING] [09:57:15+0000] 	/usr/local/go/src/testing/testing.go:789 +0x2de
[WARNING] [09:57:15+0000] goroutine 164 [chan send, 32 minutes]:
[WARNING] [09:57:15+0000] testing.tRunner.func1(0xc42028b1d0)
[WARNING] [09:57:15+0000] 	/usr/local/go/src/testing/testing.go:741 +0x19b
[WARNING] [09:57:15+0000] testing.tRunner(0xc42028b1d0, 0xc42028c7c0)
[WARNING] [09:57:15+0000] 	/usr/local/go/src/testing/testing.go:748 +0xda
[WARNING] [09:57:15+0000] created by testing.(*T).Run
[WARNING] [09:57:15+0000] 	/usr/local/go/src/testing/testing.go:789 +0x2de
[WARNING] [09:57:15+0000] goroutine 165 [chan send, 32 minutes]:
[WARNING] [09:57:15+0000] testing.tRunner.func1(0xc42028b2c0)
[WARNING] [09:57:15+0000] 	/usr/local/go/src/testing/testing.go:741 +0x19b
[WARNING] [09:57:15+0000] testing.tRunner(0xc42028b2c0, 0xc42028c840)
[WARNING] [09:57:15+0000] 	/usr/local/go/src/testing/testing.go:748 +0xda
[WARNING] [09:57:15+0000] created by testing.(*T).Run
[WARNING] [09:57:15+0000] 	/usr/local/go/src/testing/testing.go:789 +0x2de
[WARNING] [09:57:15+0000] goroutine 166 [chan send, 32 minutes]:
[WARNING] [09:57:15+0000] testing.tRunner.func1(0xc42028b3b0)
[WARNING] [09:57:15+0000] 	/usr/local/go/src/testing/testing.go:741 +0x19b
[WARNING] [09:57:15+0000] testing.tRunner(0xc42028b3b0, 0xc42028c8c0)
[WARNING] [09:57:15+0000] 	/usr/local/go/src/testing/testing.go:748 +0xda
[WARNING] [09:57:15+0000] created by testing.(*T).Run
[WARNING] [09:57:15+0000] 	/usr/local/go/src/testing/testing.go:789 +0x2de
[WARNING] [09:57:15+0000] goroutine 167 [chan send, 32 minutes]:
[WARNING] [09:57:15+0000] testing.tRunner.func1(0xc42028b4a0)
[WARNING] [09:57:15+0000] 	/usr/local/go/src/testing/testing.go:741 +0x19b
[WARNING] [09:57:15+0000] testing.tRunner(0xc42028b4a0, 0xc42028c940)
[WARNING] [09:57:15+0000] 	/usr/local/go/src/testing/testing.go:748 +0xda
[WARNING] [09:57:15+0000] created by testing.(*T).Run
[WARNING] [09:57:15+0000] 	/usr/local/go/src/testing/testing.go:789 +0x2de
[WARNING] [09:57:15+0000] goroutine 168 [chan send, 31 minutes]:
[WARNING] [09:57:15+0000] testing.tRunner.func1(0xc42028b590)
[WARNING] [09:57:15+0000] 	/usr/local/go/src/testing/testing.go:741 +0x19b
[WARNING] [09:57:15+0000] testing.tRunner(0xc42028b590, 0xc42028c9c0)
[WARNING] [09:57:15+0000] 	/usr/local/go/src/testing/testing.go:748 +0xda
[WARNING] [09:57:15+0000] created by testing.(*T).Run
[WARNING] [09:57:15+0000] 	/usr/local/go/src/testing/testing.go:789 +0x2de
[WARNING] [09:57:15+0000] goroutine 169 [chan send, 31 minutes]:
[WARNING] [09:57:15+0000] testing.tRunner.func1(0xc42028b680)
[WARNING] [09:57:15+0000] 	/usr/local/go/src/testing/testing.go:741 +0x19b
[WARNING] [09:57:15+0000] testing.tRunner(0xc42028b680, 0xc42028ca40)
[WARNING] [09:57:15+0000] 	/usr/local/go/src/testing/testing.go:748 +0xda
[WARNING] [09:57:15+0000] created by testing.(*T).Run
[WARNING] [09:57:15+0000] 	/usr/local/go/src/testing/testing.go:789 +0x2de
[WARNING] [09:57:15+0000] goroutine 170 [chan send, 31 minutes]:
[WARNING] [09:57:15+0000] testing.tRunner.func1(0xc42028b770)
[WARNING] [09:57:15+0000] 	/usr/local/go/src/testing/testing.go:741 +0x19b
[WARNING] [09:57:15+0000] testing.tRunner(0xc42028b770, 0xc42028cac0)
[WARNING] [09:57:15+0000] 	/usr/local/go/src/testing/testing.go:748 +0xda
[WARNING] [09:57:15+0000] created by testing.(*T).Run
[WARNING] [09:57:15+0000] 	/usr/local/go/src/testing/testing.go:789 +0x2de
[WARNING] [09:57:15+0000] goroutine 171 [chan send, 32 minutes]:
[WARNING] [09:57:15+0000] testing.tRunner.func1(0xc42028b860)
[WARNING] [09:57:15+0000] 	/usr/local/go/src/testing/testing.go:741 +0x19b
[WARNING] [09:57:15+0000] testing.tRunner(0xc42028b860, 0xc42028cb40)
[WARNING] [09:57:15+0000] 	/usr/local/go/src/testing/testing.go:748 +0xda
[WARNING] [09:57:15+0000] created by testing.(*T).Run
[WARNING] [09:57:15+0000] 	/usr/local/go/src/testing/testing.go:789 +0x2de
[WARNING] [09:57:15+0000] goroutine 172 [chan send, 32 minutes]:
[WARNING] [09:57:15+0000] testing.tRunner.func1(0xc42028b950)
[WARNING] [09:57:15+0000] 	/usr/local/go/src/testing/testing.go:741 +0x19b
[WARNING] [09:57:15+0000] testing.tRunner(0xc42028b950, 0xc42028cbc0)
[WARNING] [09:57:15+0000] 	/usr/local/go/src/testing/testing.go:748 +0xda
[WARNING] [09:57:15+0000] created by testing.(*T).Run
[WARNING] [09:57:15+0000] 	/usr/local/go/src/testing/testing.go:789 +0x2de
[WARNING] [09:57:15+0000] goroutine 173 [chan send, 32 minutes]:
[WARNING] [09:57:15+0000] testing.tRunner.func1(0xc42028ba40)
[WARNING] [09:57:15+0000] 	/usr/local/go/src/testing/testing.go:741 +0x19b
[WARNING] [09:57:15+0000] testing.tRunner(0xc42028ba40, 0xc42028cc40)
[WARNING] [09:57:15+0000] 	/usr/local/go/src/testing/testing.go:748 +0xda
[WARNING] [09:57:15+0000] created by testing.(*T).Run
[WARNING] [09:57:15+0000] 	/usr/local/go/src/testing/testing.go:789 +0x2de
[WARNING] [09:57:15+0000] goroutine 174 [chan send, 32 minutes]:
[WARNING] [09:57:15+0000] testing.tRunner.func1(0xc42028bb30)
[WARNING] [09:57:15+0000] 	/usr/local/go/src/testing/testing.go:741 +0x19b
[WARNING] [09:57:15+0000] testing.tRunner(0xc42028bb30, 0xc42028ccc0)
[WARNING] [09:57:15+0000] 	/usr/local/go/src/testing/testing.go:748 +0xda
[WARNING] [09:57:15+0000] created by testing.(*T).Run
[WARNING] [09:57:15+0000] 	/usr/local/go/src/testing/testing.go:789 +0x2de
[WARNING] [09:57:15+0000] goroutine 175 [chan send, 32 minutes]:
[WARNING] [09:57:15+0000] testing.tRunner.func1(0xc42028bc20)
[WARNING] [09:57:15+0000] 	/usr/local/go/src/testing/testing.go:741 +0x19b
[WARNING] [09:57:15+0000] testing.tRunner(0xc42028bc20, 0xc42028cd40)
[WARNING] [09:57:15+0000] 	/usr/local/go/src/testing/testing.go:748 +0xda
[WARNING] [09:57:15+0000] created by testing.(*T).Run
[WARNING] [09:57:15+0000] 	/usr/local/go/src/testing/testing.go:789 +0x2de
[WARNING] [09:57:15+0000] goroutine 176 [chan send, 32 minutes]:
[WARNING] [09:57:15+0000] testing.tRunner.func1(0xc42028bd10)
[WARNING] [09:57:15+0000] 	/usr/local/go/src/testing/testing.go:741 +0x19b
[WARNING] [09:57:15+0000] testing.tRunner(0xc42028bd10, 0xc42028cdc0)
[WARNING] [09:57:15+0000] 	/usr/local/go/src/testing/testing.go:748 +0xda
[WARNING] [09:57:15+0000] created by testing.(*T).Run
[WARNING] [09:57:15+0000] 	/usr/local/go/src/testing/testing.go:789 +0x2de
[WARNING] [09:57:15+0000] goroutine 177 [chan send, 32 minutes]:
[WARNING] [09:57:15+0000] testing.tRunner.func1(0xc42028be00)
[WARNING] [09:57:15+0000] 	/usr/local/go/src/testing/testing.go:741 +0x19b
[WARNING] [09:57:15+0000] testing.tRunner(0xc42028be00, 0xc42028ce40)
[WARNING] [09:57:15+0000] 	/usr/local/go/src/testing/testing.go:748 +0xda
[WARNING] [09:57:15+0000] created by testing.(*T).Run
[WARNING] [09:57:15+0000] 	/usr/local/go/src/testing/testing.go:789 +0x2de
[WARNING] [09:57:15+0000] goroutine 178 [chan send, 33 minutes]:
[WARNING] [09:57:15+0000] testing.tRunner.func1(0xc42028bef0)
[WARNING] [09:57:15+0000] 	/usr/local/go/src/testing/testing.go:741 +0x19b
[WARNING] [09:57:15+0000] testing.tRunner(0xc42028bef0, 0xc42028cec0)
[WARNING] [09:57:15+0000] 	/usr/local/go/src/testing/testing.go:748 +0xda
[WARNING] [09:57:15+0000] created by testing.(*T).Run
[WARNING] [09:57:15+0000] 	/usr/local/go/src/testing/testing.go:789 +0x2de
[WARNING] [09:57:15+0000] goroutine 179 [chan send, 32 minutes]:
[WARNING] [09:57:15+0000] testing.tRunner.func1(0xc420194000)
[WARNING] [09:57:15+0000] 	/usr/local/go/src/testing/testing.go:741 +0x19b
[WARNING] [09:57:15+0000] testing.tRunner(0xc420194000, 0xc42028cf40)
[WARNING] [09:57:15+0000] 	/usr/local/go/src/testing/testing.go:748 +0xda
[WARNING] [09:57:15+0000] created by testing.(*T).Run
[WARNING] [09:57:15+0000] 	/usr/local/go/src/testing/testing.go:789 +0x2de
[WARNING] [09:57:15+0000] goroutine 180 [chan send, 33 minutes]:
[WARNING] [09:57:15+0000] testing.tRunner.func1(0xc4201940f0)
[WARNING] [09:57:15+0000] 	/usr/local/go/src/testing/testing.go:741 +0x19b
[WARNING] [09:57:15+0000] testing.tRunner(0xc4201940f0, 0xc42028cfc0)
[WARNING] [09:57:15+0000] 	/usr/local/go/src/testing/testing.go:748 +0xda
[WARNING] [09:57:15+0000] created by testing.(*T).Run
[WARNING] [09:57:15+0000] 	/usr/local/go/src/testing/testing.go:789 +0x2de
[WARNING] [09:57:15+0000] goroutine 181 [chan send, 33 minutes]:
[WARNING] [09:57:15+0000] testing.tRunner.func1(0xc4201941e0)
[WARNING] [09:57:15+0000] 	/usr/local/go/src/testing/testing.go:741 +0x19b
[WARNING] [09:57:15+0000] testing.tRunner(0xc4201941e0, 0xc42028d040)
[WARNING] [09:57:15+0000] 	/usr/local/go/src/testing/testing.go:748 +0xda
[WARNING] [09:57:15+0000] created by testing.(*T).Run
[WARNING] [09:57:15+0000] 	/usr/local/go/src/testing/testing.go:789 +0x2de
[WARNING] [09:57:15+0000] goroutine 182 [chan send, 33 minutes]:
[WARNING] [09:57:15+0000] testing.tRunner.func1(0xc4201942d0)
[WARNING] [09:57:15+0000] 	/usr/local/go/src/testing/testing.go:741 +0x19b
[WARNING] [09:57:15+0000] testing.tRunner(0xc4201942d0, 0xc42028d0c0)
[WARNING] [09:57:15+0000] 	/usr/local/go/src/testing/testing.go:748 +0xda
[WARNING] [09:57:15+0000] created by testing.(*T).Run
[WARNING] [09:57:15+0000] 	/usr/local/go/src/testing/testing.go:789 +0x2de
[WARNING] [09:57:15+0000] goroutine 183 [chan send, 33 minutes]:
[WARNING] [09:57:15+0000] testing.tRunner.func1(0xc4201943c0)
[WARNING] [09:57:15+0000] 	/usr/local/go/src/testing/testing.go:741 +0x19b
[WARNING] [09:57:15+0000] testing.tRunner(0xc4201943c0, 0xc42028d140)
[WARNING] [09:57:15+0000] 	/usr/local/go/src/testing/testing.go:748 +0xda
[WARNING] [09:57:15+0000] created by testing.(*T).Run
[WARNING] [09:57:15+0000] 	/usr/local/go/src/testing/testing.go:789 +0x2de
[WARNING] [09:57:15+0000] goroutine 184 [chan send, 33 minutes]:
[WARNING] [09:57:15+0000] testing.tRunner.func1(0xc4201944b0)
[WARNING] [09:57:15+0000] 	/usr/local/go/src/testing/testing.go:741 +0x19b
[WARNING] [09:57:15+0000] testing.tRunner(0xc4201944b0, 0xc42028d1c0)
[WARNING] [09:57:15+0000] 	/usr/local/go/src/testing/testing.go:748 +0xda
[WARNING] [09:57:15+0000] created by testing.(*T).Run
[WARNING] [09:57:15+0000] 	/usr/local/go/src/testing/testing.go:789 +0x2de
[WARNING] [09:57:15+0000] goroutine 185 [chan send, 34 minutes]:
[WARNING] [09:57:15+0000] testing.tRunner.func1(0xc4201945a0)
[WARNING] [09:57:15+0000] 	/usr/local/go/src/testing/testing.go:741 +0x19b
[WARNING] [09:57:15+0000] testing.tRunner(0xc4201945a0, 0xc42028d240)
[WARNING] [09:57:15+0000] 	/usr/local/go/src/testing/testing.go:748 +0xda
[WARNING] [09:57:15+0000] created by testing.(*T).Run
[WARNING] [09:57:15+0000] 	/usr/local/go/src/testing/testing.go:789 +0x2de
[WARNING] [09:57:15+0000] goroutine 186 [chan send, 34 minutes]:
[WARNING] [09:57:15+0000] testing.tRunner.func1(0xc420194690)
[WARNING] [09:57:15+0000] 	/usr/local/go/src/testing/testing.go:741 +0x19b
[WARNING] [09:57:15+0000] testing.tRunner(0xc420194690, 0xc42028d2c0)
[WARNING] [09:57:15+0000] 	/usr/local/go/src/testing/testing.go:748 +0xda
[WARNING] [09:57:15+0000] created by testing.(*T).Run
[WARNING] [09:57:15+0000] 	/usr/local/go/src/testing/testing.go:789 +0x2de
[WARNING] [09:57:15+0000] goroutine 187 [chan send, 34 minutes]:
[WARNING] [09:57:15+0000] testing.tRunner.func1(0xc420194780)
[WARNING] [09:57:15+0000] 	/usr/local/go/src/testing/testing.go:741 +0x19b
[WARNING] [09:57:15+0000] testing.tRunner(0xc420194780, 0xc42028d340)
[WARNING] [09:57:15+0000] 	/usr/local/go/src/testing/testing.go:748 +0xda
[WARNING] [09:57:15+0000] created by testing.(*T).Run
[WARNING] [09:57:15+0000] 	/usr/local/go/src/testing/testing.go:789 +0x2de
[WARNING] [09:57:15+0000] goroutine 188 [chan send, 34 minutes]:
[WARNING] [09:57:15+0000] testing.tRunner.func1(0xc420194870)
[WARNING] [09:57:15+0000] 	/usr/local/go/src/testing/testing.go:741 +0x19b
[WARNING] [09:57:15+0000] testing.tRunner(0xc420194870, 0xc42028d3c0)
[WARNING] [09:57:15+0000] 	/usr/local/go/src/testing/testing.go:748 +0xda
[WARNING] [09:57:15+0000] created by testing.(*T).Run
[WARNING] [09:57:15+0000] 	/usr/local/go/src/testing/testing.go:789 +0x2de
[WARNING] [09:57:15+0000] goroutine 189 [chan send, 34 minutes]:
[WARNING] [09:57:15+0000] testing.tRunner.func1(0xc420194960)
[WARNING] [09:57:15+0000] 	/usr/local/go/src/testing/testing.go:741 +0x19b
[WARNING] [09:57:15+0000] testing.tRunner(0xc420194960, 0xc42028d440)
[WARNING] [09:57:15+0000] 	/usr/local/go/src/testing/testing.go:748 +0xda
[WARNING] [09:57:15+0000] created by testing.(*T).Run
[WARNING] [09:57:15+0000] 	/usr/local/go/src/testing/testing.go:789 +0x2de
[WARNING] [09:57:15+0000] goroutine 190 [chan send, 34 minutes]:
[WARNING] [09:57:15+0000] testing.tRunner.func1(0xc420194a50)
[WARNING] [09:57:15+0000] 	/usr/local/go/src/testing/testing.go:741 +0x19b
[WARNING] [09:57:15+0000] testing.tRunner(0xc420194a50, 0xc42028d4c0)
[WARNING] [09:57:15+0000] 	/usr/local/go/src/testing/testing.go:748 +0xda
[WARNING] [09:57:15+0000] created by testing.(*T).Run
[WARNING] [09:57:15+0000] 	/usr/local/go/src/testing/testing.go:789 +0x2de
[WARNING] [09:57:15+0000] goroutine 191 [chan send, 35 minutes]:
[WARNING] [09:57:15+0000] testing.tRunner.func1(0xc420194b40)
[WARNING] [09:57:15+0000] 	/usr/local/go/src/testing/testing.go:741 +0x19b
[WARNING] [09:57:15+0000] testing.tRunner(0xc420194b40, 0xc42028d540)
[WARNING] [09:57:15+0000] 	/usr/local/go/src/testing/testing.go:748 +0xda
[WARNING] [09:57:15+0000] created by testing.(*T).Run
[WARNING] [09:57:15+0000] 	/usr/local/go/src/testing/testing.go:789 +0x2de
[WARNING] [09:57:15+0000] goroutine 192 [chan send, 35 minutes]:
[WARNING] [09:57:15+0000] testing.tRunner.func1(0xc420194c30)
[WARNING] [09:57:15+0000] 	/usr/local/go/src/testing/testing.go:741 +0x19b
[WARNING] [09:57:15+0000] testing.tRunner(0xc420194c30, 0xc42028d5c0)
[WARNING] [09:57:15+0000] 	/usr/local/go/src/testing/testing.go:748 +0xda
[WARNING] [09:57:15+0000] created by testing.(*T).Run
[WARNING] [09:57:15+0000] 	/usr/local/go/src/testing/testing.go:789 +0x2de
[WARNING] [09:57:15+0000] goroutine 193 [chan send, 35 minutes]:
[WARNING] [09:57:15+0000] testing.tRunner.func1(0xc420194d20)
[WARNING] [09:57:15+0000] 	/usr/local/go/src/testing/testing.go:741 +0x19b
[WARNING] [09:57:15+0000] testing.tRunner(0xc420194d20, 0xc42028d640)
[WARNING] [09:57:15+0000] 	/usr/local/go/src/testing/testing.go:748 +0xda
[WARNING] [09:57:15+0000] created by testing.(*T).Run
[WARNING] [09:57:15+0000] 	/usr/local/go/src/testing/testing.go:789 +0x2de
[WARNING] [09:57:15+0000] goroutine 194 [chan send, 35 minutes]:
[WARNING] [09:57:15+0000] testing.tRunner.func1(0xc420194e10)
[WARNING] [09:57:15+0000] 	/usr/local/go/src/testing/testing.go:741 +0x19b
[WARNING] [09:57:15+0000] testing.tRunner(0xc420194e10, 0xc42028d6c0)
[WARNING] [09:57:15+0000] 	/usr/local/go/src/testing/testing.go:748 +0xda
[WARNING] [09:57:15+0000] created by testing.(*T).Run
[WARNING] [09:57:15+0000] 	/usr/local/go/src/testing/testing.go:789 +0x2de
[WARNING] [09:57:15+0000] goroutine 195 [chan send, 35 minutes]:
[WARNING] [09:57:15+0000] testing.tRunner.func1(0xc420194f00)
[WARNING] [09:57:15+0000] 	/usr/local/go/src/testing/testing.go:741 +0x19b
[WARNING] [09:57:15+0000] testing.tRunner(0xc420194f00, 0xc42028d740)
[WARNING] [09:57:15+0000] 	/usr/local/go/src/testing/testing.go:748 +0xda
[WARNING] [09:57:15+0000] created by testing.(*T).Run
[WARNING] [09:57:15+0000] 	/usr/local/go/src/testing/testing.go:789 +0x2de
[WARNING] [09:57:15+0000] goroutine 196 [chan send, 35 minutes]:
[WARNING] [09:57:15+0000] testing.tRunner.func1(0xc420194ff0)
[WARNING] [09:57:15+0000] 	/usr/local/go/src/testing/testing.go:741 +0x19b
[WARNING] [09:57:15+0000] testing.tRunner(0xc420194ff0, 0xc42028d7c0)
[WARNING] [09:57:15+0000] 	/usr/local/go/src/testing/testing.go:748 +0xda
[WARNING] [09:57:15+0000] created by testing.(*T).Run
[WARNING] [09:57:15+0000] 	/usr/local/go/src/testing/testing.go:789 +0x2de
[WARNING] [09:57:15+0000] goroutine 197 [chan send, 35 minutes]:
[WARNING] [09:57:15+0000] testing.tRunner.func1(0xc4201950e0)
[WARNING] [09:57:15+0000] 	/usr/local/go/src/testing/testing.go:741 +0x19b
[WARNING] [09:57:15+0000] testing.tRunner(0xc4201950e0, 0xc42028d840)
[WARNING] [09:57:15+0000] 	/usr/local/go/src/testing/testing.go:748 +0xda
[WARNING] [09:57:15+0000] created by testing.(*T).Run
[WARNING] [09:57:15+0000] 	/usr/local/go/src/testing/testing.go:789 +0x2de
[WARNING] [09:57:15+0000] goroutine 198 [chan send, 36 minutes]:
[WARNING] [09:57:15+0000] testing.tRunner.func1(0xc4201951d0)
[WARNING] [09:57:15+0000] 	/usr/local/go/src/testing/testing.go:741 +0x19b
[WARNING] [09:57:15+0000] testing.tRunner(0xc4201951d0, 0xc42028d8c0)
[WARNING] [09:57:15+0000] 	/usr/local/go/src/testing/testing.go:748 +0xda
[WARNING] [09:57:15+0000] created by testing.(*T).Run
[WARNING] [09:57:15+0000] 	/usr/local/go/src/testing/testing.go:789 +0x2de
[WARNING] [09:57:15+0000] goroutine 199 [chan send, 35 minutes]:
[WARNING] [09:57:15+0000] testing.tRunner.func1(0xc4201952c0)
[WARNING] [09:57:15+0000] 	/usr/local/go/src/testing/testing.go:741 +0x19b
[WARNING] [09:57:15+0000] testing.tRunner(0xc4201952c0, 0xc42028d940)
[WARNING] [09:57:15+0000] 	/usr/local/go/src/testing/testing.go:748 +0xda
[WARNING] [09:57:15+0000] created by testing.(*T).Run
[WARNING] [09:57:15+0000] 	/usr/local/go/src/testing/testing.go:789 +0x2de
[WARNING] [09:57:15+0000] goroutine 200 [chan send, 36 minutes]:
[WARNING] [09:57:15+0000] testing.tRunner.func1(0xc4201953b0)
[WARNING] [09:57:15+0000] 	/usr/local/go/src/testing/testing.go:741 +0x19b
[WARNING] [09:57:15+0000] testing.tRunner(0xc4201953b0, 0xc42028d9c0)
[WARNING] [09:57:15+0000] 	/usr/local/go/src/testing/testing.go:748 +0xda
[WARNING] [09:57:15+0000] created by testing.(*T).Run
[WARNING] [09:57:15+0000] 	/usr/local/go/src/testing/testing.go:789 +0x2de
[WARNING] [09:57:15+0000] goroutine 201 [chan send, 36 minutes]:
[WARNING] [09:57:15+0000] testing.tRunner.func1(0xc4201954a0)
[WARNING] [09:57:15+0000] 	/usr/local/go/src/testing/testing.go:741 +0x19b
[WARNING] [09:57:15+0000] testing.tRunner(0xc4201954a0, 0xc42028da40)
[WARNING] [09:57:15+0000] 	/usr/local/go/src/testing/testing.go:748 +0xda
[WARNING] [09:57:15+0000] created by testing.(*T).Run
[WARNING] [09:57:15+0000] 	/usr/local/go/src/testing/testing.go:789 +0x2de
[WARNING] [09:57:15+0000] goroutine 202 [chan send, 36 minutes]:
[WARNING] [09:57:15+0000] testing.tRunner.func1(0xc420195590)
[WARNING] [09:57:15+0000] 	/usr/local/go/src/testing/testing.go:741 +0x19b
[WARNING] [09:57:15+0000] testing.tRunner(0xc420195590, 0xc42028dac0)
[WARNING] [09:57:15+0000] 	/usr/local/go/src/testing/testing.go:748 +0xda
[WARNING] [09:57:15+0000] created by testing.(*T).Run
[WARNING] [09:57:15+0000] 	/usr/local/go/src/testing/testing.go:789 +0x2de
[WARNING] [09:57:15+0000] goroutine 203 [chan send, 36 minutes]:
[WARNING] [09:57:15+0000] testing.tRunner.func1(0xc420195680)
[WARNING] [09:57:15+0000] 	/usr/local/go/src/testing/testing.go:741 +0x19b
[WARNING] [09:57:15+0000] testing.tRunner(0xc420195680, 0xc42028db40)
[WARNING] [09:57:15+0000] 	/usr/local/go/src/testing/testing.go:748 +0xda
[WARNING] [09:57:15+0000] created by testing.(*T).Run
[WARNING] [09:57:15+0000] 	/usr/local/go/src/testing/testing.go:789 +0x2de
[WARNING] [09:57:15+0000] goroutine 204 [chan send, 36 minutes]:
[WARNING] [09:57:15+0000] testing.tRunner.func1(0xc420195770)
[WARNING] [09:57:15+0000] 	/usr/local/go/src/testing/testing.go:741 +0x19b
[WARNING] [09:57:15+0000] testing.tRunner(0xc420195770, 0xc42028dbc0)
[WARNING] [09:57:15+0000] 	/usr/local/go/src/testing/testing.go:748 +0xda
[WARNING] [09:57:15+0000] created by testing.(*T).Run
[WARNING] [09:57:15+0000] 	/usr/local/go/src/testing/testing.go:789 +0x2de
[WARNING] [09:57:15+0000] goroutine 205 [chan send, 36 minutes]:
[WARNING] [09:57:15+0000] testing.tRunner.func1(0xc420195860)
[WARNING] [09:57:15+0000] 	/usr/local/go/src/testing/testing.go:741 +0x19b
[WARNING] [09:57:15+0000] testing.tRunner(0xc420195860, 0xc42028dc40)
[WARNING] [09:57:15+0000] 	/usr/local/go/src/testing/testing.go:748 +0xda
[WARNING] [09:57:15+0000] created by testing.(*T).Run
[WARNING] [09:57:15+0000] 	/usr/local/go/src/testing/testing.go:789 +0x2de
[WARNING] [09:57:15+0000] goroutine 206 [chan send, 37 minutes]:
[WARNING] [09:57:15+0000] testing.tRunner.func1(0xc420195950)
[WARNING] [09:57:15+0000] 	/usr/local/go/src/testing/testing.go:741 +0x19b
[WARNING] [09:57:15+0000] testing.tRunner(0xc420195950, 0xc42028dcc0)
[WARNING] [09:57:15+0000] 	/usr/local/go/src/testing/testing.go:748 +0xda
[WARNING] [09:57:15+0000] created by testing.(*T).Run
[WARNING] [09:57:15+0000] 	/usr/local/go/src/testing/testing.go:789 +0x2de
[WARNING] [09:57:15+0000] goroutine 207 [chan send, 37 minutes]:
[WARNING] [09:57:15+0000] testing.tRunner.func1(0xc420195a40)
[WARNING] [09:57:15+0000] 	/usr/local/go/src/testing/testing.go:741 +0x19b
[WARNING] [09:57:15+0000] testing.tRunner(0xc420195a40, 0xc42028dd40)
[WARNING] [09:57:15+0000] 	/usr/local/go/src/testing/testing.go:748 +0xda
[WARNING] [09:57:15+0000] created by testing.(*T).Run
[WARNING] [09:57:15+0000] 	/usr/local/go/src/testing/testing.go:789 +0x2de
[WARNING] [09:57:15+0000] goroutine 208 [chan send, 37 minutes]:
[WARNING] [09:57:15+0000] testing.tRunner.func1(0xc420195b30)
[WARNING] [09:57:15+0000] 	/usr/local/go/src/testing/testing.go:741 +0x19b
[WARNING] [09:57:15+0000] testing.tRunner(0xc420195b30, 0xc42028ddc0)
[WARNING] [09:57:15+0000] 	/usr/local/go/src/testing/testing.go:748 +0xda
[WARNING] [09:57:15+0000] created by testing.(*T).Run
[WARNING] [09:57:15+0000] 	/usr/local/go/src/testing/testing.go:789 +0x2de
[WARNING] [09:57:15+0000] goroutine 209 [chan send, 37 minutes]:
[WARNING] [09:57:15+0000] testing.tRunner.func1(0xc420195c20)
[WARNING] [09:57:15+0000] 	/usr/local/go/src/testing/testing.go:741 +0x19b
[WARNING] [09:57:15+0000] testing.tRunner(0xc420195c20, 0xc42028de40)
[WARNING] [09:57:15+0000] 	/usr/local/go/src/testing/testing.go:748 +0xda
[WARNING] [09:57:15+0000] created by testing.(*T).Run
[WARNING] [09:57:15+0000] 	/usr/local/go/src/testing/testing.go:789 +0x2de
[WARNING] [09:57:15+0000] goroutine 210 [chan send, 38 minutes]:
[WARNING] [09:57:15+0000] testing.tRunner.func1(0xc420195d10)
[WARNING] [09:57:15+0000] 	/usr/local/go/src/testing/testing.go:741 +0x19b
[WARNING] [09:57:15+0000] testing.tRunner(0xc420195d10, 0xc42028dec0)
[WARNING] [09:57:15+0000] 	/usr/local/go/src/testing/testing.go:748 +0xda
[WARNING] [09:57:15+0000] created by testing.(*T).Run
[WARNING] [09:57:15+0000] 	/usr/local/go/src/testing/testing.go:789 +0x2de
[WARNING] [09:57:15+0000] goroutine 211 [chan send, 38 minutes]:
[WARNING] [09:57:15+0000] testing.tRunner.func1(0xc420195e00)
[WARNING] [09:57:15+0000] 	/usr/local/go/src/testing/testing.go:741 +0x19b
[WARNING] [09:57:15+0000] testing.tRunner(0xc420195e00, 0xc42028df40)
[WARNING] [09:57:15+0000] 	/usr/local/go/src/testing/testing.go:748 +0xda
[WARNING] [09:57:15+0000] created by testing.(*T).Run
[WARNING] [09:57:15+0000] 	/usr/local/go/src/testing/testing.go:789 +0x2de
[WARNING] [09:57:15+0000] goroutine 212 [chan send, 38 minutes]:
[WARNING] [09:57:15+0000] testing.tRunner.func1(0xc420195ef0)
[WARNING] [09:57:15+0000] 	/usr/local/go/src/testing/testing.go:741 +0x19b
[WARNING] [09:57:15+0000] testing.tRunner(0xc420195ef0, 0xc42028dfc0)
[WARNING] [09:57:15+0000] 	/usr/local/go/src/testing/testing.go:748 +0xda
[WARNING] [09:57:15+0000] created by testing.(*T).Run
[WARNING] [09:57:15+0000] 	/usr/local/go/src/testing/testing.go:789 +0x2de 
[INFO] [09:57:15+0000] jUnit XML report placed at _output/scripts/test-integration/artifacts/gotest_report_B2gmn.xml
Of 0 tests executed in 0.000s, 0 succeeded, 0 failed, and 0 were skipped.
[WARNING] [09:57:15+0000] While the jUnit report found no failed tests, the `go test` process failed.
[WARNING] [09:57:15+0000] This usually means that the unit test suite failed to compile.
[ERROR] [09:57:15+0000] hack/test-go.sh exited with code 1 after 00h 38m 56s
[ERROR] [09:57:15+0000] PID 1249: hack/test-integration.sh:18: `COVERAGE_SPEC=" " DETECT_RACES=false TMPDIR="${BASETMPDIR}" TIMEOUT=45m GOTEST_FLAGS="${gotest_flags}" "${OS_ROOT}/hack/test-go.sh" "test/integration/runner"` exited with status 1.
[INFO] [09:57:15+0000] 		Stack Trace: 
[INFO] [09:57:15+0000] 		  1: hack/test-integration.sh:18: `COVERAGE_SPEC=" " DETECT_RACES=false TMPDIR="${BASETMPDIR}" TIMEOUT=45m GOTEST_FLAGS="${gotest_flags}" "${OS_ROOT}/hack/test-go.sh" "test/integration/runner"`
[INFO] [09:57:15+0000]   Exiting with code 1.
make: *** [test-integration] Error 1
[WARNING] [09:57:17+0000] Copying _output/local/releases from the container failed!
[WARNING] [09:57:17+0000] Error response from daemon: lstat /var/lib/docker/overlay2/4b7983a15bf8309f329c3a93c62a45d69f30959345485cc9d9b14fa4896607dc/merged/go/src/github.com/openshift/origin/_output/local/releases: no such file or directory
[ERROR] [09:57:17+0000] PID 10833: hack/lib/build/environment.sh:172: `return "${exitcode}"` exited with status 2.
[INFO] [09:57:17+0000] 		Stack Trace: 
[INFO] [09:57:17+0000] 		  1: hack/lib/build/environment.sh:172: `return "${exitcode}"`
[INFO] [09:57:17+0000] 		  2: hack/lib/build/environment.sh:281: os::build::environment::withsource
[INFO] [09:57:17+0000] 		  3: hack/env:42: os::build::environment::run
[INFO] [09:57:17+0000]   Exiting with code 2.
++ export status=FAILURE
++ status=FAILURE
+ set +o xtrace
########## FINISHED STAGE: FAILURE: RUN INTEGRATION TESTS [00h 51m 26s] ##########
Build step 'Execute shell' marked build as failure
[PostBuildScript] - Executing post build scripts.
[workspace] $ /bin/bash /tmp/jenkins5609566924214389013.sh
########## STARTING STAGE: DOWNLOAD ARTIFACTS FROM THE REMOTE HOST ##########
+ [[ -s /var/lib/jenkins/jobs/test_pull_request_origin_integration/workspace/activate ]]
+ source /var/lib/jenkins/jobs/test_pull_request_origin_integration/workspace/activate
++ export VIRTUAL_ENV=/var/lib/jenkins/origin-ci-tool/7a5c5e83c372ad2e6b3b64b3efa16fe2cb37ef83
++ VIRTUAL_ENV=/var/lib/jenkins/origin-ci-tool/7a5c5e83c372ad2e6b3b64b3efa16fe2cb37ef83
++ export PATH=/var/lib/jenkins/origin-ci-tool/7a5c5e83c372ad2e6b3b64b3efa16fe2cb37ef83/bin:/sbin:/usr/sbin:/bin:/usr/bin
++ PATH=/var/lib/jenkins/origin-ci-tool/7a5c5e83c372ad2e6b3b64b3efa16fe2cb37ef83/bin:/sbin:/usr/sbin:/bin:/usr/bin
++ unset PYTHON_HOME
++ export OCT_CONFIG_HOME=/var/lib/jenkins/jobs/test_pull_request_origin_integration/workspace/.config
++ OCT_CONFIG_HOME=/var/lib/jenkins/jobs/test_pull_request_origin_integration/workspace/.config
+ trap 'exit 0' EXIT
++ pwd
+ ARTIFACT_DIR=/var/lib/jenkins/jobs/test_pull_request_origin_integration/workspace/artifacts/gathered
+ rm -rf /var/lib/jenkins/jobs/test_pull_request_origin_integration/workspace/artifacts/gathered
+ mkdir -p /var/lib/jenkins/jobs/test_pull_request_origin_integration/workspace/artifacts/gathered
+ ssh -F /var/lib/jenkins/jobs/test_pull_request_origin_integration/workspace/.config/origin-ci-tool/inventory/.ssh_config openshiftdevel sudo stat /data/src/github.com/openshift/origin/_output/scripts
  File: ‘/data/src/github.com/openshift/origin/_output/scripts’
  Size: 61        	Blocks: 0          IO Block: 4096   directory
Device: ca02h/51714d	Inode: 42307019    Links: 5
Access: (2755/drwxr-sr-x)  Uid: ( 1001/  origin)   Gid: ( 1003/origin-git)
Context: unconfined_u:object_r:container_file_t:s0
Access: 1970-01-01 00:00:00.000000000 +0000
Modify: 2018-05-21 09:07:47.000000000 +0000
Change: 2018-05-21 09:57:17.207936939 +0000
 Birth: -
+ ssh -F /var/lib/jenkins/jobs/test_pull_request_origin_integration/workspace/.config/origin-ci-tool/inventory/.ssh_config openshiftdevel sudo chmod -R o+rX /data/src/github.com/openshift/origin/_output/scripts
+ scp -r -F /var/lib/jenkins/jobs/test_pull_request_origin_integration/workspace/.config/origin-ci-tool/inventory/.ssh_config openshiftdevel:/data/src/github.com/openshift/origin/_output/scripts /var/lib/jenkins/jobs/test_pull_request_origin_integration/workspace/artifacts/gathered
+ tree /var/lib/jenkins/jobs/test_pull_request_origin_integration/workspace/artifacts/gathered
/var/lib/jenkins/jobs/test_pull_request_origin_integration/workspace/artifacts/gathered
└── scripts
    ├── shell
    │   ├── artifacts
    │   ├── logs
    │   │   ├── 72a2ed510f0d400f118decf9cc99f87793d604c4573ae5165ff0c2240fa82255.json
    │   │   └── scripts.log
    │   └── openshift.local.home
    ├── test-integration
    │   ├── artifacts
    │   │   ├── gotest_report_B2gmn
    │   │   └── gotest_report_B2gmn.xml
    │   ├── logs
    │   │   ├── raw_test_output.log
    │   │   ├── scripts.log
    │   │   └── test-go-err.log
    │   └── openshift.local.home
    └── test-tools
        ├── artifacts
        ├── logs
        │   ├── raw_test_output.log
        │   └── scripts.log
        └── openshift.local.home

13 directories, 9 files
+ exit 0
[workspace] $ /bin/bash /tmp/jenkins3896904764774531754.sh
########## STARTING STAGE: GENERATE ARTIFACTS FROM THE REMOTE HOST ##########
+ [[ -s /var/lib/jenkins/jobs/test_pull_request_origin_integration/workspace/activate ]]
+ source /var/lib/jenkins/jobs/test_pull_request_origin_integration/workspace/activate
++ export VIRTUAL_ENV=/var/lib/jenkins/origin-ci-tool/7a5c5e83c372ad2e6b3b64b3efa16fe2cb37ef83
++ VIRTUAL_ENV=/var/lib/jenkins/origin-ci-tool/7a5c5e83c372ad2e6b3b64b3efa16fe2cb37ef83
++ export PATH=/var/lib/jenkins/origin-ci-tool/7a5c5e83c372ad2e6b3b64b3efa16fe2cb37ef83/bin:/sbin:/usr/sbin:/bin:/usr/bin
++ PATH=/var/lib/jenkins/origin-ci-tool/7a5c5e83c372ad2e6b3b64b3efa16fe2cb37ef83/bin:/sbin:/usr/sbin:/bin:/usr/bin
++ unset PYTHON_HOME
++ export OCT_CONFIG_HOME=/var/lib/jenkins/jobs/test_pull_request_origin_integration/workspace/.config
++ OCT_CONFIG_HOME=/var/lib/jenkins/jobs/test_pull_request_origin_integration/workspace/.config
+ trap 'exit 0' EXIT
++ pwd
+ ARTIFACT_DIR=/var/lib/jenkins/jobs/test_pull_request_origin_integration/workspace/artifacts/generated
+ rm -rf /var/lib/jenkins/jobs/test_pull_request_origin_integration/workspace/artifacts/generated
+ mkdir /var/lib/jenkins/jobs/test_pull_request_origin_integration/workspace/artifacts/generated
+ ssh -F /var/lib/jenkins/jobs/test_pull_request_origin_integration/workspace/.config/origin-ci-tool/inventory/.ssh_config openshiftdevel 'sudo docker version && sudo docker info && sudo docker images && sudo docker ps -a 2>&1'
  WARNING: You're not using the default seccomp profile
+ ssh -F /var/lib/jenkins/jobs/test_pull_request_origin_integration/workspace/.config/origin-ci-tool/inventory/.ssh_config openshiftdevel 'sudo cat /etc/sysconfig/docker /etc/sysconfig/docker-network /etc/sysconfig/docker-storage /etc/sysconfig/docker-storage-setup /etc/systemd/system/docker.service 2>&1'
+ true
+ ssh -F /var/lib/jenkins/jobs/test_pull_request_origin_integration/workspace/.config/origin-ci-tool/inventory/.ssh_config openshiftdevel 'sudo find /var/lib/docker/containers -name *.log | sudo xargs tail -vn +1 2>&1'
+ ssh -F /var/lib/jenkins/jobs/test_pull_request_origin_integration/workspace/.config/origin-ci-tool/inventory/.ssh_config openshiftdevel 'oc get --raw /metrics --server=https://$( uname --nodename ):10250 --config=/etc/origin/master/admin.kubeconfig 2>&1'
+ true
+ ssh -F /var/lib/jenkins/jobs/test_pull_request_origin_integration/workspace/.config/origin-ci-tool/inventory/.ssh_config openshiftdevel 'sudo ausearch -m AVC -m SELINUX_ERR -m USER_AVC 2>&1'
+ true
+ ssh -F /var/lib/jenkins/jobs/test_pull_request_origin_integration/workspace/.config/origin-ci-tool/inventory/.ssh_config openshiftdevel 'oc get --raw /metrics --config=/etc/origin/master/admin.kubeconfig 2>&1'
+ true
+ ssh -F /var/lib/jenkins/jobs/test_pull_request_origin_integration/workspace/.config/origin-ci-tool/inventory/.ssh_config openshiftdevel 'sudo df -T -h && sudo pvs && sudo vgs && sudo lvs && sudo findmnt --all 2>&1'
+ ssh -F /var/lib/jenkins/jobs/test_pull_request_origin_integration/workspace/.config/origin-ci-tool/inventory/.ssh_config openshiftdevel 'sudo yum list installed 2>&1'
+ ssh -F /var/lib/jenkins/jobs/test_pull_request_origin_integration/workspace/.config/origin-ci-tool/inventory/.ssh_config openshiftdevel 'sudo journalctl --dmesg --no-pager --all --lines=all 2>&1'
+ ssh -F /var/lib/jenkins/jobs/test_pull_request_origin_integration/workspace/.config/origin-ci-tool/inventory/.ssh_config openshiftdevel 'sudo journalctl _PID=1 --no-pager --all --lines=all 2>&1'
+ tree /var/lib/jenkins/jobs/test_pull_request_origin_integration/workspace/artifacts/generated
/var/lib/jenkins/jobs/test_pull_request_origin_integration/workspace/artifacts/generated
├── avc_denials.log
├── containers.log
├── dmesg.log
├── docker.config
├── docker.info
├── filesystem.info
├── installed_packages.log
├── master-metrics.log
├── node-metrics.log
└── pid1.journal

0 directories, 10 files
+ exit 0
[workspace] $ /bin/bash /tmp/jenkins8164530932058465174.sh
########## STARTING STAGE: FETCH SYSTEMD JOURNALS FROM THE REMOTE HOST ##########
+ [[ -s /var/lib/jenkins/jobs/test_pull_request_origin_integration/workspace/activate ]]
+ source /var/lib/jenkins/jobs/test_pull_request_origin_integration/workspace/activate
++ export VIRTUAL_ENV=/var/lib/jenkins/origin-ci-tool/7a5c5e83c372ad2e6b3b64b3efa16fe2cb37ef83
++ VIRTUAL_ENV=/var/lib/jenkins/origin-ci-tool/7a5c5e83c372ad2e6b3b64b3efa16fe2cb37ef83
++ export PATH=/var/lib/jenkins/origin-ci-tool/7a5c5e83c372ad2e6b3b64b3efa16fe2cb37ef83/bin:/sbin:/usr/sbin:/bin:/usr/bin
++ PATH=/var/lib/jenkins/origin-ci-tool/7a5c5e83c372ad2e6b3b64b3efa16fe2cb37ef83/bin:/sbin:/usr/sbin:/bin:/usr/bin
++ unset PYTHON_HOME
++ export OCT_CONFIG_HOME=/var/lib/jenkins/jobs/test_pull_request_origin_integration/workspace/.config
++ OCT_CONFIG_HOME=/var/lib/jenkins/jobs/test_pull_request_origin_integration/workspace/.config
+ trap 'exit 0' EXIT
++ pwd
+ ARTIFACT_DIR=/var/lib/jenkins/jobs/test_pull_request_origin_integration/workspace/artifacts/journals
+ rm -rf /var/lib/jenkins/jobs/test_pull_request_origin_integration/workspace/artifacts/journals
+ mkdir /var/lib/jenkins/jobs/test_pull_request_origin_integration/workspace/artifacts/journals
+ ssh -F /var/lib/jenkins/jobs/test_pull_request_origin_integration/workspace/.config/origin-ci-tool/inventory/.ssh_config openshiftdevel sudo journalctl --unit docker.service --no-pager --all --lines=all
+ ssh -F /var/lib/jenkins/jobs/test_pull_request_origin_integration/workspace/.config/origin-ci-tool/inventory/.ssh_config openshiftdevel sudo journalctl --unit dnsmasq.service --no-pager --all --lines=all
+ ssh -F /var/lib/jenkins/jobs/test_pull_request_origin_integration/workspace/.config/origin-ci-tool/inventory/.ssh_config openshiftdevel sudo journalctl --unit systemd-journald.service --no-pager --all --lines=all
+ tree /var/lib/jenkins/jobs/test_pull_request_origin_integration/workspace/artifacts/journals
/var/lib/jenkins/jobs/test_pull_request_origin_integration/workspace/artifacts/journals
├── dnsmasq.service
├── docker.service
└── systemd-journald.service

0 directories, 3 files
+ exit 0
[workspace] $ /bin/bash /tmp/jenkins6341909990049640474.sh
########## STARTING STAGE: ASSEMBLE GCS OUTPUT ##########
+ [[ -s /var/lib/jenkins/jobs/test_pull_request_origin_integration/workspace/activate ]]
+ source /var/lib/jenkins/jobs/test_pull_request_origin_integration/workspace/activate
++ export VIRTUAL_ENV=/var/lib/jenkins/origin-ci-tool/7a5c5e83c372ad2e6b3b64b3efa16fe2cb37ef83
++ VIRTUAL_ENV=/var/lib/jenkins/origin-ci-tool/7a5c5e83c372ad2e6b3b64b3efa16fe2cb37ef83
++ export PATH=/var/lib/jenkins/origin-ci-tool/7a5c5e83c372ad2e6b3b64b3efa16fe2cb37ef83/bin:/sbin:/usr/sbin:/bin:/usr/bin
++ PATH=/var/lib/jenkins/origin-ci-tool/7a5c5e83c372ad2e6b3b64b3efa16fe2cb37ef83/bin:/sbin:/usr/sbin:/bin:/usr/bin
++ unset PYTHON_HOME
++ export OCT_CONFIG_HOME=/var/lib/jenkins/jobs/test_pull_request_origin_integration/workspace/.config
++ OCT_CONFIG_HOME=/var/lib/jenkins/jobs/test_pull_request_origin_integration/workspace/.config
+ trap 'exit 0' EXIT
+ mkdir -p gcs/artifacts gcs/artifacts/generated gcs/artifacts/journals gcs/artifacts/gathered
++ python -c 'import json; import urllib; print json.load(urllib.urlopen('\''https://ci.openshift.redhat.com/jenkins/job/test_pull_request_origin_integration/17972/api/json'\''))['\''result'\'']'
+ result=FAILURE
+ cat
++ date +%s
+ cat /var/lib/jenkins/jobs/test_pull_request_origin_integration/builds/17972/log
+ cp artifacts/generated/avc_denials.log artifacts/generated/containers.log artifacts/generated/dmesg.log artifacts/generated/docker.config artifacts/generated/docker.info artifacts/generated/filesystem.info artifacts/generated/installed_packages.log artifacts/generated/master-metrics.log artifacts/generated/node-metrics.log artifacts/generated/pid1.journal gcs/artifacts/generated/
+ cp artifacts/journals/dnsmasq.service artifacts/journals/docker.service artifacts/journals/systemd-journald.service gcs/artifacts/journals/
+ cp -r artifacts/gathered/scripts gcs/artifacts/
++ pwd
+ scp -F /var/lib/jenkins/jobs/test_pull_request_origin_integration/workspace/.config/origin-ci-tool/inventory/.ssh_config -r /var/lib/jenkins/jobs/test_pull_request_origin_integration/workspace/gcs openshiftdevel:/data
+ scp -F /var/lib/jenkins/jobs/test_pull_request_origin_integration/workspace/.config/origin-ci-tool/inventory/.ssh_config /var/lib/jenkins/.config/gcloud/gcs-publisher-credentials.json openshiftdevel:/data/credentials.json
+ exit 0
[workspace] $ /bin/bash /tmp/jenkins8520152687768795770.sh
########## STARTING STAGE: PUSH THE ARTIFACTS AND METADATA ##########
+ [[ -s /var/lib/jenkins/jobs/test_pull_request_origin_integration/workspace/activate ]]
+ source /var/lib/jenkins/jobs/test_pull_request_origin_integration/workspace/activate
++ export VIRTUAL_ENV=/var/lib/jenkins/origin-ci-tool/7a5c5e83c372ad2e6b3b64b3efa16fe2cb37ef83
++ VIRTUAL_ENV=/var/lib/jenkins/origin-ci-tool/7a5c5e83c372ad2e6b3b64b3efa16fe2cb37ef83
++ export PATH=/var/lib/jenkins/origin-ci-tool/7a5c5e83c372ad2e6b3b64b3efa16fe2cb37ef83/bin:/sbin:/usr/sbin:/bin:/usr/bin
++ PATH=/var/lib/jenkins/origin-ci-tool/7a5c5e83c372ad2e6b3b64b3efa16fe2cb37ef83/bin:/sbin:/usr/sbin:/bin:/usr/bin
++ unset PYTHON_HOME
++ export OCT_CONFIG_HOME=/var/lib/jenkins/jobs/test_pull_request_origin_integration/workspace/.config
++ OCT_CONFIG_HOME=/var/lib/jenkins/jobs/test_pull_request_origin_integration/workspace/.config
++ mktemp
+ script=/tmp/tmp.lVPeIBwNHU
+ cat
+ chmod +x /tmp/tmp.lVPeIBwNHU
+ scp -F /var/lib/jenkins/jobs/test_pull_request_origin_integration/workspace/.config/origin-ci-tool/inventory/.ssh_config /tmp/tmp.lVPeIBwNHU openshiftdevel:/tmp/tmp.lVPeIBwNHU
+ ssh -F /var/lib/jenkins/jobs/test_pull_request_origin_integration/workspace/.config/origin-ci-tool/inventory/.ssh_config -t openshiftdevel 'bash -l -c "timeout 300 /tmp/tmp.lVPeIBwNHU"'
+ cd /home/origin
+ trap 'exit 0' EXIT
+ [[ -n {"type":"presubmit","job":"test_pull_request_origin_integration","buildid":"38d35ec8-5cd5-11e8-ae4a-0a58ac100556","refs":{"org":"openshift","repo":"origin","base_ref":"master","base_sha":"23a04201b84307588e1d527b09c82714d9cbf788","pulls":[{"number":19759,"author":"wozniakjan","sha":"1ba7ac484864738d371f97e962beb737c4d8def8"}]}} ]]
++ jq --compact-output .buildid
+ [[ "38d35ec8-5cd5-11e8-ae4a-0a58ac100556" =~ ^"[0-9]+"$ ]]
Using BUILD_NUMBER
+ echo 'Using BUILD_NUMBER'
++ jq --compact-output '.buildid |= "17972"'
+ JOB_SPEC='{"type":"presubmit","job":"test_pull_request_origin_integration","buildid":"17972","refs":{"org":"openshift","repo":"origin","base_ref":"master","base_sha":"23a04201b84307588e1d527b09c82714d9cbf788","pulls":[{"number":19759,"author":"wozniakjan","sha":"1ba7ac484864738d371f97e962beb737c4d8def8"}]}}'
+ docker run -e 'JOB_SPEC={"type":"presubmit","job":"test_pull_request_origin_integration","buildid":"17972","refs":{"org":"openshift","repo":"origin","base_ref":"master","base_sha":"23a04201b84307588e1d527b09c82714d9cbf788","pulls":[{"number":19759,"author":"wozniakjan","sha":"1ba7ac484864738d371f97e962beb737c4d8def8"}]}}' -v /data:/data:z registry.svc.ci.openshift.org/ci/gcsupload:latest --dry-run=false --gcs-path=gs://origin-ci-test --gcs-credentials-file=/data/credentials.json --path-strategy=single --default-org=openshift --default-repo=origin /data/gcs/artifacts /data/gcs/build-log.txt /data/gcs/finished.json
Unable to find image 'registry.svc.ci.openshift.org/ci/gcsupload:latest' locally
Trying to pull repository registry.svc.ci.openshift.org/ci/gcsupload ... 
latest: Pulling from registry.svc.ci.openshift.org/ci/gcsupload
6d987f6f4279: Already exists
4cccebe844ee: Already exists
cafcba51f636: Pulling fs layer
cafcba51f636: Verifying Checksum
cafcba51f636: Download complete
cafcba51f636: Pull complete
Digest: sha256:c452798b56e3f4649c557c3ff7273126042065e3be152689a1ffb880638e617d
Status: Downloaded newer image for registry.svc.ci.openshift.org/ci/gcsupload:latest
{"component":"gcsupload","level":"info","msg":"Gathering artifacts from artifact directory: /data/gcs/artifacts","time":"2018-05-21T09:58:11Z"}
{"component":"gcsupload","level":"info","msg":"Found /data/gcs/artifacts/generated/avc_denials.log in artifact directory. Uploading as artifacts/generated/avc_denials.log\n","time":"2018-05-21T09:58:11Z"}
{"component":"gcsupload","level":"info","msg":"Found /data/gcs/artifacts/generated/containers.log in artifact directory. Uploading as artifacts/generated/containers.log\n","time":"2018-05-21T09:58:11Z"}
{"component":"gcsupload","level":"info","msg":"Found /data/gcs/artifacts/generated/dmesg.log in artifact directory. Uploading as artifacts/generated/dmesg.log\n","time":"2018-05-21T09:58:11Z"}
{"component":"gcsupload","level":"info","msg":"Found /data/gcs/artifacts/generated/docker.config in artifact directory. Uploading as artifacts/generated/docker.config\n","time":"2018-05-21T09:58:11Z"}
{"component":"gcsupload","level":"info","msg":"Found /data/gcs/artifacts/generated/docker.info in artifact directory. Uploading as artifacts/generated/docker.info\n","time":"2018-05-21T09:58:11Z"}
{"component":"gcsupload","level":"info","msg":"Found /data/gcs/artifacts/generated/filesystem.info in artifact directory. Uploading as artifacts/generated/filesystem.info\n","time":"2018-05-21T09:58:11Z"}
{"component":"gcsupload","level":"info","msg":"Found /data/gcs/artifacts/generated/installed_packages.log in artifact directory. Uploading as artifacts/generated/installed_packages.log\n","time":"2018-05-21T09:58:11Z"}
{"component":"gcsupload","level":"info","msg":"Found /data/gcs/artifacts/generated/master-metrics.log in artifact directory. Uploading as artifacts/generated/master-metrics.log\n","time":"2018-05-21T09:58:11Z"}
{"component":"gcsupload","level":"info","msg":"Found /data/gcs/artifacts/generated/node-metrics.log in artifact directory. Uploading as artifacts/generated/node-metrics.log\n","time":"2018-05-21T09:58:11Z"}
{"component":"gcsupload","level":"info","msg":"Found /data/gcs/artifacts/generated/pid1.journal in artifact directory. Uploading as artifacts/generated/pid1.journal\n","time":"2018-05-21T09:58:11Z"}
{"component":"gcsupload","level":"info","msg":"Found /data/gcs/artifacts/journals/dnsmasq.service in artifact directory. Uploading as artifacts/journals/dnsmasq.service\n","time":"2018-05-21T09:58:11Z"}
{"component":"gcsupload","level":"info","msg":"Found /data/gcs/artifacts/journals/docker.service in artifact directory. Uploading as artifacts/journals/docker.service\n","time":"2018-05-21T09:58:11Z"}
{"component":"gcsupload","level":"info","msg":"Found /data/gcs/artifacts/journals/systemd-journald.service in artifact directory. Uploading as artifacts/journals/systemd-journald.service\n","time":"2018-05-21T09:58:11Z"}
{"component":"gcsupload","level":"info","msg":"Found /data/gcs/artifacts/scripts/shell/logs/72a2ed510f0d400f118decf9cc99f87793d604c4573ae5165ff0c2240fa82255.json in artifact directory. Uploading as artifacts/scripts/shell/logs/72a2ed510f0d400f118decf9cc99f87793d604c4573ae5165ff0c2240fa82255.json\n","time":"2018-05-21T09:58:11Z"}
{"component":"gcsupload","level":"info","msg":"Found /data/gcs/artifacts/scripts/shell/logs/scripts.log in artifact directory. Uploading as artifacts/scripts/shell/logs/scripts.log\n","time":"2018-05-21T09:58:11Z"}
{"component":"gcsupload","level":"info","msg":"Found /data/gcs/artifacts/scripts/test-integration/artifacts/gotest_report_B2gmn in artifact directory. Uploading as artifacts/scripts/test-integration/artifacts/gotest_report_B2gmn\n","time":"2018-05-21T09:58:11Z"}
{"component":"gcsupload","level":"info","msg":"Found /data/gcs/artifacts/scripts/test-integration/artifacts/gotest_report_B2gmn.xml in artifact directory. Uploading as artifacts/scripts/test-integration/artifacts/gotest_report_B2gmn.xml\n","time":"2018-05-21T09:58:11Z"}
{"component":"gcsupload","level":"info","msg":"Found /data/gcs/artifacts/scripts/test-integration/logs/raw_test_output.log in artifact directory. Uploading as artifacts/scripts/test-integration/logs/raw_test_output.log\n","time":"2018-05-21T09:58:11Z"}
{"component":"gcsupload","level":"info","msg":"Found /data/gcs/artifacts/scripts/test-integration/logs/scripts.log in artifact directory. Uploading as artifacts/scripts/test-integration/logs/scripts.log\n","time":"2018-05-21T09:58:11Z"}
{"component":"gcsupload","level":"info","msg":"Found /data/gcs/artifacts/scripts/test-integration/logs/test-go-err.log in artifact directory. Uploading as artifacts/scripts/test-integration/logs/test-go-err.log\n","time":"2018-05-21T09:58:11Z"}
{"component":"gcsupload","level":"info","msg":"Found /data/gcs/artifacts/scripts/test-tools/logs/raw_test_output.log in artifact directory. Uploading as artifacts/scripts/test-tools/logs/raw_test_output.log\n","time":"2018-05-21T09:58:11Z"}
{"component":"gcsupload","level":"info","msg":"Found /data/gcs/artifacts/scripts/test-tools/logs/scripts.log in artifact directory. Uploading as artifacts/scripts/test-tools/logs/scripts.log\n","time":"2018-05-21T09:58:11Z"}
{"component":"gcsupload","dest":"pr-logs/pull/19759/test_pull_request_origin_integration/17972/artifacts/journals/dnsmasq.service","level":"info","msg":"Queued for upload","time":"2018-05-21T09:58:11Z"}
{"component":"gcsupload","dest":"pr-logs/pull/19759/test_pull_request_origin_integration/17972/artifacts/scripts/shell/logs/72a2ed510f0d400f118decf9cc99f87793d604c4573ae5165ff0c2240fa82255.json","level":"info","msg":"Queued for upload","time":"2018-05-21T09:58:11Z"}
{"component":"gcsupload","dest":"pr-logs/pull/19759/test_pull_request_origin_integration/17972/artifacts/generated/docker.info","level":"info","msg":"Queued for upload","time":"2018-05-21T09:58:11Z"}
{"component":"gcsupload","dest":"pr-logs/pull/19759/test_pull_request_origin_integration/17972/artifacts/journals/systemd-journald.service","level":"info","msg":"Queued for upload","time":"2018-05-21T09:58:11Z"}
{"component":"gcsupload","dest":"pr-logs/pull/19759/test_pull_request_origin_integration/17972/artifacts/scripts/test-integration/artifacts/gotest_report_B2gmn","level":"info","msg":"Queued for upload","time":"2018-05-21T09:58:11Z"}
{"component":"gcsupload","dest":"pr-logs/pull/19759/test_pull_request_origin_integration/17972/artifacts/scripts/test-integration/artifacts/gotest_report_B2gmn.xml","level":"info","msg":"Queued for upload","time":"2018-05-21T09:58:11Z"}
{"component":"gcsupload","dest":"pr-logs/pull/19759/test_pull_request_origin_integration/17972/artifacts/generated/containers.log","level":"info","msg":"Queued for upload","time":"2018-05-21T09:58:11Z"}
{"component":"gcsupload","dest":"pr-logs/pull/19759/test_pull_request_origin_integration/17972/artifacts/generated/dmesg.log","level":"info","msg":"Queued for upload","time":"2018-05-21T09:58:11Z"}
{"component":"gcsupload","dest":"pr-logs/pull/19759/test_pull_request_origin_integration/17972/artifacts/generated/pid1.journal","level":"info","msg":"Queued for upload","time":"2018-05-21T09:58:11Z"}
{"component":"gcsupload","dest":"pr-logs/pull/19759/test_pull_request_origin_integration/17972/artifacts/generated/avc_denials.log","level":"info","msg":"Queued for upload","time":"2018-05-21T09:58:11Z"}
{"component":"gcsupload","dest":"pr-logs/pull/19759/test_pull_request_origin_integration/17972/artifacts/generated/node-metrics.log","level":"info","msg":"Queued for upload","time":"2018-05-21T09:58:11Z"}
{"component":"gcsupload","dest":"pr-logs/pull/19759/test_pull_request_origin_integration/17972/artifacts/scripts/test-integration/logs/scripts.log","level":"info","msg":"Queued for upload","time":"2018-05-21T09:58:11Z"}
{"component":"gcsupload","dest":"pr-logs/pull/19759/test_pull_request_origin_integration/17972/artifacts/scripts/test-integration/logs/test-go-err.log","level":"info","msg":"Queued for upload","time":"2018-05-21T09:58:11Z"}
{"component":"gcsupload","dest":"pr-logs/pull/19759/test_pull_request_origin_integration/17972/artifacts/generated/installed_packages.log","level":"info","msg":"Queued for upload","time":"2018-05-21T09:58:11Z"}
{"component":"gcsupload","dest":"pr-logs/pull/19759/test_pull_request_origin_integration/17972/artifacts/scripts/shell/logs/scripts.log","level":"info","msg":"Queued for upload","time":"2018-05-21T09:58:11Z"}
{"component":"gcsupload","dest":"pr-logs/pull/19759/test_pull_request_origin_integration/17972/artifacts/scripts/test-tools/logs/scripts.log","level":"info","msg":"Queued for upload","time":"2018-05-21T09:58:11Z"}
{"component":"gcsupload","dest":"pr-logs/pull/19759/test_pull_request_origin_integration/17972/finished.json","level":"info","msg":"Queued for upload","time":"2018-05-21T09:58:11Z"}
{"component":"gcsupload","dest":"pr-logs/directory/test_pull_request_origin_integration/17972.txt","level":"info","msg":"Queued for upload","time":"2018-05-21T09:58:11Z"}
{"component":"gcsupload","dest":"pr-logs/directory/test_pull_request_origin_integration/latest-build.txt","level":"info","msg":"Queued for upload","time":"2018-05-21T09:58:11Z"}
{"component":"gcsupload","dest":"pr-logs/pull/19759/test_pull_request_origin_integration/17972/build-log.txt","level":"info","msg":"Queued for upload","time":"2018-05-21T09:58:11Z"}
{"component":"gcsupload","dest":"pr-logs/pull/19759/test_pull_request_origin_integration/latest-build.txt","level":"info","msg":"Queued for upload","time":"2018-05-21T09:58:11Z"}
{"component":"gcsupload","dest":"pr-logs/pull/19759/test_pull_request_origin_integration/17972/artifacts/generated/docker.config","level":"info","msg":"Queued for upload","time":"2018-05-21T09:58:11Z"}
{"component":"gcsupload","dest":"pr-logs/pull/19759/test_pull_request_origin_integration/17972/artifacts/scripts/test-integration/logs/raw_test_output.log","level":"info","msg":"Queued for upload","time":"2018-05-21T09:58:11Z"}
{"component":"gcsupload","dest":"pr-logs/pull/19759/test_pull_request_origin_integration/17972/artifacts/scripts/test-tools/logs/raw_test_output.log","level":"info","msg":"Queued for upload","time":"2018-05-21T09:58:11Z"}
{"component":"gcsupload","dest":"pr-logs/pull/19759/test_pull_request_origin_integration/17972/artifacts/generated/filesystem.info","level":"info","msg":"Queued for upload","time":"2018-05-21T09:58:11Z"}
{"component":"gcsupload","dest":"pr-logs/pull/19759/test_pull_request_origin_integration/17972/artifacts/generated/master-metrics.log","level":"info","msg":"Queued for upload","time":"2018-05-21T09:58:11Z"}
{"component":"gcsupload","dest":"pr-logs/pull/19759/test_pull_request_origin_integration/17972/artifacts/journals/docker.service","level":"info","msg":"Queued for upload","time":"2018-05-21T09:58:11Z"}
{"component":"gcsupload","dest":"pr-logs/pull/19759/test_pull_request_origin_integration/17972/artifacts/scripts/test-integration/artifacts/gotest_report_B2gmn","level":"info","msg":"Finished upload","time":"2018-05-21T09:58:12Z"}
{"component":"gcsupload","dest":"pr-logs/pull/19759/test_pull_request_origin_integration/17972/artifacts/generated/node-metrics.log","level":"info","msg":"Finished upload","time":"2018-05-21T09:58:12Z"}
{"component":"gcsupload","dest":"pr-logs/pull/19759/test_pull_request_origin_integration/17972/artifacts/scripts/test-integration/artifacts/gotest_report_B2gmn.xml","level":"info","msg":"Finished upload","time":"2018-05-21T09:58:12Z"}
{"component":"gcsupload","dest":"pr-logs/pull/19759/test_pull_request_origin_integration/17972/artifacts/scripts/test-integration/logs/scripts.log","level":"info","msg":"Finished upload","time":"2018-05-21T09:58:12Z"}
{"component":"gcsupload","dest":"pr-logs/pull/19759/test_pull_request_origin_integration/17972/artifacts/scripts/test-integration/logs/raw_test_output.log","level":"info","msg":"Finished upload","time":"2018-05-21T09:58:12Z"}
{"component":"gcsupload","dest":"pr-logs/pull/19759/test_pull_request_origin_integration/17972/artifacts/generated/containers.log","level":"info","msg":"Finished upload","time":"2018-05-21T09:58:12Z"}
{"component":"gcsupload","dest":"pr-logs/pull/19759/test_pull_request_origin_integration/17972/artifacts/scripts/test-tools/logs/raw_test_output.log","level":"info","msg":"Finished upload","time":"2018-05-21T09:58:12Z"}
{"component":"gcsupload","dest":"pr-logs/pull/19759/test_pull_request_origin_integration/17972/artifacts/generated/dmesg.log","level":"info","msg":"Finished upload","time":"2018-05-21T09:58:12Z"}
{"component":"gcsupload","dest":"pr-logs/pull/19759/test_pull_request_origin_integration/17972/artifacts/journals/dnsmasq.service","level":"info","msg":"Finished upload","time":"2018-05-21T09:58:12Z"}
{"component":"gcsupload","dest":"pr-logs/pull/19759/test_pull_request_origin_integration/17972/artifacts/generated/docker.config","level":"info","msg":"Finished upload","time":"2018-05-21T09:58:12Z"}
{"component":"gcsupload","dest":"pr-logs/pull/19759/test_pull_request_origin_integration/latest-build.txt","level":"info","msg":"Finished upload","time":"2018-05-21T09:58:12Z"}
{"component":"gcsupload","dest":"pr-logs/pull/19759/test_pull_request_origin_integration/17972/artifacts/journals/systemd-journald.service","level":"info","msg":"Finished upload","time":"2018-05-21T09:58:12Z"}
{"component":"gcsupload","dest":"pr-logs/pull/19759/test_pull_request_origin_integration/17972/artifacts/generated/installed_packages.log","level":"info","msg":"Finished upload","time":"2018-05-21T09:58:12Z"}
{"component":"gcsupload","dest":"pr-logs/pull/19759/test_pull_request_origin_integration/17972/artifacts/generated/master-metrics.log","level":"info","msg":"Finished upload","time":"2018-05-21T09:58:12Z"}
{"component":"gcsupload","dest":"pr-logs/pull/19759/test_pull_request_origin_integration/17972/finished.json","level":"info","msg":"Finished upload","time":"2018-05-21T09:58:12Z"}
{"component":"gcsupload","dest":"pr-logs/pull/19759/test_pull_request_origin_integration/17972/artifacts/generated/avc_denials.log","level":"info","msg":"Finished upload","time":"2018-05-21T09:58:12Z"}
{"component":"gcsupload","dest":"pr-logs/directory/test_pull_request_origin_integration/latest-build.txt","level":"info","msg":"Finished upload","time":"2018-05-21T09:58:12Z"}
{"component":"gcsupload","dest":"pr-logs/directory/test_pull_request_origin_integration/17972.txt","level":"info","msg":"Finished upload","time":"2018-05-21T09:58:12Z"}
{"component":"gcsupload","dest":"pr-logs/pull/19759/test_pull_request_origin_integration/17972/artifacts/generated/filesystem.info","level":"info","msg":"Finished upload","time":"2018-05-21T09:58:12Z"}
{"component":"gcsupload","dest":"pr-logs/pull/19759/test_pull_request_origin_integration/17972/artifacts/scripts/test-integration/logs/test-go-err.log","level":"info","msg":"Finished upload","time":"2018-05-21T09:58:12Z"}
{"component":"gcsupload","dest":"pr-logs/pull/19759/test_pull_request_origin_integration/17972/artifacts/scripts/shell/logs/scripts.log","level":"info","msg":"Finished upload","time":"2018-05-21T09:58:12Z"}
{"component":"gcsupload","dest":"pr-logs/pull/19759/test_pull_request_origin_integration/17972/artifacts/scripts/shell/logs/72a2ed510f0d400f118decf9cc99f87793d604c4573ae5165ff0c2240fa82255.json","level":"info","msg":"Finished upload","time":"2018-05-21T09:58:12Z"}
{"component":"gcsupload","dest":"pr-logs/pull/19759/test_pull_request_origin_integration/17972/artifacts/generated/docker.info","level":"info","msg":"Finished upload","time":"2018-05-21T09:58:12Z"}
{"component":"gcsupload","dest":"pr-logs/pull/19759/test_pull_request_origin_integration/17972/artifacts/generated/pid1.journal","level":"info","msg":"Finished upload","time":"2018-05-21T09:58:12Z"}
{"component":"gcsupload","dest":"pr-logs/pull/19759/test_pull_request_origin_integration/17972/artifacts/scripts/test-tools/logs/scripts.log","level":"info","msg":"Finished upload","time":"2018-05-21T09:58:12Z"}
{"component":"gcsupload","dest":"pr-logs/pull/19759/test_pull_request_origin_integration/17972/build-log.txt","level":"info","msg":"Finished upload","time":"2018-05-21T09:58:12Z"}
{"component":"gcsupload","dest":"pr-logs/pull/19759/test_pull_request_origin_integration/17972/artifacts/journals/docker.service","level":"info","msg":"Finished upload","time":"2018-05-21T09:58:12Z"}
{"component":"gcsupload","level":"info","msg":"Finished upload to GCS","time":"2018-05-21T09:58:12Z"}
+ exit 0
+ set +o xtrace
########## FINISHED STAGE: SUCCESS: PUSH THE ARTIFACTS AND METADATA [00h 00m 10s] ##########
[workspace] $ /bin/bash /tmp/jenkins3354836797181239150.sh
########## STARTING STAGE: DEPROVISION CLOUD RESOURCES ##########
+ [[ -s /var/lib/jenkins/jobs/test_pull_request_origin_integration/workspace/activate ]]
+ source /var/lib/jenkins/jobs/test_pull_request_origin_integration/workspace/activate
++ export VIRTUAL_ENV=/var/lib/jenkins/origin-ci-tool/7a5c5e83c372ad2e6b3b64b3efa16fe2cb37ef83
++ VIRTUAL_ENV=/var/lib/jenkins/origin-ci-tool/7a5c5e83c372ad2e6b3b64b3efa16fe2cb37ef83
++ export PATH=/var/lib/jenkins/origin-ci-tool/7a5c5e83c372ad2e6b3b64b3efa16fe2cb37ef83/bin:/sbin:/usr/sbin:/bin:/usr/bin
++ PATH=/var/lib/jenkins/origin-ci-tool/7a5c5e83c372ad2e6b3b64b3efa16fe2cb37ef83/bin:/sbin:/usr/sbin:/bin:/usr/bin
++ unset PYTHON_HOME
++ export OCT_CONFIG_HOME=/var/lib/jenkins/jobs/test_pull_request_origin_integration/workspace/.config
++ OCT_CONFIG_HOME=/var/lib/jenkins/jobs/test_pull_request_origin_integration/workspace/.config
+ oct deprovision

PLAYBOOK: main.yml *************************************************************
4 plays in /var/lib/jenkins/origin-ci-tool/7a5c5e83c372ad2e6b3b64b3efa16fe2cb37ef83/lib/python2.7/site-packages/oct/ansible/oct/playbooks/deprovision/main.yml

PLAY [ensure we have the parameters necessary to deprovision virtual hosts] ****

TASK [ensure all required variables are set] ***********************************
task path: /var/lib/jenkins/origin-ci-tool/7a5c5e83c372ad2e6b3b64b3efa16fe2cb37ef83/lib/python2.7/site-packages/oct/ansible/oct/playbooks/deprovision/main.yml:9
skipping: [localhost] => (item=origin_ci_inventory_dir)  => {
    "changed": false, 
    "generated_timestamp": "2018-05-21 05:58:13.865450", 
    "item": "origin_ci_inventory_dir", 
    "skip_reason": "Conditional check failed", 
    "skipped": true
}
skipping: [localhost] => (item=origin_ci_aws_region)  => {
    "changed": false, 
    "generated_timestamp": "2018-05-21 05:58:13.868729", 
    "item": "origin_ci_aws_region", 
    "skip_reason": "Conditional check failed", 
    "skipped": true
}

PLAY [deprovision virtual hosts in EC2] ****************************************

TASK [Gathering Facts] *********************************************************
ok: [localhost]

TASK [deprovision a virtual EC2 host] ******************************************
task path: /var/lib/jenkins/origin-ci-tool/7a5c5e83c372ad2e6b3b64b3efa16fe2cb37ef83/lib/python2.7/site-packages/oct/ansible/oct/playbooks/deprovision/main.yml:28
included: /var/lib/jenkins/origin-ci-tool/7a5c5e83c372ad2e6b3b64b3efa16fe2cb37ef83/lib/python2.7/site-packages/oct/ansible/oct/playbooks/deprovision/roles/aws-down/tasks/main.yml for localhost

TASK [update the SSH configuration to remove AWS EC2 specifics] ****************
task path: /var/lib/jenkins/origin-ci-tool/7a5c5e83c372ad2e6b3b64b3efa16fe2cb37ef83/lib/python2.7/site-packages/oct/ansible/oct/playbooks/deprovision/roles/aws-down/tasks/main.yml:2
ok: [localhost] => {
    "changed": false, 
    "generated_timestamp": "2018-05-21 05:58:14.651685", 
    "msg": ""
}

TASK [rename EC2 instance for termination reaper] ******************************
task path: /var/lib/jenkins/origin-ci-tool/7a5c5e83c372ad2e6b3b64b3efa16fe2cb37ef83/lib/python2.7/site-packages/oct/ansible/oct/playbooks/deprovision/roles/aws-down/tasks/main.yml:8
changed: [localhost] => {
    "changed": true, 
    "generated_timestamp": "2018-05-21 05:58:15.222567", 
    "msg": "Tags {'Name': 'oct-terminate'} created for resource i-0a24e2df8760bfda8."
}

TASK [tear down the EC2 instance] **********************************************
task path: /var/lib/jenkins/origin-ci-tool/7a5c5e83c372ad2e6b3b64b3efa16fe2cb37ef83/lib/python2.7/site-packages/oct/ansible/oct/playbooks/deprovision/roles/aws-down/tasks/main.yml:15
changed: [localhost] => {
    "changed": true, 
    "generated_timestamp": "2018-05-21 05:58:16.082231", 
    "instance_ids": [
        "i-0a24e2df8760bfda8"
    ], 
    "instances": [
        {
            "ami_launch_index": "0", 
            "architecture": "x86_64", 
            "block_device_mapping": {
                "/dev/sda1": {
                    "delete_on_termination": true, 
                    "status": "attached", 
                    "volume_id": "vol-0caa2ad2e247bf2a0"
                }, 
                "/dev/sdb": {
                    "delete_on_termination": true, 
                    "status": "attached", 
                    "volume_id": "vol-0cccab9e3a3dd298c"
                }
            }, 
            "dns_name": "ec2-54-145-171-42.compute-1.amazonaws.com", 
            "ebs_optimized": false, 
            "groups": {
                "sg-7e73221a": "default"
            }, 
            "hypervisor": "xen", 
            "id": "i-0a24e2df8760bfda8", 
            "image_id": "ami-0f07d2d9a03af96ec", 
            "instance_type": "m4.xlarge", 
            "kernel": null, 
            "key_name": "libra", 
            "launch_time": "2018-05-21T08:59:42.000Z", 
            "placement": "us-east-1d", 
            "private_dns_name": "ip-172-18-3-174.ec2.internal", 
            "private_ip": "172.18.3.174", 
            "public_dns_name": "ec2-54-145-171-42.compute-1.amazonaws.com", 
            "public_ip": "54.145.171.42", 
            "ramdisk": null, 
            "region": "us-east-1", 
            "root_device_name": "/dev/sda1", 
            "root_device_type": "ebs", 
            "state": "running", 
            "state_code": 16, 
            "tags": {
                "Name": "oct-terminate", 
                "openshift_etcd": "", 
                "openshift_master": "", 
                "openshift_node": ""
            }, 
            "tenancy": "default", 
            "virtualization_type": "hvm"
        }
    ], 
    "tagged_instances": []
}

TASK [remove the serialized host variables] ************************************
task path: /var/lib/jenkins/origin-ci-tool/7a5c5e83c372ad2e6b3b64b3efa16fe2cb37ef83/lib/python2.7/site-packages/oct/ansible/oct/playbooks/deprovision/roles/aws-down/tasks/main.yml:22
changed: [localhost] => {
    "changed": true, 
    "generated_timestamp": "2018-05-21 05:58:16.325991", 
    "path": "/var/lib/jenkins/jobs/test_pull_request_origin_integration/workspace/.config/origin-ci-tool/inventory/host_vars/172.18.3.174.yml", 
    "state": "absent"
}

PLAY [deprovision virtual hosts locally manged by Vagrant] *********************

TASK [Gathering Facts] *********************************************************
ok: [localhost]

PLAY [clean up local configuration for deprovisioned instances] ****************

TASK [remove inventory configuration directory] ********************************
task path: /var/lib/jenkins/origin-ci-tool/7a5c5e83c372ad2e6b3b64b3efa16fe2cb37ef83/lib/python2.7/site-packages/oct/ansible/oct/playbooks/deprovision/main.yml:61
changed: [localhost] => {
    "changed": true, 
    "generated_timestamp": "2018-05-21 05:58:16.781211", 
    "path": "/var/lib/jenkins/jobs/test_pull_request_origin_integration/workspace/.config/origin-ci-tool/inventory", 
    "state": "absent"
}

PLAY RECAP *********************************************************************
localhost                  : ok=8    changed=4    unreachable=0    failed=0   

+ set +o xtrace
########## FINISHED STAGE: SUCCESS: DEPROVISION CLOUD RESOURCES [00h 00m 04s] ##########
Archiving artifacts
[BFA] Scanning build for known causes...
[BFA] Found failure cause(s):
[BFA] Job Stage Failed
[BFA] Done. 0s
[WS-CLEANUP] Deleting project workspace...[WS-CLEANUP] done
Finished: FAILURE