FailedConsole Output

Skipping 103 KB.. Full Log
[WARNING] [11:27:48+0000] goroutine 6 [chan receive, 30 minutes]:
[WARNING] [11:27:48+0000] testing.tRunner.func1(0xc4200ba0f0)
[WARNING] [11:27:48+0000] 	/usr/local/go/src/testing/testing.go:722 +0x131
[WARNING] [11:27:48+0000] testing.tRunner(0xc4200ba0f0, 0x5d58c0)
[WARNING] [11:27:48+0000] 	/usr/local/go/src/testing/testing.go:748 +0xda
[WARNING] [11:27:48+0000] created by testing.(*T).Run
[WARNING] [11:27:48+0000] 	/usr/local/go/src/testing/testing.go:789 +0x2de
[WARNING] [11:27:48+0000] goroutine 9 [chan receive, 31 minutes]:
[WARNING] [11:27:48+0000] testing.(*testContext).waitParallel(0xc42000e870)
[WARNING] [11:27:48+0000] 	/usr/local/go/src/testing/testing.go:833 +0x9f
[WARNING] [11:27:48+0000] testing.(*T).Parallel(0xc4200ba2d0)
[WARNING] [11:27:48+0000] 	/usr/local/go/src/testing/testing.go:678 +0x13f
[WARNING] [11:27:48+0000] github.com/openshift/origin/test/integration/runner.executeTests.func1(0xc4200ba2d0)
[WARNING] [11:27:48+0000] 	/go/src/github.com/openshift/origin/_output/local/go/src/github.com/openshift/origin/test/integration/runner/runner_test.go:112 +0x9f
[WARNING] [11:27:48+0000] testing.tRunner(0xc4200ba2d0, 0xc4202d9dc0)
[WARNING] [11:27:48+0000] 	/usr/local/go/src/testing/testing.go:746 +0xd0
[WARNING] [11:27:48+0000] created by testing.(*T).Run
[WARNING] [11:27:48+0000] 	/usr/local/go/src/testing/testing.go:789 +0x2de
[WARNING] [11:27:48+0000] goroutine 10 [chan receive, 31 minutes]:
[WARNING] [11:27:48+0000] testing.(*testContext).waitParallel(0xc42000e870)
[WARNING] [11:27:48+0000] 	/usr/local/go/src/testing/testing.go:833 +0x9f
[WARNING] [11:27:48+0000] testing.(*T).Parallel(0xc4200ba3c0)
[WARNING] [11:27:48+0000] 	/usr/local/go/src/testing/testing.go:678 +0x13f
[WARNING] [11:27:48+0000] github.com/openshift/origin/test/integration/runner.executeTests.func1(0xc4200ba3c0)
[WARNING] [11:27:48+0000] 	/go/src/github.com/openshift/origin/_output/local/go/src/github.com/openshift/origin/test/integration/runner/runner_test.go:112 +0x9f
[WARNING] [11:27:48+0000] testing.tRunner(0xc4200ba3c0, 0xc4202d9e00)
[WARNING] [11:27:48+0000] 	/usr/local/go/src/testing/testing.go:746 +0xd0
[WARNING] [11:27:48+0000] created by testing.(*T).Run
[WARNING] [11:27:48+0000] 	/usr/local/go/src/testing/testing.go:789 +0x2de
[WARNING] [11:27:48+0000] goroutine 11 [chan receive, 31 minutes]:
[WARNING] [11:27:48+0000] testing.(*testContext).waitParallel(0xc42000e870)
[WARNING] [11:27:48+0000] 	/usr/local/go/src/testing/testing.go:833 +0x9f
[WARNING] [11:27:48+0000] testing.(*T).Parallel(0xc4200ba4b0)
[WARNING] [11:27:48+0000] 	/usr/local/go/src/testing/testing.go:678 +0x13f
[WARNING] [11:27:48+0000] github.com/openshift/origin/test/integration/runner.executeTests.func1(0xc4200ba4b0)
[WARNING] [11:27:48+0000] 	/go/src/github.com/openshift/origin/_output/local/go/src/github.com/openshift/origin/test/integration/runner/runner_test.go:112 +0x9f
[WARNING] [11:27:48+0000] testing.tRunner(0xc4200ba4b0, 0xc4202d9e40)
[WARNING] [11:27:48+0000] 	/usr/local/go/src/testing/testing.go:746 +0xd0
[WARNING] [11:27:48+0000] created by testing.(*T).Run
[WARNING] [11:27:48+0000] 	/usr/local/go/src/testing/testing.go:789 +0x2de
[WARNING] [11:27:48+0000] goroutine 12 [chan receive, 31 minutes]:
[WARNING] [11:27:48+0000] testing.(*testContext).waitParallel(0xc42000e870)
[WARNING] [11:27:48+0000] 	/usr/local/go/src/testing/testing.go:833 +0x9f
[WARNING] [11:27:48+0000] testing.(*T).Parallel(0xc4200ba5a0)
[WARNING] [11:27:48+0000] 	/usr/local/go/src/testing/testing.go:678 +0x13f
[WARNING] [11:27:48+0000] github.com/openshift/origin/test/integration/runner.executeTests.func1(0xc4200ba5a0)
[WARNING] [11:27:48+0000] 	/go/src/github.com/openshift/origin/_output/local/go/src/github.com/openshift/origin/test/integration/runner/runner_test.go:112 +0x9f
[WARNING] [11:27:48+0000] testing.tRunner(0xc4200ba5a0, 0xc4202d9e80)
[WARNING] [11:27:48+0000] 	/usr/local/go/src/testing/testing.go:746 +0xd0
[WARNING] [11:27:48+0000] created by testing.(*T).Run
[WARNING] [11:27:48+0000] 	/usr/local/go/src/testing/testing.go:789 +0x2de
[WARNING] [11:27:48+0000] goroutine 13 [chan receive, 31 minutes]:
[WARNING] [11:27:48+0000] testing.(*testContext).waitParallel(0xc42000e870)
[WARNING] [11:27:48+0000] 	/usr/local/go/src/testing/testing.go:833 +0x9f
[WARNING] [11:27:48+0000] testing.(*T).Parallel(0xc4200ba690)
[WARNING] [11:27:48+0000] 	/usr/local/go/src/testing/testing.go:678 +0x13f
[WARNING] [11:27:48+0000] github.com/openshift/origin/test/integration/runner.executeTests.func1(0xc4200ba690)
[WARNING] [11:27:48+0000] 	/go/src/github.com/openshift/origin/_output/local/go/src/github.com/openshift/origin/test/integration/runner/runner_test.go:112 +0x9f
[WARNING] [11:27:48+0000] testing.tRunner(0xc4200ba690, 0xc4202d9f40)
[WARNING] [11:27:48+0000] 	/usr/local/go/src/testing/testing.go:746 +0xd0
[WARNING] [11:27:48+0000] created by testing.(*T).Run
[WARNING] [11:27:48+0000] 	/usr/local/go/src/testing/testing.go:789 +0x2de
[WARNING] [11:27:48+0000] goroutine 14 [chan receive, 31 minutes]:
[WARNING] [11:27:48+0000] testing.(*testContext).waitParallel(0xc42000e870)
[WARNING] [11:27:48+0000] 	/usr/local/go/src/testing/testing.go:833 +0x9f
[WARNING] [11:27:48+0000] testing.(*T).Parallel(0xc4200ba780)
[WARNING] [11:27:48+0000] 	/usr/local/go/src/testing/testing.go:678 +0x13f
[WARNING] [11:27:48+0000] github.com/openshift/origin/test/integration/runner.executeTests.func1(0xc4200ba780)
[WARNING] [11:27:48+0000] 	/go/src/github.com/openshift/origin/_output/local/go/src/github.com/openshift/origin/test/integration/runner/runner_test.go:112 +0x9f
[WARNING] [11:27:48+0000] testing.tRunner(0xc4200ba780, 0xc4202d9fc0)
[WARNING] [11:27:48+0000] 	/usr/local/go/src/testing/testing.go:746 +0xd0
[WARNING] [11:27:48+0000] created by testing.(*T).Run
[WARNING] [11:27:48+0000] 	/usr/local/go/src/testing/testing.go:789 +0x2de
[WARNING] [11:27:48+0000] goroutine 15 [chan receive, 31 minutes]:
[WARNING] [11:27:48+0000] testing.(*testContext).waitParallel(0xc42000e870)
[WARNING] [11:27:48+0000] 	/usr/local/go/src/testing/testing.go:833 +0x9f
[WARNING] [11:27:48+0000] testing.(*T).Parallel(0xc4200ba870)
[WARNING] [11:27:48+0000] 	/usr/local/go/src/testing/testing.go:678 +0x13f
[WARNING] [11:27:48+0000] github.com/openshift/origin/test/integration/runner.executeTests.func1(0xc4200ba870)
[WARNING] [11:27:48+0000] 	/go/src/github.com/openshift/origin/_output/local/go/src/github.com/openshift/origin/test/integration/runner/runner_test.go:112 +0x9f
[WARNING] [11:27:48+0000] testing.tRunner(0xc4200ba870, 0xc4201e2040)
[WARNING] [11:27:48+0000] 	/usr/local/go/src/testing/testing.go:746 +0xd0
[WARNING] [11:27:48+0000] created by testing.(*T).Run
[WARNING] [11:27:48+0000] 	/usr/local/go/src/testing/testing.go:789 +0x2de
[WARNING] [11:27:48+0000] goroutine 16 [chan receive, 31 minutes]:
[WARNING] [11:27:48+0000] testing.(*testContext).waitParallel(0xc42000e870)
[WARNING] [11:27:48+0000] 	/usr/local/go/src/testing/testing.go:833 +0x9f
[WARNING] [11:27:48+0000] testing.(*T).Parallel(0xc4200ba960)
[WARNING] [11:27:48+0000] 	/usr/local/go/src/testing/testing.go:678 +0x13f
[WARNING] [11:27:48+0000] github.com/openshift/origin/test/integration/runner.executeTests.func1(0xc4200ba960)
[WARNING] [11:27:48+0000] 	/go/src/github.com/openshift/origin/_output/local/go/src/github.com/openshift/origin/test/integration/runner/runner_test.go:112 +0x9f
[WARNING] [11:27:48+0000] testing.tRunner(0xc4200ba960, 0xc4201e20c0)
[WARNING] [11:27:48+0000] 	/usr/local/go/src/testing/testing.go:746 +0xd0
[WARNING] [11:27:48+0000] created by testing.(*T).Run
[WARNING] [11:27:48+0000] 	/usr/local/go/src/testing/testing.go:789 +0x2de
[WARNING] [11:27:48+0000] goroutine 33 [chan receive, 31 minutes]:
[WARNING] [11:27:48+0000] testing.(*testContext).waitParallel(0xc42000e870)
[WARNING] [11:27:48+0000] 	/usr/local/go/src/testing/testing.go:833 +0x9f
[WARNING] [11:27:48+0000] testing.(*T).Parallel(0xc4200baa50)
[WARNING] [11:27:48+0000] 	/usr/local/go/src/testing/testing.go:678 +0x13f
[WARNING] [11:27:48+0000] github.com/openshift/origin/test/integration/runner.executeTests.func1(0xc4200baa50)
[WARNING] [11:27:48+0000] 	/go/src/github.com/openshift/origin/_output/local/go/src/github.com/openshift/origin/test/integration/runner/runner_test.go:112 +0x9f
[WARNING] [11:27:48+0000] testing.tRunner(0xc4200baa50, 0xc4201e2140)
[WARNING] [11:27:48+0000] 	/usr/local/go/src/testing/testing.go:746 +0xd0
[WARNING] [11:27:48+0000] created by testing.(*T).Run
[WARNING] [11:27:48+0000] 	/usr/local/go/src/testing/testing.go:789 +0x2de
[WARNING] [11:27:48+0000] goroutine 34 [chan receive, 31 minutes]:
[WARNING] [11:27:48+0000] testing.(*testContext).waitParallel(0xc42000e870)
[WARNING] [11:27:48+0000] 	/usr/local/go/src/testing/testing.go:833 +0x9f
[WARNING] [11:27:48+0000] testing.(*T).Parallel(0xc4200bab40)
[WARNING] [11:27:48+0000] 	/usr/local/go/src/testing/testing.go:678 +0x13f
[WARNING] [11:27:48+0000] github.com/openshift/origin/test/integration/runner.executeTests.func1(0xc4200bab40)
[WARNING] [11:27:48+0000] 	/go/src/github.com/openshift/origin/_output/local/go/src/github.com/openshift/origin/test/integration/runner/runner_test.go:112 +0x9f
[WARNING] [11:27:48+0000] testing.tRunner(0xc4200bab40, 0xc4201e21c0)
[WARNING] [11:27:48+0000] 	/usr/local/go/src/testing/testing.go:746 +0xd0
[WARNING] [11:27:48+0000] created by testing.(*T).Run
[WARNING] [11:27:48+0000] 	/usr/local/go/src/testing/testing.go:789 +0x2de
[WARNING] [11:27:48+0000] goroutine 35 [chan receive, 31 minutes]:
[WARNING] [11:27:48+0000] testing.(*testContext).waitParallel(0xc42000e870)
[WARNING] [11:27:48+0000] 	/usr/local/go/src/testing/testing.go:833 +0x9f
[WARNING] [11:27:48+0000] testing.(*T).Parallel(0xc4200bac30)
[WARNING] [11:27:48+0000] 	/usr/local/go/src/testing/testing.go:678 +0x13f
[WARNING] [11:27:48+0000] github.com/openshift/origin/test/integration/runner.executeTests.func1(0xc4200bac30)
[WARNING] [11:27:48+0000] 	/go/src/github.com/openshift/origin/_output/local/go/src/github.com/openshift/origin/test/integration/runner/runner_test.go:112 +0x9f
[WARNING] [11:27:48+0000] testing.tRunner(0xc4200bac30, 0xc4201e2240)
[WARNING] [11:27:48+0000] 	/usr/local/go/src/testing/testing.go:746 +0xd0
[WARNING] [11:27:48+0000] created by testing.(*T).Run
[WARNING] [11:27:48+0000] 	/usr/local/go/src/testing/testing.go:789 +0x2de
[WARNING] [11:27:48+0000] goroutine 36 [chan receive, 31 minutes]:
[WARNING] [11:27:48+0000] testing.(*testContext).waitParallel(0xc42000e870)
[WARNING] [11:27:48+0000] 	/usr/local/go/src/testing/testing.go:833 +0x9f
[WARNING] [11:27:48+0000] testing.(*T).Parallel(0xc4200bad20)
[WARNING] [11:27:48+0000] 	/usr/local/go/src/testing/testing.go:678 +0x13f
[WARNING] [11:27:48+0000] github.com/openshift/origin/test/integration/runner.executeTests.func1(0xc4200bad20)
[WARNING] [11:27:48+0000] 	/go/src/github.com/openshift/origin/_output/local/go/src/github.com/openshift/origin/test/integration/runner/runner_test.go:112 +0x9f
[WARNING] [11:27:48+0000] testing.tRunner(0xc4200bad20, 0xc4201e22c0)
[WARNING] [11:27:48+0000] 	/usr/local/go/src/testing/testing.go:746 +0xd0
[WARNING] [11:27:48+0000] created by testing.(*T).Run
[WARNING] [11:27:48+0000] 	/usr/local/go/src/testing/testing.go:789 +0x2de
[WARNING] [11:27:48+0000] goroutine 37 [chan send, 2 minutes]:
[WARNING] [11:27:48+0000] testing.tRunner.func1(0xc4200bae10)
[WARNING] [11:27:48+0000] 	/usr/local/go/src/testing/testing.go:741 +0x19b
[WARNING] [11:27:48+0000] testing.tRunner(0xc4200bae10, 0xc4201e2340)
[WARNING] [11:27:48+0000] 	/usr/local/go/src/testing/testing.go:748 +0xda
[WARNING] [11:27:48+0000] created by testing.(*T).Run
[WARNING] [11:27:48+0000] 	/usr/local/go/src/testing/testing.go:789 +0x2de
[WARNING] [11:27:48+0000] goroutine 38 [syscall]:
[WARNING] [11:27:48+0000] syscall.Syscall6(0xf7, 0x1, 0x485, 0xc420973a08, 0x1000004, 0x0, 0x0, 0x0, 0x0, 0x0)
[WARNING] [11:27:48+0000] 	/usr/local/go/src/syscall/asm_linux_amd64.s:44 +0x5
[WARNING] [11:27:48+0000] os.(*Process).blockUntilWaitable(0xc4201cc5a0, 0xc4201cc5a0, 0x0, 0x0)
[WARNING] [11:27:48+0000] 	/usr/local/go/src/os/wait_waitid.go:31 +0xa5
[WARNING] [11:27:48+0000] os.(*Process).wait(0xc4201cc5a0, 0xc420488100, 0xc42023e398, 0x68)
[WARNING] [11:27:48+0000] 	/usr/local/go/src/os/exec_unix.go:22 +0x42
[WARNING] [11:27:48+0000] os.(*Process).Wait(0xc4201cc5a0, 0x0, 0x0, 0x5d59a0)
[WARNING] [11:27:48+0000] 	/usr/local/go/src/os/exec.go:115 +0x2b
[WARNING] [11:27:48+0000] os/exec.(*Cmd).Wait(0xc42023e2c0, 0x0, 0x0)
[WARNING] [11:27:48+0000] 	/usr/local/go/src/os/exec/exec.go:446 +0x62
[WARNING] [11:27:48+0000] os/exec.(*Cmd).Run(0xc42023e2c0, 0xc4200b4150, 0x0)
[WARNING] [11:27:48+0000] 	/usr/local/go/src/os/exec/exec.go:289 +0x5c
[WARNING] [11:27:48+0000] os/exec.(*Cmd).CombinedOutput(0xc42023e2c0, 0xc4201b2080, 0x4, 0x4, 0x6, 0xc420488100)
[WARNING] [11:27:48+0000] 	/usr/local/go/src/os/exec/exec.go:506 +0x127
[WARNING] [11:27:48+0000] github.com/openshift/origin/test/integration/runner.runSingleTest(0xc4200baf00, 0x5ca51e, 0x2, 0xc42001ad20, 0x52, 0xc4201cdc80, 0x24, 0x0, 0x0)
[WARNING] [11:27:48+0000] 	/go/src/github.com/openshift/origin/_output/local/go/src/github.com/openshift/origin/test/integration/runner/runner_test.go:174 +0x721
[WARNING] [11:27:48+0000] github.com/openshift/origin/test/integration/runner.executeTests.func1(0xc4200baf00)
[WARNING] [11:27:48+0000] 	/go/src/github.com/openshift/origin/_output/local/go/src/github.com/openshift/origin/test/integration/runner/runner_test.go:116 +0x1dc
[WARNING] [11:27:48+0000] testing.tRunner(0xc4200baf00, 0xc4201e23c0)
[WARNING] [11:27:48+0000] 	/usr/local/go/src/testing/testing.go:746 +0xd0
[WARNING] [11:27:48+0000] created by testing.(*T).Run
[WARNING] [11:27:48+0000] 	/usr/local/go/src/testing/testing.go:789 +0x2de
[WARNING] [11:27:48+0000] goroutine 39 [syscall, 2 minutes]:
[WARNING] [11:27:48+0000] syscall.Syscall6(0xf7, 0x1, 0x477, 0xc4201f2a08, 0x1000004, 0x0, 0x0, 0x0, 0x0, 0x0)
[WARNING] [11:27:48+0000] 	/usr/local/go/src/syscall/asm_linux_amd64.s:44 +0x5
[WARNING] [11:27:48+0000] os.(*Process).blockUntilWaitable(0xc420486750, 0xc420486750, 0x0, 0x0)
[WARNING] [11:27:48+0000] 	/usr/local/go/src/os/wait_waitid.go:31 +0xa5
[WARNING] [11:27:48+0000] os.(*Process).wait(0xc420486750, 0xc420488580, 0xc4203344f8, 0x68)
[WARNING] [11:27:48+0000] 	/usr/local/go/src/os/exec_unix.go:22 +0x42
[WARNING] [11:27:48+0000] os.(*Process).Wait(0xc420486750, 0x0, 0x0, 0x5d59a0)
[WARNING] [11:27:48+0000] 	/usr/local/go/src/os/exec.go:115 +0x2b
[WARNING] [11:27:48+0000] os/exec.(*Cmd).Wait(0xc420334420, 0x0, 0x0)
[WARNING] [11:27:48+0000] 	/usr/local/go/src/os/exec/exec.go:446 +0x62
[WARNING] [11:27:48+0000] os/exec.(*Cmd).Run(0xc420334420, 0xc420a2e310, 0x0)
[WARNING] [11:27:48+0000] 	/usr/local/go/src/os/exec/exec.go:289 +0x5c
[WARNING] [11:27:48+0000] os/exec.(*Cmd).CombinedOutput(0xc420334420, 0xc420270380, 0x4, 0x4, 0x6, 0xc420488580)
[WARNING] [11:27:48+0000] 	/usr/local/go/src/os/exec/exec.go:506 +0x127
[WARNING] [11:27:48+0000] github.com/openshift/origin/test/integration/runner.runSingleTest(0xc4200baff0, 0x5ca51e, 0x2, 0xc42001ad20, 0x52, 0xc4201cdc20, 0x2c, 0x0, 0x0)
[WARNING] [11:27:48+0000] 	/go/src/github.com/openshift/origin/_output/local/go/src/github.com/openshift/origin/test/integration/runner/runner_test.go:174 +0x721
[WARNING] [11:27:48+0000] github.com/openshift/origin/test/integration/runner.executeTests.func1(0xc4200baff0)
[WARNING] [11:27:48+0000] 	/go/src/github.com/openshift/origin/_output/local/go/src/github.com/openshift/origin/test/integration/runner/runner_test.go:116 +0x1dc
[WARNING] [11:27:48+0000] testing.tRunner(0xc4200baff0, 0xc4201e2440)
[WARNING] [11:27:48+0000] 	/usr/local/go/src/testing/testing.go:746 +0xd0
[WARNING] [11:27:48+0000] created by testing.(*T).Run
[WARNING] [11:27:48+0000] 	/usr/local/go/src/testing/testing.go:789 +0x2de
[WARNING] [11:27:48+0000] goroutine 40 [syscall, 2 minutes]:
[WARNING] [11:27:48+0000] syscall.Syscall6(0xf7, 0x1, 0x46e, 0xc422916a08, 0x1000004, 0x0, 0x0, 0x0, 0x0, 0x0)
[WARNING] [11:27:48+0000] 	/usr/local/go/src/syscall/asm_linux_amd64.s:44 +0x5
[WARNING] [11:27:48+0000] os.(*Process).blockUntilWaitable(0xc420486570, 0xc420486570, 0x0, 0x0)
[WARNING] [11:27:48+0000] 	/usr/local/go/src/os/wait_waitid.go:31 +0xa5
[WARNING] [11:27:48+0000] os.(*Process).wait(0xc420486570, 0xc420488400, 0xc420334398, 0x68)
[WARNING] [11:27:48+0000] 	/usr/local/go/src/os/exec_unix.go:22 +0x42
[WARNING] [11:27:48+0000] os.(*Process).Wait(0xc420486570, 0x0, 0x0, 0x5d59a0)
[WARNING] [11:27:48+0000] 	/usr/local/go/src/os/exec.go:115 +0x2b
[WARNING] [11:27:48+0000] os/exec.(*Cmd).Wait(0xc4203342c0, 0x0, 0x0)
[WARNING] [11:27:48+0000] 	/usr/local/go/src/os/exec/exec.go:446 +0x62
[WARNING] [11:27:48+0000] os/exec.(*Cmd).Run(0xc4203342c0, 0xc420a2e230, 0x0)
[WARNING] [11:27:48+0000] 	/usr/local/go/src/os/exec/exec.go:289 +0x5c
[WARNING] [11:27:48+0000] os/exec.(*Cmd).CombinedOutput(0xc4203342c0, 0xc420270280, 0x4, 0x4, 0x6, 0xc420488400)
[WARNING] [11:27:48+0000] 	/usr/local/go/src/os/exec/exec.go:506 +0x127
[WARNING] [11:27:48+0000] github.com/openshift/origin/test/integration/runner.runSingleTest(0xc4200bb0e0, 0x5ca51e, 0x2, 0xc42001ad20, 0x52, 0xc4200131a0, 0x22, 0x0, 0x0)
[WARNING] [11:27:48+0000] 	/go/src/github.com/openshift/origin/_output/local/go/src/github.com/openshift/origin/test/integration/runner/runner_test.go:174 +0x721
[WARNING] [11:27:48+0000] github.com/openshift/origin/test/integration/runner.executeTests.func1(0xc4200bb0e0)
[WARNING] [11:27:48+0000] 	/go/src/github.com/openshift/origin/_output/local/go/src/github.com/openshift/origin/test/integration/runner/runner_test.go:116 +0x1dc
[WARNING] [11:27:48+0000] testing.tRunner(0xc4200bb0e0, 0xc4201e24c0)
[WARNING] [11:27:48+0000] 	/usr/local/go/src/testing/testing.go:746 +0xd0
[WARNING] [11:27:48+0000] created by testing.(*T).Run
[WARNING] [11:27:48+0000] 	/usr/local/go/src/testing/testing.go:789 +0x2de
[WARNING] [11:27:48+0000] goroutine 41 [chan send]:
[WARNING] [11:27:48+0000] testing.tRunner.func1(0xc4200bb1d0)
[WARNING] [11:27:48+0000] 	/usr/local/go/src/testing/testing.go:741 +0x19b
[WARNING] [11:27:48+0000] testing.tRunner(0xc4200bb1d0, 0xc4201e2540)
[WARNING] [11:27:48+0000] 	/usr/local/go/src/testing/testing.go:748 +0xda
[WARNING] [11:27:48+0000] created by testing.(*T).Run
[WARNING] [11:27:48+0000] 	/usr/local/go/src/testing/testing.go:789 +0x2de
[WARNING] [11:27:48+0000] goroutine 42 [chan send, 2 minutes]:
[WARNING] [11:27:48+0000] testing.tRunner.func1(0xc4200bb2c0)
[WARNING] [11:27:48+0000] 	/usr/local/go/src/testing/testing.go:741 +0x19b
[WARNING] [11:27:48+0000] testing.tRunner(0xc4200bb2c0, 0xc4201e25c0)
[WARNING] [11:27:48+0000] 	/usr/local/go/src/testing/testing.go:748 +0xda
[WARNING] [11:27:48+0000] created by testing.(*T).Run
[WARNING] [11:27:48+0000] 	/usr/local/go/src/testing/testing.go:789 +0x2de
[WARNING] [11:27:48+0000] goroutine 43 [chan send, 2 minutes]:
[WARNING] [11:27:48+0000] testing.tRunner.func1(0xc4200bb3b0)
[WARNING] [11:27:48+0000] 	/usr/local/go/src/testing/testing.go:741 +0x19b
[WARNING] [11:27:48+0000] testing.tRunner(0xc4200bb3b0, 0xc4201e2640)
[WARNING] [11:27:48+0000] 	/usr/local/go/src/testing/testing.go:748 +0xda
[WARNING] [11:27:48+0000] created by testing.(*T).Run
[WARNING] [11:27:48+0000] 	/usr/local/go/src/testing/testing.go:789 +0x2de
[WARNING] [11:27:48+0000] goroutine 44 [chan send, 2 minutes]:
[WARNING] [11:27:48+0000] testing.tRunner.func1(0xc4200bb4a0)
[WARNING] [11:27:48+0000] 	/usr/local/go/src/testing/testing.go:741 +0x19b
[WARNING] [11:27:48+0000] testing.tRunner(0xc4200bb4a0, 0xc4201e26c0)
[WARNING] [11:27:48+0000] 	/usr/local/go/src/testing/testing.go:748 +0xda
[WARNING] [11:27:48+0000] created by testing.(*T).Run
[WARNING] [11:27:48+0000] 	/usr/local/go/src/testing/testing.go:789 +0x2de
[WARNING] [11:27:48+0000] goroutine 45 [chan send, 2 minutes]:
[WARNING] [11:27:48+0000] testing.tRunner.func1(0xc4200bb590)
[WARNING] [11:27:48+0000] 	/usr/local/go/src/testing/testing.go:741 +0x19b
[WARNING] [11:27:48+0000] testing.tRunner(0xc4200bb590, 0xc4201e2740)
[WARNING] [11:27:48+0000] 	/usr/local/go/src/testing/testing.go:748 +0xda
[WARNING] [11:27:48+0000] created by testing.(*T).Run
[WARNING] [11:27:48+0000] 	/usr/local/go/src/testing/testing.go:789 +0x2de
[WARNING] [11:27:48+0000] goroutine 46 [chan send, 2 minutes]:
[WARNING] [11:27:48+0000] testing.tRunner.func1(0xc4200bb680)
[WARNING] [11:27:48+0000] 	/usr/local/go/src/testing/testing.go:741 +0x19b
[WARNING] [11:27:48+0000] testing.tRunner(0xc4200bb680, 0xc4201e27c0)
[WARNING] [11:27:48+0000] 	/usr/local/go/src/testing/testing.go:748 +0xda
[WARNING] [11:27:48+0000] created by testing.(*T).Run
[WARNING] [11:27:48+0000] 	/usr/local/go/src/testing/testing.go:789 +0x2de
[WARNING] [11:27:48+0000] goroutine 47 [chan send, 2 minutes]:
[WARNING] [11:27:48+0000] testing.tRunner.func1(0xc4200bb770)
[WARNING] [11:27:48+0000] 	/usr/local/go/src/testing/testing.go:741 +0x19b
[WARNING] [11:27:48+0000] testing.tRunner(0xc4200bb770, 0xc4201e2840)
[WARNING] [11:27:48+0000] 	/usr/local/go/src/testing/testing.go:748 +0xda
[WARNING] [11:27:48+0000] created by testing.(*T).Run
[WARNING] [11:27:48+0000] 	/usr/local/go/src/testing/testing.go:789 +0x2de
[WARNING] [11:27:48+0000] goroutine 48 [chan send, 2 minutes]:
[WARNING] [11:27:48+0000] testing.tRunner.func1(0xc4200bb860)
[WARNING] [11:27:48+0000] 	/usr/local/go/src/testing/testing.go:741 +0x19b
[WARNING] [11:27:48+0000] testing.tRunner(0xc4200bb860, 0xc4201e28c0)
[WARNING] [11:27:48+0000] 	/usr/local/go/src/testing/testing.go:748 +0xda
[WARNING] [11:27:48+0000] created by testing.(*T).Run
[WARNING] [11:27:48+0000] 	/usr/local/go/src/testing/testing.go:789 +0x2de
[WARNING] [11:27:48+0000] goroutine 49 [chan send, 2 minutes]:
[WARNING] [11:27:48+0000] testing.tRunner.func1(0xc4200bb950)
[WARNING] [11:27:48+0000] 	/usr/local/go/src/testing/testing.go:741 +0x19b
[WARNING] [11:27:48+0000] testing.tRunner(0xc4200bb950, 0xc4201e2940)
[WARNING] [11:27:48+0000] 	/usr/local/go/src/testing/testing.go:748 +0xda
[WARNING] [11:27:48+0000] created by testing.(*T).Run
[WARNING] [11:27:48+0000] 	/usr/local/go/src/testing/testing.go:789 +0x2de
[WARNING] [11:27:48+0000] goroutine 50 [chan send, 7 minutes]:
[WARNING] [11:27:48+0000] testing.tRunner.func1(0xc4200bba40)
[WARNING] [11:27:48+0000] 	/usr/local/go/src/testing/testing.go:741 +0x19b
[WARNING] [11:27:48+0000] testing.tRunner(0xc4200bba40, 0xc4201e29c0)
[WARNING] [11:27:48+0000] 	/usr/local/go/src/testing/testing.go:748 +0xda
[WARNING] [11:27:48+0000] created by testing.(*T).Run
[WARNING] [11:27:48+0000] 	/usr/local/go/src/testing/testing.go:789 +0x2de
[WARNING] [11:27:48+0000] goroutine 51 [chan send, 2 minutes]:
[WARNING] [11:27:48+0000] testing.tRunner.func1(0xc4200bbb30)
[WARNING] [11:27:48+0000] 	/usr/local/go/src/testing/testing.go:741 +0x19b
[WARNING] [11:27:48+0000] testing.tRunner(0xc4200bbb30, 0xc4201e2a40)
[WARNING] [11:27:48+0000] 	/usr/local/go/src/testing/testing.go:748 +0xda
[WARNING] [11:27:48+0000] created by testing.(*T).Run
[WARNING] [11:27:48+0000] 	/usr/local/go/src/testing/testing.go:789 +0x2de
[WARNING] [11:27:48+0000] goroutine 52 [chan send, 2 minutes]:
[WARNING] [11:27:48+0000] testing.tRunner.func1(0xc4200bbc20)
[WARNING] [11:27:48+0000] 	/usr/local/go/src/testing/testing.go:741 +0x19b
[WARNING] [11:27:48+0000] testing.tRunner(0xc4200bbc20, 0xc4201e2ac0)
[WARNING] [11:27:48+0000] 	/usr/local/go/src/testing/testing.go:748 +0xda
[WARNING] [11:27:48+0000] created by testing.(*T).Run
[WARNING] [11:27:48+0000] 	/usr/local/go/src/testing/testing.go:789 +0x2de
[WARNING] [11:27:48+0000] goroutine 53 [chan send, 3 minutes]:
[WARNING] [11:27:48+0000] testing.tRunner.func1(0xc4200bbd10)
[WARNING] [11:27:48+0000] 	/usr/local/go/src/testing/testing.go:741 +0x19b
[WARNING] [11:27:48+0000] testing.tRunner(0xc4200bbd10, 0xc4201e2b40)
[WARNING] [11:27:48+0000] 	/usr/local/go/src/testing/testing.go:748 +0xda
[WARNING] [11:27:48+0000] created by testing.(*T).Run
[WARNING] [11:27:48+0000] 	/usr/local/go/src/testing/testing.go:789 +0x2de
[WARNING] [11:27:48+0000] goroutine 54 [chan send, 3 minutes]:
[WARNING] [11:27:48+0000] testing.tRunner.func1(0xc4200bbe00)
[WARNING] [11:27:48+0000] 	/usr/local/go/src/testing/testing.go:741 +0x19b
[WARNING] [11:27:48+0000] testing.tRunner(0xc4200bbe00, 0xc4201e2bc0)
[WARNING] [11:27:48+0000] 	/usr/local/go/src/testing/testing.go:748 +0xda
[WARNING] [11:27:48+0000] created by testing.(*T).Run
[WARNING] [11:27:48+0000] 	/usr/local/go/src/testing/testing.go:789 +0x2de
[WARNING] [11:27:48+0000] goroutine 55 [chan send, 3 minutes]:
[WARNING] [11:27:48+0000] testing.tRunner.func1(0xc4200bbef0)
[WARNING] [11:27:48+0000] 	/usr/local/go/src/testing/testing.go:741 +0x19b
[WARNING] [11:27:48+0000] testing.tRunner(0xc4200bbef0, 0xc4201e2c40)
[WARNING] [11:27:48+0000] 	/usr/local/go/src/testing/testing.go:748 +0xda
[WARNING] [11:27:48+0000] created by testing.(*T).Run
[WARNING] [11:27:48+0000] 	/usr/local/go/src/testing/testing.go:789 +0x2de
[WARNING] [11:27:48+0000] goroutine 56 [chan send, 3 minutes]:
[WARNING] [11:27:48+0000] testing.tRunner.func1(0xc4203b8000)
[WARNING] [11:27:48+0000] 	/usr/local/go/src/testing/testing.go:741 +0x19b
[WARNING] [11:27:48+0000] testing.tRunner(0xc4203b8000, 0xc4201e2cc0)
[WARNING] [11:27:48+0000] 	/usr/local/go/src/testing/testing.go:748 +0xda
[WARNING] [11:27:48+0000] created by testing.(*T).Run
[WARNING] [11:27:48+0000] 	/usr/local/go/src/testing/testing.go:789 +0x2de
[WARNING] [11:27:48+0000] goroutine 57 [chan send, 3 minutes]:
[WARNING] [11:27:48+0000] testing.tRunner.func1(0xc4203b80f0)
[WARNING] [11:27:48+0000] 	/usr/local/go/src/testing/testing.go:741 +0x19b
[WARNING] [11:27:48+0000] testing.tRunner(0xc4203b80f0, 0xc4201e2d40)
[WARNING] [11:27:48+0000] 	/usr/local/go/src/testing/testing.go:748 +0xda
[WARNING] [11:27:48+0000] created by testing.(*T).Run
[WARNING] [11:27:48+0000] 	/usr/local/go/src/testing/testing.go:789 +0x2de
[WARNING] [11:27:48+0000] goroutine 58 [chan send, 3 minutes]:
[WARNING] [11:27:48+0000] testing.tRunner.func1(0xc4203b81e0)
[WARNING] [11:27:48+0000] 	/usr/local/go/src/testing/testing.go:741 +0x19b
[WARNING] [11:27:48+0000] testing.tRunner(0xc4203b81e0, 0xc4201e2dc0)
[WARNING] [11:27:48+0000] 	/usr/local/go/src/testing/testing.go:748 +0xda
[WARNING] [11:27:48+0000] created by testing.(*T).Run
[WARNING] [11:27:48+0000] 	/usr/local/go/src/testing/testing.go:789 +0x2de
[WARNING] [11:27:48+0000] goroutine 59 [chan send, 4 minutes]:
[WARNING] [11:27:48+0000] testing.tRunner.func1(0xc4203b82d0)
[WARNING] [11:27:48+0000] 	/usr/local/go/src/testing/testing.go:741 +0x19b
[WARNING] [11:27:48+0000] testing.tRunner(0xc4203b82d0, 0xc4201e2e40)
[WARNING] [11:27:48+0000] 	/usr/local/go/src/testing/testing.go:748 +0xda
[WARNING] [11:27:48+0000] created by testing.(*T).Run
[WARNING] [11:27:48+0000] 	/usr/local/go/src/testing/testing.go:789 +0x2de
[WARNING] [11:27:48+0000] goroutine 60 [chan send, 4 minutes]:
[WARNING] [11:27:48+0000] testing.tRunner.func1(0xc4203b83c0)
[WARNING] [11:27:48+0000] 	/usr/local/go/src/testing/testing.go:741 +0x19b
[WARNING] [11:27:48+0000] testing.tRunner(0xc4203b83c0, 0xc4201e2ec0)
[WARNING] [11:27:48+0000] 	/usr/local/go/src/testing/testing.go:748 +0xda
[WARNING] [11:27:48+0000] created by testing.(*T).Run
[WARNING] [11:27:48+0000] 	/usr/local/go/src/testing/testing.go:789 +0x2de
[WARNING] [11:27:48+0000] goroutine 61 [chan send, 4 minutes]:
[WARNING] [11:27:48+0000] testing.tRunner.func1(0xc4203b84b0)
[WARNING] [11:27:48+0000] 	/usr/local/go/src/testing/testing.go:741 +0x19b
[WARNING] [11:27:48+0000] testing.tRunner(0xc4203b84b0, 0xc4201e2f40)
[WARNING] [11:27:48+0000] 	/usr/local/go/src/testing/testing.go:748 +0xda
[WARNING] [11:27:48+0000] created by testing.(*T).Run
[WARNING] [11:27:48+0000] 	/usr/local/go/src/testing/testing.go:789 +0x2de
[WARNING] [11:27:48+0000] goroutine 62 [chan send, 5 minutes]:
[WARNING] [11:27:48+0000] testing.tRunner.func1(0xc4203b85a0)
[WARNING] [11:27:48+0000] 	/usr/local/go/src/testing/testing.go:741 +0x19b
[WARNING] [11:27:48+0000] testing.tRunner(0xc4203b85a0, 0xc4201e2fc0)
[WARNING] [11:27:48+0000] 	/usr/local/go/src/testing/testing.go:748 +0xda
[WARNING] [11:27:48+0000] created by testing.(*T).Run
[WARNING] [11:27:48+0000] 	/usr/local/go/src/testing/testing.go:789 +0x2de
[WARNING] [11:27:48+0000] goroutine 63 [chan send, 5 minutes]:
[WARNING] [11:27:48+0000] testing.tRunner.func1(0xc4203b8690)
[WARNING] [11:27:48+0000] 	/usr/local/go/src/testing/testing.go:741 +0x19b
[WARNING] [11:27:48+0000] testing.tRunner(0xc4203b8690, 0xc4201e3040)
[WARNING] [11:27:48+0000] 	/usr/local/go/src/testing/testing.go:748 +0xda
[WARNING] [11:27:48+0000] created by testing.(*T).Run
[WARNING] [11:27:48+0000] 	/usr/local/go/src/testing/testing.go:789 +0x2de
[WARNING] [11:27:48+0000] goroutine 64 [chan send, 5 minutes]:
[WARNING] [11:27:48+0000] testing.tRunner.func1(0xc4203b8780)
[WARNING] [11:27:48+0000] 	/usr/local/go/src/testing/testing.go:741 +0x19b
[WARNING] [11:27:48+0000] testing.tRunner(0xc4203b8780, 0xc4201e30c0)
[WARNING] [11:27:48+0000] 	/usr/local/go/src/testing/testing.go:748 +0xda
[WARNING] [11:27:48+0000] created by testing.(*T).Run
[WARNING] [11:27:48+0000] 	/usr/local/go/src/testing/testing.go:789 +0x2de
[WARNING] [11:27:48+0000] goroutine 65 [chan send, 5 minutes]:
[WARNING] [11:27:48+0000] testing.tRunner.func1(0xc4203b8870)
[WARNING] [11:27:48+0000] 	/usr/local/go/src/testing/testing.go:741 +0x19b
[WARNING] [11:27:48+0000] testing.tRunner(0xc4203b8870, 0xc4201e3140)
[WARNING] [11:27:48+0000] 	/usr/local/go/src/testing/testing.go:748 +0xda
[WARNING] [11:27:48+0000] created by testing.(*T).Run
[WARNING] [11:27:48+0000] 	/usr/local/go/src/testing/testing.go:789 +0x2de
[WARNING] [11:27:48+0000] goroutine 66 [chan send, 5 minutes]:
[WARNING] [11:27:48+0000] testing.tRunner.func1(0xc4203b8960)
[WARNING] [11:27:48+0000] 	/usr/local/go/src/testing/testing.go:741 +0x19b
[WARNING] [11:27:48+0000] testing.tRunner(0xc4203b8960, 0xc4201e31c0)
[WARNING] [11:27:48+0000] 	/usr/local/go/src/testing/testing.go:748 +0xda
[WARNING] [11:27:48+0000] created by testing.(*T).Run
[WARNING] [11:27:48+0000] 	/usr/local/go/src/testing/testing.go:789 +0x2de
[WARNING] [11:27:48+0000] goroutine 67 [chan send, 6 minutes]:
[WARNING] [11:27:48+0000] testing.tRunner.func1(0xc4203b8a50)
[WARNING] [11:27:48+0000] 	/usr/local/go/src/testing/testing.go:741 +0x19b
[WARNING] [11:27:48+0000] testing.tRunner(0xc4203b8a50, 0xc4201e3240)
[WARNING] [11:27:48+0000] 	/usr/local/go/src/testing/testing.go:748 +0xda
[WARNING] [11:27:48+0000] created by testing.(*T).Run
[WARNING] [11:27:48+0000] 	/usr/local/go/src/testing/testing.go:789 +0x2de
[WARNING] [11:27:48+0000] goroutine 68 [chan send, 6 minutes]:
[WARNING] [11:27:48+0000] testing.tRunner.func1(0xc4203b8b40)
[WARNING] [11:27:48+0000] 	/usr/local/go/src/testing/testing.go:741 +0x19b
[WARNING] [11:27:48+0000] testing.tRunner(0xc4203b8b40, 0xc4201e32c0)
[WARNING] [11:27:48+0000] 	/usr/local/go/src/testing/testing.go:748 +0xda
[WARNING] [11:27:48+0000] created by testing.(*T).Run
[WARNING] [11:27:48+0000] 	/usr/local/go/src/testing/testing.go:789 +0x2de
[WARNING] [11:27:48+0000] goroutine 69 [chan send, 5 minutes]:
[WARNING] [11:27:48+0000] testing.tRunner.func1(0xc4203b8c30)
[WARNING] [11:27:48+0000] 	/usr/local/go/src/testing/testing.go:741 +0x19b
[WARNING] [11:27:48+0000] testing.tRunner(0xc4203b8c30, 0xc4201e3340)
[WARNING] [11:27:48+0000] 	/usr/local/go/src/testing/testing.go:748 +0xda
[WARNING] [11:27:48+0000] created by testing.(*T).Run
[WARNING] [11:27:48+0000] 	/usr/local/go/src/testing/testing.go:789 +0x2de
[WARNING] [11:27:48+0000] goroutine 71 [chan send, 7 minutes]:
[WARNING] [11:27:48+0000] testing.tRunner.func1(0xc4203b8e10)
[WARNING] [11:27:48+0000] 	/usr/local/go/src/testing/testing.go:741 +0x19b
[WARNING] [11:27:48+0000] testing.tRunner(0xc4203b8e10, 0xc4201e3440)
[WARNING] [11:27:48+0000] 	/usr/local/go/src/testing/testing.go:748 +0xda
[WARNING] [11:27:48+0000] created by testing.(*T).Run
[WARNING] [11:27:48+0000] 	/usr/local/go/src/testing/testing.go:789 +0x2de
[WARNING] [11:27:48+0000] goroutine 72 [chan send, 7 minutes]:
[WARNING] [11:27:48+0000] testing.tRunner.func1(0xc4203b8f00)
[WARNING] [11:27:48+0000] 	/usr/local/go/src/testing/testing.go:741 +0x19b
[WARNING] [11:27:48+0000] testing.tRunner(0xc4203b8f00, 0xc4201e34c0)
[WARNING] [11:27:48+0000] 	/usr/local/go/src/testing/testing.go:748 +0xda
[WARNING] [11:27:48+0000] created by testing.(*T).Run
[WARNING] [11:27:48+0000] 	/usr/local/go/src/testing/testing.go:789 +0x2de
[WARNING] [11:27:48+0000] goroutine 73 [chan send, 7 minutes]:
[WARNING] [11:27:48+0000] testing.tRunner.func1(0xc4203b8ff0)
[WARNING] [11:27:48+0000] 	/usr/local/go/src/testing/testing.go:741 +0x19b
[WARNING] [11:27:48+0000] testing.tRunner(0xc4203b8ff0, 0xc4201e3540)
[WARNING] [11:27:48+0000] 	/usr/local/go/src/testing/testing.go:748 +0xda
[WARNING] [11:27:48+0000] created by testing.(*T).Run
[WARNING] [11:27:48+0000] 	/usr/local/go/src/testing/testing.go:789 +0x2de
[WARNING] [11:27:48+0000] goroutine 74 [chan send, 7 minutes]:
[WARNING] [11:27:48+0000] testing.tRunner.func1(0xc4203b90e0)
[WARNING] [11:27:48+0000] 	/usr/local/go/src/testing/testing.go:741 +0x19b
[WARNING] [11:27:48+0000] testing.tRunner(0xc4203b90e0, 0xc4201e35c0)
[WARNING] [11:27:48+0000] 	/usr/local/go/src/testing/testing.go:748 +0xda
[WARNING] [11:27:48+0000] created by testing.(*T).Run
[WARNING] [11:27:48+0000] 	/usr/local/go/src/testing/testing.go:789 +0x2de
[WARNING] [11:27:48+0000] goroutine 75 [chan send, 16 minutes]:
[WARNING] [11:27:48+0000] testing.tRunner.func1(0xc4203b91d0)
[WARNING] [11:27:48+0000] 	/usr/local/go/src/testing/testing.go:741 +0x19b
[WARNING] [11:27:48+0000] testing.tRunner(0xc4203b91d0, 0xc4201e3640)
[WARNING] [11:27:48+0000] 	/usr/local/go/src/testing/testing.go:748 +0xda
[WARNING] [11:27:48+0000] created by testing.(*T).Run
[WARNING] [11:27:48+0000] 	/usr/local/go/src/testing/testing.go:789 +0x2de
[WARNING] [11:27:48+0000] goroutine 76 [chan send, 7 minutes]:
[WARNING] [11:27:48+0000] testing.tRunner.func1(0xc4203b92c0)
[WARNING] [11:27:48+0000] 	/usr/local/go/src/testing/testing.go:741 +0x19b
[WARNING] [11:27:48+0000] testing.tRunner(0xc4203b92c0, 0xc4201e36c0)
[WARNING] [11:27:48+0000] 	/usr/local/go/src/testing/testing.go:748 +0xda
[WARNING] [11:27:48+0000] created by testing.(*T).Run
[WARNING] [11:27:48+0000] 	/usr/local/go/src/testing/testing.go:789 +0x2de
[WARNING] [11:27:48+0000] goroutine 77 [chan send, 8 minutes]:
[WARNING] [11:27:48+0000] testing.tRunner.func1(0xc4203b93b0)
[WARNING] [11:27:48+0000] 	/usr/local/go/src/testing/testing.go:741 +0x19b
[WARNING] [11:27:48+0000] testing.tRunner(0xc4203b93b0, 0xc4201e3740)
[WARNING] [11:27:48+0000] 	/usr/local/go/src/testing/testing.go:748 +0xda
[WARNING] [11:27:48+0000] created by testing.(*T).Run
[WARNING] [11:27:48+0000] 	/usr/local/go/src/testing/testing.go:789 +0x2de
[WARNING] [11:27:48+0000] goroutine 78 [chan send, 8 minutes]:
[WARNING] [11:27:48+0000] testing.tRunner.func1(0xc4203b94a0)
[WARNING] [11:27:48+0000] 	/usr/local/go/src/testing/testing.go:741 +0x19b
[WARNING] [11:27:48+0000] testing.tRunner(0xc4203b94a0, 0xc4201e37c0)
[WARNING] [11:27:48+0000] 	/usr/local/go/src/testing/testing.go:748 +0xda
[WARNING] [11:27:48+0000] created by testing.(*T).Run
[WARNING] [11:27:48+0000] 	/usr/local/go/src/testing/testing.go:789 +0x2de
[WARNING] [11:27:48+0000] goroutine 79 [chan send, 8 minutes]:
[WARNING] [11:27:48+0000] testing.tRunner.func1(0xc4203b9590)
[WARNING] [11:27:48+0000] 	/usr/local/go/src/testing/testing.go:741 +0x19b
[WARNING] [11:27:48+0000] testing.tRunner(0xc4203b9590, 0xc4201e3840)
[WARNING] [11:27:48+0000] 	/usr/local/go/src/testing/testing.go:748 +0xda
[WARNING] [11:27:48+0000] created by testing.(*T).Run
[WARNING] [11:27:48+0000] 	/usr/local/go/src/testing/testing.go:789 +0x2de
[WARNING] [11:27:48+0000] goroutine 80 [chan send, 7 minutes]:
[WARNING] [11:27:48+0000] testing.tRunner.func1(0xc4203b9680)
[WARNING] [11:27:48+0000] 	/usr/local/go/src/testing/testing.go:741 +0x19b
[WARNING] [11:27:48+0000] testing.tRunner(0xc4203b9680, 0xc4201e38c0)
[WARNING] [11:27:48+0000] 	/usr/local/go/src/testing/testing.go:748 +0xda
[WARNING] [11:27:48+0000] created by testing.(*T).Run
[WARNING] [11:27:48+0000] 	/usr/local/go/src/testing/testing.go:789 +0x2de
[WARNING] [11:27:48+0000] goroutine 81 [chan send, 8 minutes]:
[WARNING] [11:27:48+0000] testing.tRunner.func1(0xc4203b9770)
[WARNING] [11:27:48+0000] 	/usr/local/go/src/testing/testing.go:741 +0x19b
[WARNING] [11:27:48+0000] testing.tRunner(0xc4203b9770, 0xc4201e3940)
[WARNING] [11:27:48+0000] 	/usr/local/go/src/testing/testing.go:748 +0xda
[WARNING] [11:27:48+0000] created by testing.(*T).Run
[WARNING] [11:27:48+0000] 	/usr/local/go/src/testing/testing.go:789 +0x2de
[WARNING] [11:27:48+0000] goroutine 82 [chan send, 8 minutes]:
[WARNING] [11:27:48+0000] testing.tRunner.func1(0xc4203b9860)
[WARNING] [11:27:48+0000] 	/usr/local/go/src/testing/testing.go:741 +0x19b
[WARNING] [11:27:48+0000] testing.tRunner(0xc4203b9860, 0xc4201e39c0)
[WARNING] [11:27:48+0000] 	/usr/local/go/src/testing/testing.go:748 +0xda
[WARNING] [11:27:48+0000] created by testing.(*T).Run
[WARNING] [11:27:48+0000] 	/usr/local/go/src/testing/testing.go:789 +0x2de
[WARNING] [11:27:48+0000] goroutine 83 [chan send, 9 minutes]:
[WARNING] [11:27:48+0000] testing.tRunner.func1(0xc4203b9950)
[WARNING] [11:27:48+0000] 	/usr/local/go/src/testing/testing.go:741 +0x19b
[WARNING] [11:27:48+0000] testing.tRunner(0xc4203b9950, 0xc4201e3a40)
[WARNING] [11:27:48+0000] 	/usr/local/go/src/testing/testing.go:748 +0xda
[WARNING] [11:27:48+0000] created by testing.(*T).Run
[WARNING] [11:27:48+0000] 	/usr/local/go/src/testing/testing.go:789 +0x2de
[WARNING] [11:27:48+0000] goroutine 84 [chan send, 9 minutes]:
[WARNING] [11:27:48+0000] testing.tRunner.func1(0xc4203b9a40)
[WARNING] [11:27:48+0000] 	/usr/local/go/src/testing/testing.go:741 +0x19b
[WARNING] [11:27:48+0000] testing.tRunner(0xc4203b9a40, 0xc4201e3ac0)
[WARNING] [11:27:48+0000] 	/usr/local/go/src/testing/testing.go:748 +0xda
[WARNING] [11:27:48+0000] created by testing.(*T).Run
[WARNING] [11:27:48+0000] 	/usr/local/go/src/testing/testing.go:789 +0x2de
[WARNING] [11:27:48+0000] goroutine 85 [chan send, 9 minutes]:
[WARNING] [11:27:48+0000] testing.tRunner.func1(0xc4203b9b30)
[WARNING] [11:27:48+0000] 	/usr/local/go/src/testing/testing.go:741 +0x19b
[WARNING] [11:27:48+0000] testing.tRunner(0xc4203b9b30, 0xc4201e3b40)
[WARNING] [11:27:48+0000] 	/usr/local/go/src/testing/testing.go:748 +0xda
[WARNING] [11:27:48+0000] created by testing.(*T).Run
[WARNING] [11:27:48+0000] 	/usr/local/go/src/testing/testing.go:789 +0x2de
[WARNING] [11:27:48+0000] goroutine 86 [chan send, 9 minutes]:
[WARNING] [11:27:48+0000] testing.tRunner.func1(0xc4203b9c20)
[WARNING] [11:27:48+0000] 	/usr/local/go/src/testing/testing.go:741 +0x19b
[WARNING] [11:27:48+0000] testing.tRunner(0xc4203b9c20, 0xc4201e3bc0)
[WARNING] [11:27:48+0000] 	/usr/local/go/src/testing/testing.go:748 +0xda
[WARNING] [11:27:48+0000] created by testing.(*T).Run
[WARNING] [11:27:48+0000] 	/usr/local/go/src/testing/testing.go:789 +0x2de
[WARNING] [11:27:48+0000] goroutine 87 [chan send, 9 minutes]:
[WARNING] [11:27:48+0000] testing.tRunner.func1(0xc4203b9d10)
[WARNING] [11:27:48+0000] 	/usr/local/go/src/testing/testing.go:741 +0x19b
[WARNING] [11:27:48+0000] testing.tRunner(0xc4203b9d10, 0xc4201e3c40)
[WARNING] [11:27:48+0000] 	/usr/local/go/src/testing/testing.go:748 +0xda
[WARNING] [11:27:48+0000] created by testing.(*T).Run
[WARNING] [11:27:48+0000] 	/usr/local/go/src/testing/testing.go:789 +0x2de
[WARNING] [11:27:48+0000] goroutine 88 [chan send, 10 minutes]:
[WARNING] [11:27:48+0000] testing.tRunner.func1(0xc4203b9e00)
[WARNING] [11:27:48+0000] 	/usr/local/go/src/testing/testing.go:741 +0x19b
[WARNING] [11:27:48+0000] testing.tRunner(0xc4203b9e00, 0xc4201e3cc0)
[WARNING] [11:27:48+0000] 	/usr/local/go/src/testing/testing.go:748 +0xda
[WARNING] [11:27:48+0000] created by testing.(*T).Run
[WARNING] [11:27:48+0000] 	/usr/local/go/src/testing/testing.go:789 +0x2de
[WARNING] [11:27:48+0000] goroutine 89 [chan send, 10 minutes]:
[WARNING] [11:27:48+0000] testing.tRunner.func1(0xc4203b9ef0)
[WARNING] [11:27:48+0000] 	/usr/local/go/src/testing/testing.go:741 +0x19b
[WARNING] [11:27:48+0000] testing.tRunner(0xc4203b9ef0, 0xc4201e3d40)
[WARNING] [11:27:48+0000] 	/usr/local/go/src/testing/testing.go:748 +0xda
[WARNING] [11:27:48+0000] created by testing.(*T).Run
[WARNING] [11:27:48+0000] 	/usr/local/go/src/testing/testing.go:789 +0x2de
[WARNING] [11:27:48+0000] goroutine 90 [chan send, 10 minutes]:
[WARNING] [11:27:48+0000] testing.tRunner.func1(0xc420362000)
[WARNING] [11:27:48+0000] 	/usr/local/go/src/testing/testing.go:741 +0x19b
[WARNING] [11:27:48+0000] testing.tRunner(0xc420362000, 0xc4201e3dc0)
[WARNING] [11:27:48+0000] 	/usr/local/go/src/testing/testing.go:748 +0xda
[WARNING] [11:27:48+0000] created by testing.(*T).Run
[WARNING] [11:27:48+0000] 	/usr/local/go/src/testing/testing.go:789 +0x2de
[WARNING] [11:27:48+0000] goroutine 91 [chan send, 10 minutes]:
[WARNING] [11:27:48+0000] testing.tRunner.func1(0xc4203620f0)
[WARNING] [11:27:48+0000] 	/usr/local/go/src/testing/testing.go:741 +0x19b
[WARNING] [11:27:48+0000] testing.tRunner(0xc4203620f0, 0xc4201e3e40)
[WARNING] [11:27:48+0000] 	/usr/local/go/src/testing/testing.go:748 +0xda
[WARNING] [11:27:48+0000] created by testing.(*T).Run
[WARNING] [11:27:48+0000] 	/usr/local/go/src/testing/testing.go:789 +0x2de
[WARNING] [11:27:48+0000] goroutine 92 [chan send, 10 minutes]:
[WARNING] [11:27:48+0000] testing.tRunner.func1(0xc4203621e0)
[WARNING] [11:27:48+0000] 	/usr/local/go/src/testing/testing.go:741 +0x19b
[WARNING] [11:27:48+0000] testing.tRunner(0xc4203621e0, 0xc4201e3ec0)
[WARNING] [11:27:48+0000] 	/usr/local/go/src/testing/testing.go:748 +0xda
[WARNING] [11:27:48+0000] created by testing.(*T).Run
[WARNING] [11:27:48+0000] 	/usr/local/go/src/testing/testing.go:789 +0x2de
[WARNING] [11:27:48+0000] goroutine 93 [chan send, 10 minutes]:
[WARNING] [11:27:48+0000] testing.tRunner.func1(0xc4203622d0)
[WARNING] [11:27:48+0000] 	/usr/local/go/src/testing/testing.go:741 +0x19b
[WARNING] [11:27:48+0000] testing.tRunner(0xc4203622d0, 0xc4201e3f40)
[WARNING] [11:27:48+0000] 	/usr/local/go/src/testing/testing.go:748 +0xda
[WARNING] [11:27:48+0000] created by testing.(*T).Run
[WARNING] [11:27:48+0000] 	/usr/local/go/src/testing/testing.go:789 +0x2de
[WARNING] [11:27:48+0000] goroutine 94 [chan send, 11 minutes]:
[WARNING] [11:27:48+0000] testing.tRunner.func1(0xc4203623c0)
[WARNING] [11:27:48+0000] 	/usr/local/go/src/testing/testing.go:741 +0x19b
[WARNING] [11:27:48+0000] testing.tRunner(0xc4203623c0, 0xc4201e3fc0)
[WARNING] [11:27:48+0000] 	/usr/local/go/src/testing/testing.go:748 +0xda
[WARNING] [11:27:48+0000] created by testing.(*T).Run
[WARNING] [11:27:48+0000] 	/usr/local/go/src/testing/testing.go:789 +0x2de
[WARNING] [11:27:48+0000] goroutine 95 [chan send, 11 minutes]:
[WARNING] [11:27:48+0000] testing.tRunner.func1(0xc4203624b0)
[WARNING] [11:27:48+0000] 	/usr/local/go/src/testing/testing.go:741 +0x19b
[WARNING] [11:27:48+0000] testing.tRunner(0xc4203624b0, 0xc42032e040)
[WARNING] [11:27:48+0000] 	/usr/local/go/src/testing/testing.go:748 +0xda
[WARNING] [11:27:48+0000] created by testing.(*T).Run
[WARNING] [11:27:48+0000] 	/usr/local/go/src/testing/testing.go:789 +0x2de
[WARNING] [11:27:48+0000] goroutine 96 [chan send, 11 minutes]:
[WARNING] [11:27:48+0000] testing.tRunner.func1(0xc4203625a0)
[WARNING] [11:27:48+0000] 	/usr/local/go/src/testing/testing.go:741 +0x19b
[WARNING] [11:27:48+0000] testing.tRunner(0xc4203625a0, 0xc42032e0c0)
[WARNING] [11:27:48+0000] 	/usr/local/go/src/testing/testing.go:748 +0xda
[WARNING] [11:27:48+0000] created by testing.(*T).Run
[WARNING] [11:27:48+0000] 	/usr/local/go/src/testing/testing.go:789 +0x2de
[WARNING] [11:27:48+0000] goroutine 97 [chan send, 12 minutes]:
[WARNING] [11:27:48+0000] testing.tRunner.func1(0xc420362690)
[WARNING] [11:27:48+0000] 	/usr/local/go/src/testing/testing.go:741 +0x19b
[WARNING] [11:27:48+0000] testing.tRunner(0xc420362690, 0xc42032e140)
[WARNING] [11:27:48+0000] 	/usr/local/go/src/testing/testing.go:748 +0xda
[WARNING] [11:27:48+0000] created by testing.(*T).Run
[WARNING] [11:27:48+0000] 	/usr/local/go/src/testing/testing.go:789 +0x2de
[WARNING] [11:27:48+0000] goroutine 98 [chan send, 12 minutes]:
[WARNING] [11:27:48+0000] testing.tRunner.func1(0xc420362780)
[WARNING] [11:27:48+0000] 	/usr/local/go/src/testing/testing.go:741 +0x19b
[WARNING] [11:27:48+0000] testing.tRunner(0xc420362780, 0xc42032e1c0)
[WARNING] [11:27:48+0000] 	/usr/local/go/src/testing/testing.go:748 +0xda
[WARNING] [11:27:48+0000] created by testing.(*T).Run
[WARNING] [11:27:48+0000] 	/usr/local/go/src/testing/testing.go:789 +0x2de
[WARNING] [11:27:48+0000] goroutine 99 [chan send, 8 minutes]:
[WARNING] [11:27:48+0000] testing.tRunner.func1(0xc420362870)
[WARNING] [11:27:48+0000] 	/usr/local/go/src/testing/testing.go:741 +0x19b
[WARNING] [11:27:48+0000] testing.tRunner(0xc420362870, 0xc42032e240)
[WARNING] [11:27:48+0000] 	/usr/local/go/src/testing/testing.go:748 +0xda
[WARNING] [11:27:48+0000] created by testing.(*T).Run
[WARNING] [11:27:48+0000] 	/usr/local/go/src/testing/testing.go:789 +0x2de
[WARNING] [11:27:48+0000] goroutine 100 [chan send, 11 minutes]:
[WARNING] [11:27:48+0000] testing.tRunner.func1(0xc420362960)
[WARNING] [11:27:48+0000] 	/usr/local/go/src/testing/testing.go:741 +0x19b
[WARNING] [11:27:48+0000] testing.tRunner(0xc420362960, 0xc42032e2c0)
[WARNING] [11:27:48+0000] 	/usr/local/go/src/testing/testing.go:748 +0xda
[WARNING] [11:27:48+0000] created by testing.(*T).Run
[WARNING] [11:27:48+0000] 	/usr/local/go/src/testing/testing.go:789 +0x2de
[WARNING] [11:27:48+0000] goroutine 101 [chan send, 12 minutes]:
[WARNING] [11:27:48+0000] testing.tRunner.func1(0xc420362a50)
[WARNING] [11:27:48+0000] 	/usr/local/go/src/testing/testing.go:741 +0x19b
[WARNING] [11:27:48+0000] testing.tRunner(0xc420362a50, 0xc42032e340)
[WARNING] [11:27:48+0000] 	/usr/local/go/src/testing/testing.go:748 +0xda
[WARNING] [11:27:48+0000] created by testing.(*T).Run
[WARNING] [11:27:48+0000] 	/usr/local/go/src/testing/testing.go:789 +0x2de
[WARNING] [11:27:48+0000] goroutine 102 [chan send, 12 minutes]:
[WARNING] [11:27:48+0000] testing.tRunner.func1(0xc420362b40)
[WARNING] [11:27:48+0000] 	/usr/local/go/src/testing/testing.go:741 +0x19b
[WARNING] [11:27:48+0000] testing.tRunner(0xc420362b40, 0xc42032e3c0)
[WARNING] [11:27:48+0000] 	/usr/local/go/src/testing/testing.go:748 +0xda
[WARNING] [11:27:48+0000] created by testing.(*T).Run
[WARNING] [11:27:48+0000] 	/usr/local/go/src/testing/testing.go:789 +0x2de
[WARNING] [11:27:48+0000] goroutine 103 [chan send, 12 minutes]:
[WARNING] [11:27:48+0000] testing.tRunner.func1(0xc420362c30)
[WARNING] [11:27:48+0000] 	/usr/local/go/src/testing/testing.go:741 +0x19b
[WARNING] [11:27:48+0000] testing.tRunner(0xc420362c30, 0xc42032e440)
[WARNING] [11:27:48+0000] 	/usr/local/go/src/testing/testing.go:748 +0xda
[WARNING] [11:27:48+0000] created by testing.(*T).Run
[WARNING] [11:27:48+0000] 	/usr/local/go/src/testing/testing.go:789 +0x2de
[WARNING] [11:27:48+0000] goroutine 104 [chan send, 12 minutes]:
[WARNING] [11:27:48+0000] testing.tRunner.func1(0xc420362d20)
[WARNING] [11:27:48+0000] 	/usr/local/go/src/testing/testing.go:741 +0x19b
[WARNING] [11:27:48+0000] testing.tRunner(0xc420362d20, 0xc42032e4c0)
[WARNING] [11:27:48+0000] 	/usr/local/go/src/testing/testing.go:748 +0xda
[WARNING] [11:27:48+0000] created by testing.(*T).Run
[WARNING] [11:27:48+0000] 	/usr/local/go/src/testing/testing.go:789 +0x2de
[WARNING] [11:27:48+0000] goroutine 105 [chan send, 12 minutes]:
[WARNING] [11:27:48+0000] testing.tRunner.func1(0xc420362e10)
[WARNING] [11:27:48+0000] 	/usr/local/go/src/testing/testing.go:741 +0x19b
[WARNING] [11:27:48+0000] testing.tRunner(0xc420362e10, 0xc42032e540)
[WARNING] [11:27:48+0000] 	/usr/local/go/src/testing/testing.go:748 +0xda
[WARNING] [11:27:48+0000] created by testing.(*T).Run
[WARNING] [11:27:48+0000] 	/usr/local/go/src/testing/testing.go:789 +0x2de
[WARNING] [11:27:48+0000] goroutine 106 [chan send, 12 minutes]:
[WARNING] [11:27:48+0000] testing.tRunner.func1(0xc420362f00)
[WARNING] [11:27:48+0000] 	/usr/local/go/src/testing/testing.go:741 +0x19b
[WARNING] [11:27:48+0000] testing.tRunner(0xc420362f00, 0xc42032e5c0)
[WARNING] [11:27:48+0000] 	/usr/local/go/src/testing/testing.go:748 +0xda
[WARNING] [11:27:48+0000] created by testing.(*T).Run
[WARNING] [11:27:48+0000] 	/usr/local/go/src/testing/testing.go:789 +0x2de
[WARNING] [11:27:48+0000] goroutine 107 [chan send, 13 minutes]:
[WARNING] [11:27:48+0000] testing.tRunner.func1(0xc420362ff0)
[WARNING] [11:27:48+0000] 	/usr/local/go/src/testing/testing.go:741 +0x19b
[WARNING] [11:27:48+0000] testing.tRunner(0xc420362ff0, 0xc42032e640)
[WARNING] [11:27:48+0000] 	/usr/local/go/src/testing/testing.go:748 +0xda
[WARNING] [11:27:48+0000] created by testing.(*T).Run
[WARNING] [11:27:48+0000] 	/usr/local/go/src/testing/testing.go:789 +0x2de
[WARNING] [11:27:48+0000] goroutine 108 [chan send, 13 minutes]:
[WARNING] [11:27:48+0000] testing.tRunner.func1(0xc4203630e0)
[WARNING] [11:27:48+0000] 	/usr/local/go/src/testing/testing.go:741 +0x19b
[WARNING] [11:27:48+0000] testing.tRunner(0xc4203630e0, 0xc42032e6c0)
[WARNING] [11:27:48+0000] 	/usr/local/go/src/testing/testing.go:748 +0xda
[WARNING] [11:27:48+0000] created by testing.(*T).Run
[WARNING] [11:27:48+0000] 	/usr/local/go/src/testing/testing.go:789 +0x2de
[WARNING] [11:27:48+0000] goroutine 109 [chan send, 13 minutes]:
[WARNING] [11:27:48+0000] testing.tRunner.func1(0xc4203631d0)
[WARNING] [11:27:48+0000] 	/usr/local/go/src/testing/testing.go:741 +0x19b
[WARNING] [11:27:48+0000] testing.tRunner(0xc4203631d0, 0xc42032e740)
[WARNING] [11:27:48+0000] 	/usr/local/go/src/testing/testing.go:748 +0xda
[WARNING] [11:27:48+0000] created by testing.(*T).Run
[WARNING] [11:27:48+0000] 	/usr/local/go/src/testing/testing.go:789 +0x2de
[WARNING] [11:27:48+0000] goroutine 110 [chan send, 14 minutes]:
[WARNING] [11:27:48+0000] testing.tRunner.func1(0xc4203632c0)
[WARNING] [11:27:48+0000] 	/usr/local/go/src/testing/testing.go:741 +0x19b
[WARNING] [11:27:48+0000] testing.tRunner(0xc4203632c0, 0xc42032e7c0)
[WARNING] [11:27:48+0000] 	/usr/local/go/src/testing/testing.go:748 +0xda
[WARNING] [11:27:48+0000] created by testing.(*T).Run
[WARNING] [11:27:48+0000] 	/usr/local/go/src/testing/testing.go:789 +0x2de
[WARNING] [11:27:48+0000] goroutine 111 [chan send, 14 minutes]:
[WARNING] [11:27:48+0000] testing.tRunner.func1(0xc4203633b0)
[WARNING] [11:27:48+0000] 	/usr/local/go/src/testing/testing.go:741 +0x19b
[WARNING] [11:27:48+0000] testing.tRunner(0xc4203633b0, 0xc42032e840)
[WARNING] [11:27:48+0000] 	/usr/local/go/src/testing/testing.go:748 +0xda
[WARNING] [11:27:48+0000] created by testing.(*T).Run
[WARNING] [11:27:48+0000] 	/usr/local/go/src/testing/testing.go:789 +0x2de
[WARNING] [11:27:48+0000] goroutine 112 [chan send, 14 minutes]:
[WARNING] [11:27:48+0000] testing.tRunner.func1(0xc4203634a0)
[WARNING] [11:27:48+0000] 	/usr/local/go/src/testing/testing.go:741 +0x19b
[WARNING] [11:27:48+0000] testing.tRunner(0xc4203634a0, 0xc42032e8c0)
[WARNING] [11:27:48+0000] 	/usr/local/go/src/testing/testing.go:748 +0xda
[WARNING] [11:27:48+0000] created by testing.(*T).Run
[WARNING] [11:27:48+0000] 	/usr/local/go/src/testing/testing.go:789 +0x2de
[WARNING] [11:27:48+0000] goroutine 113 [chan send, 14 minutes]:
[WARNING] [11:27:48+0000] testing.tRunner.func1(0xc420363590)
[WARNING] [11:27:48+0000] 	/usr/local/go/src/testing/testing.go:741 +0x19b
[WARNING] [11:27:48+0000] testing.tRunner(0xc420363590, 0xc42032e940)
[WARNING] [11:27:48+0000] 	/usr/local/go/src/testing/testing.go:748 +0xda
[WARNING] [11:27:48+0000] created by testing.(*T).Run
[WARNING] [11:27:48+0000] 	/usr/local/go/src/testing/testing.go:789 +0x2de
[WARNING] [11:27:48+0000] goroutine 114 [chan send, 14 minutes]:
[WARNING] [11:27:48+0000] testing.tRunner.func1(0xc420363680)
[WARNING] [11:27:48+0000] 	/usr/local/go/src/testing/testing.go:741 +0x19b
[WARNING] [11:27:48+0000] testing.tRunner(0xc420363680, 0xc42032e9c0)
[WARNING] [11:27:48+0000] 	/usr/local/go/src/testing/testing.go:748 +0xda
[WARNING] [11:27:48+0000] created by testing.(*T).Run
[WARNING] [11:27:48+0000] 	/usr/local/go/src/testing/testing.go:789 +0x2de
[WARNING] [11:27:48+0000] goroutine 115 [chan send, 15 minutes]:
[WARNING] [11:27:48+0000] testing.tRunner.func1(0xc420363770)
[WARNING] [11:27:48+0000] 	/usr/local/go/src/testing/testing.go:741 +0x19b
[WARNING] [11:27:48+0000] testing.tRunner(0xc420363770, 0xc42032ea40)
[WARNING] [11:27:48+0000] 	/usr/local/go/src/testing/testing.go:748 +0xda
[WARNING] [11:27:48+0000] created by testing.(*T).Run
[WARNING] [11:27:48+0000] 	/usr/local/go/src/testing/testing.go:789 +0x2de
[WARNING] [11:27:48+0000] goroutine 116 [chan send, 15 minutes]:
[WARNING] [11:27:48+0000] testing.tRunner.func1(0xc420363860)
[WARNING] [11:27:48+0000] 	/usr/local/go/src/testing/testing.go:741 +0x19b
[WARNING] [11:27:48+0000] testing.tRunner(0xc420363860, 0xc42032eac0)
[WARNING] [11:27:48+0000] 	/usr/local/go/src/testing/testing.go:748 +0xda
[WARNING] [11:27:48+0000] created by testing.(*T).Run
[WARNING] [11:27:48+0000] 	/usr/local/go/src/testing/testing.go:789 +0x2de
[WARNING] [11:27:48+0000] goroutine 117 [chan send, 15 minutes]:
[WARNING] [11:27:48+0000] testing.tRunner.func1(0xc420363950)
[WARNING] [11:27:48+0000] 	/usr/local/go/src/testing/testing.go:741 +0x19b
[WARNING] [11:27:48+0000] testing.tRunner(0xc420363950, 0xc42032eb40)
[WARNING] [11:27:48+0000] 	/usr/local/go/src/testing/testing.go:748 +0xda
[WARNING] [11:27:48+0000] created by testing.(*T).Run
[WARNING] [11:27:48+0000] 	/usr/local/go/src/testing/testing.go:789 +0x2de
[WARNING] [11:27:48+0000] goroutine 118 [chan send, 15 minutes]:
[WARNING] [11:27:48+0000] testing.tRunner.func1(0xc420363a40)
[WARNING] [11:27:48+0000] 	/usr/local/go/src/testing/testing.go:741 +0x19b
[WARNING] [11:27:48+0000] testing.tRunner(0xc420363a40, 0xc42032ebc0)
[WARNING] [11:27:48+0000] 	/usr/local/go/src/testing/testing.go:748 +0xda
[WARNING] [11:27:48+0000] created by testing.(*T).Run
[WARNING] [11:27:48+0000] 	/usr/local/go/src/testing/testing.go:789 +0x2de
[WARNING] [11:27:48+0000] goroutine 119 [chan send, 15 minutes]:
[WARNING] [11:27:48+0000] testing.tRunner.func1(0xc420363b30)
[WARNING] [11:27:48+0000] 	/usr/local/go/src/testing/testing.go:741 +0x19b
[WARNING] [11:27:48+0000] testing.tRunner(0xc420363b30, 0xc42032ec40)
[WARNING] [11:27:48+0000] 	/usr/local/go/src/testing/testing.go:748 +0xda
[WARNING] [11:27:48+0000] created by testing.(*T).Run
[WARNING] [11:27:48+0000] 	/usr/local/go/src/testing/testing.go:789 +0x2de
[WARNING] [11:27:48+0000] goroutine 120 [chan send, 15 minutes]:
[WARNING] [11:27:48+0000] testing.tRunner.func1(0xc420363c20)
[WARNING] [11:27:48+0000] 	/usr/local/go/src/testing/testing.go:741 +0x19b
[WARNING] [11:27:48+0000] testing.tRunner(0xc420363c20, 0xc42032ecc0)
[WARNING] [11:27:48+0000] 	/usr/local/go/src/testing/testing.go:748 +0xda
[WARNING] [11:27:48+0000] created by testing.(*T).Run
[WARNING] [11:27:48+0000] 	/usr/local/go/src/testing/testing.go:789 +0x2de
[WARNING] [11:27:48+0000] goroutine 121 [chan send, 16 minutes]:
[WARNING] [11:27:48+0000] testing.tRunner.func1(0xc420363d10)
[WARNING] [11:27:48+0000] 	/usr/local/go/src/testing/testing.go:741 +0x19b
[WARNING] [11:27:48+0000] testing.tRunner(0xc420363d10, 0xc42032ed40)
[WARNING] [11:27:48+0000] 	/usr/local/go/src/testing/testing.go:748 +0xda
[WARNING] [11:27:48+0000] created by testing.(*T).Run
[WARNING] [11:27:48+0000] 	/usr/local/go/src/testing/testing.go:789 +0x2de
[WARNING] [11:27:48+0000] goroutine 122 [chan send, 16 minutes]:
[WARNING] [11:27:48+0000] testing.tRunner.func1(0xc420363e00)
[WARNING] [11:27:48+0000] 	/usr/local/go/src/testing/testing.go:741 +0x19b
[WARNING] [11:27:48+0000] testing.tRunner(0xc420363e00, 0xc42032edc0)
[WARNING] [11:27:48+0000] 	/usr/local/go/src/testing/testing.go:748 +0xda
[WARNING] [11:27:48+0000] created by testing.(*T).Run
[WARNING] [11:27:48+0000] 	/usr/local/go/src/testing/testing.go:789 +0x2de
[WARNING] [11:27:48+0000] goroutine 123 [chan send, 16 minutes]:
[WARNING] [11:27:48+0000] testing.tRunner.func1(0xc420363ef0)
[WARNING] [11:27:48+0000] 	/usr/local/go/src/testing/testing.go:741 +0x19b
[WARNING] [11:27:48+0000] testing.tRunner(0xc420363ef0, 0xc42032ee40)
[WARNING] [11:27:48+0000] 	/usr/local/go/src/testing/testing.go:748 +0xda
[WARNING] [11:27:48+0000] created by testing.(*T).Run
[WARNING] [11:27:48+0000] 	/usr/local/go/src/testing/testing.go:789 +0x2de
[WARNING] [11:27:48+0000] goroutine 124 [chan send, 16 minutes]:
[WARNING] [11:27:48+0000] testing.tRunner.func1(0xc4203ee000)
[WARNING] [11:27:48+0000] 	/usr/local/go/src/testing/testing.go:741 +0x19b
[WARNING] [11:27:48+0000] testing.tRunner(0xc4203ee000, 0xc42032eec0)
[WARNING] [11:27:48+0000] 	/usr/local/go/src/testing/testing.go:748 +0xda
[WARNING] [11:27:48+0000] created by testing.(*T).Run
[WARNING] [11:27:48+0000] 	/usr/local/go/src/testing/testing.go:789 +0x2de
[WARNING] [11:27:48+0000] goroutine 125 [chan send, 31 minutes]:
[WARNING] [11:27:48+0000] testing.tRunner.func1(0xc4203ee0f0)
[WARNING] [11:27:48+0000] 	/usr/local/go/src/testing/testing.go:741 +0x19b
[WARNING] [11:27:48+0000] testing.tRunner(0xc4203ee0f0, 0xc42032ef40)
[WARNING] [11:27:48+0000] 	/usr/local/go/src/testing/testing.go:748 +0xda
[WARNING] [11:27:48+0000] created by testing.(*T).Run
[WARNING] [11:27:48+0000] 	/usr/local/go/src/testing/testing.go:789 +0x2de
[WARNING] [11:27:48+0000] goroutine 126 [chan send, 16 minutes]:
[WARNING] [11:27:48+0000] testing.tRunner.func1(0xc4203ee1e0)
[WARNING] [11:27:48+0000] 	/usr/local/go/src/testing/testing.go:741 +0x19b
[WARNING] [11:27:48+0000] testing.tRunner(0xc4203ee1e0, 0xc42032efc0)
[WARNING] [11:27:48+0000] 	/usr/local/go/src/testing/testing.go:748 +0xda
[WARNING] [11:27:48+0000] created by testing.(*T).Run
[WARNING] [11:27:48+0000] 	/usr/local/go/src/testing/testing.go:789 +0x2de
[WARNING] [11:27:48+0000] goroutine 127 [chan send, 16 minutes]:
[WARNING] [11:27:48+0000] testing.tRunner.func1(0xc4203ee2d0)
[WARNING] [11:27:48+0000] 	/usr/local/go/src/testing/testing.go:741 +0x19b
[WARNING] [11:27:48+0000] testing.tRunner(0xc4203ee2d0, 0xc42032f040)
[WARNING] [11:27:48+0000] 	/usr/local/go/src/testing/testing.go:748 +0xda
[WARNING] [11:27:48+0000] created by testing.(*T).Run
[WARNING] [11:27:48+0000] 	/usr/local/go/src/testing/testing.go:789 +0x2de
[WARNING] [11:27:48+0000] goroutine 128 [chan send, 16 minutes]:
[WARNING] [11:27:48+0000] testing.tRunner.func1(0xc4203ee3c0)
[WARNING] [11:27:48+0000] 	/usr/local/go/src/testing/testing.go:741 +0x19b
[WARNING] [11:27:48+0000] testing.tRunner(0xc4203ee3c0, 0xc42032f0c0)
[WARNING] [11:27:48+0000] 	/usr/local/go/src/testing/testing.go:748 +0xda
[WARNING] [11:27:48+0000] created by testing.(*T).Run
[WARNING] [11:27:48+0000] 	/usr/local/go/src/testing/testing.go:789 +0x2de
[WARNING] [11:27:48+0000] goroutine 129 [chan send, 16 minutes]:
[WARNING] [11:27:48+0000] testing.tRunner.func1(0xc4203ee4b0)
[WARNING] [11:27:48+0000] 	/usr/local/go/src/testing/testing.go:741 +0x19b
[WARNING] [11:27:48+0000] testing.tRunner(0xc4203ee4b0, 0xc42032f140)
[WARNING] [11:27:48+0000] 	/usr/local/go/src/testing/testing.go:748 +0xda
[WARNING] [11:27:48+0000] created by testing.(*T).Run
[WARNING] [11:27:48+0000] 	/usr/local/go/src/testing/testing.go:789 +0x2de
[WARNING] [11:27:48+0000] goroutine 130 [chan send, 16 minutes]:
[WARNING] [11:27:48+0000] testing.tRunner.func1(0xc4203ee5a0)
[WARNING] [11:27:48+0000] 	/usr/local/go/src/testing/testing.go:741 +0x19b
[WARNING] [11:27:48+0000] testing.tRunner(0xc4203ee5a0, 0xc42032f1c0)
[WARNING] [11:27:48+0000] 	/usr/local/go/src/testing/testing.go:748 +0xda
[WARNING] [11:27:48+0000] created by testing.(*T).Run
[WARNING] [11:27:48+0000] 	/usr/local/go/src/testing/testing.go:789 +0x2de
[WARNING] [11:27:48+0000] goroutine 131 [chan send, 16 minutes]:
[WARNING] [11:27:48+0000] testing.tRunner.func1(0xc4203ee690)
[WARNING] [11:27:48+0000] 	/usr/local/go/src/testing/testing.go:741 +0x19b
[WARNING] [11:27:48+0000] testing.tRunner(0xc4203ee690, 0xc42032f240)
[WARNING] [11:27:48+0000] 	/usr/local/go/src/testing/testing.go:748 +0xda
[WARNING] [11:27:48+0000] created by testing.(*T).Run
[WARNING] [11:27:48+0000] 	/usr/local/go/src/testing/testing.go:789 +0x2de
[WARNING] [11:27:48+0000] goroutine 132 [chan send, 16 minutes]:
[WARNING] [11:27:48+0000] testing.tRunner.func1(0xc4203ee780)
[WARNING] [11:27:48+0000] 	/usr/local/go/src/testing/testing.go:741 +0x19b
[WARNING] [11:27:48+0000] testing.tRunner(0xc4203ee780, 0xc42032f2c0)
[WARNING] [11:27:48+0000] 	/usr/local/go/src/testing/testing.go:748 +0xda
[WARNING] [11:27:48+0000] created by testing.(*T).Run
[WARNING] [11:27:48+0000] 	/usr/local/go/src/testing/testing.go:789 +0x2de
[WARNING] [11:27:48+0000] goroutine 133 [chan send, 16 minutes]:
[WARNING] [11:27:48+0000] testing.tRunner.func1(0xc4203ee870)
[WARNING] [11:27:48+0000] 	/usr/local/go/src/testing/testing.go:741 +0x19b
[WARNING] [11:27:48+0000] testing.tRunner(0xc4203ee870, 0xc42032f340)
[WARNING] [11:27:48+0000] 	/usr/local/go/src/testing/testing.go:748 +0xda
[WARNING] [11:27:48+0000] created by testing.(*T).Run
[WARNING] [11:27:48+0000] 	/usr/local/go/src/testing/testing.go:789 +0x2de
[WARNING] [11:27:48+0000] goroutine 134 [chan send, 16 minutes]:
[WARNING] [11:27:48+0000] testing.tRunner.func1(0xc4203ee960)
[WARNING] [11:27:48+0000] 	/usr/local/go/src/testing/testing.go:741 +0x19b
[WARNING] [11:27:48+0000] testing.tRunner(0xc4203ee960, 0xc42032f3c0)
[WARNING] [11:27:48+0000] 	/usr/local/go/src/testing/testing.go:748 +0xda
[WARNING] [11:27:48+0000] created by testing.(*T).Run
[WARNING] [11:27:48+0000] 	/usr/local/go/src/testing/testing.go:789 +0x2de
[WARNING] [11:27:48+0000] goroutine 135 [chan send, 16 minutes]:
[WARNING] [11:27:48+0000] testing.tRunner.func1(0xc4203eea50)
[WARNING] [11:27:48+0000] 	/usr/local/go/src/testing/testing.go:741 +0x19b
[WARNING] [11:27:48+0000] testing.tRunner(0xc4203eea50, 0xc42032f440)
[WARNING] [11:27:48+0000] 	/usr/local/go/src/testing/testing.go:748 +0xda
[WARNING] [11:27:48+0000] created by testing.(*T).Run
[WARNING] [11:27:48+0000] 	/usr/local/go/src/testing/testing.go:789 +0x2de
[WARNING] [11:27:48+0000] goroutine 136 [chan send, 17 minutes]:
[WARNING] [11:27:48+0000] testing.tRunner.func1(0xc4203eeb40)
[WARNING] [11:27:48+0000] 	/usr/local/go/src/testing/testing.go:741 +0x19b
[WARNING] [11:27:48+0000] testing.tRunner(0xc4203eeb40, 0xc42032f4c0)
[WARNING] [11:27:48+0000] 	/usr/local/go/src/testing/testing.go:748 +0xda
[WARNING] [11:27:48+0000] created by testing.(*T).Run
[WARNING] [11:27:48+0000] 	/usr/local/go/src/testing/testing.go:789 +0x2de
[WARNING] [11:27:48+0000] goroutine 137 [chan send, 18 minutes]:
[WARNING] [11:27:48+0000] testing.tRunner.func1(0xc4203eec30)
[WARNING] [11:27:48+0000] 	/usr/local/go/src/testing/testing.go:741 +0x19b
[WARNING] [11:27:48+0000] testing.tRunner(0xc4203eec30, 0xc42032f540)
[WARNING] [11:27:48+0000] 	/usr/local/go/src/testing/testing.go:748 +0xda
[WARNING] [11:27:48+0000] created by testing.(*T).Run
[WARNING] [11:27:48+0000] 	/usr/local/go/src/testing/testing.go:789 +0x2de
[WARNING] [11:27:48+0000] goroutine 138 [chan send, 18 minutes]:
[WARNING] [11:27:48+0000] testing.tRunner.func1(0xc4203eed20)
[WARNING] [11:27:48+0000] 	/usr/local/go/src/testing/testing.go:741 +0x19b
[WARNING] [11:27:48+0000] testing.tRunner(0xc4203eed20, 0xc42032f5c0)
[WARNING] [11:27:48+0000] 	/usr/local/go/src/testing/testing.go:748 +0xda
[WARNING] [11:27:48+0000] created by testing.(*T).Run
[WARNING] [11:27:48+0000] 	/usr/local/go/src/testing/testing.go:789 +0x2de
[WARNING] [11:27:48+0000] goroutine 139 [chan send, 18 minutes]:
[WARNING] [11:27:48+0000] testing.tRunner.func1(0xc4203eee10)
[WARNING] [11:27:48+0000] 	/usr/local/go/src/testing/testing.go:741 +0x19b
[WARNING] [11:27:48+0000] testing.tRunner(0xc4203eee10, 0xc42032f640)
[WARNING] [11:27:48+0000] 	/usr/local/go/src/testing/testing.go:748 +0xda
[WARNING] [11:27:48+0000] created by testing.(*T).Run
[WARNING] [11:27:48+0000] 	/usr/local/go/src/testing/testing.go:789 +0x2de
[WARNING] [11:27:48+0000] goroutine 140 [chan send, 18 minutes]:
[WARNING] [11:27:48+0000] testing.tRunner.func1(0xc4203eef00)
[WARNING] [11:27:48+0000] 	/usr/local/go/src/testing/testing.go:741 +0x19b
[WARNING] [11:27:48+0000] testing.tRunner(0xc4203eef00, 0xc42032f6c0)
[WARNING] [11:27:48+0000] 	/usr/local/go/src/testing/testing.go:748 +0xda
[WARNING] [11:27:48+0000] created by testing.(*T).Run
[WARNING] [11:27:48+0000] 	/usr/local/go/src/testing/testing.go:789 +0x2de
[WARNING] [11:27:48+0000] goroutine 141 [chan send, 18 minutes]:
[WARNING] [11:27:48+0000] testing.tRunner.func1(0xc4203eeff0)
[WARNING] [11:27:48+0000] 	/usr/local/go/src/testing/testing.go:741 +0x19b
[WARNING] [11:27:48+0000] testing.tRunner(0xc4203eeff0, 0xc42032f740)
[WARNING] [11:27:48+0000] 	/usr/local/go/src/testing/testing.go:748 +0xda
[WARNING] [11:27:48+0000] created by testing.(*T).Run
[WARNING] [11:27:48+0000] 	/usr/local/go/src/testing/testing.go:789 +0x2de
[WARNING] [11:27:48+0000] goroutine 142 [chan send, 19 minutes]:
[WARNING] [11:27:48+0000] testing.tRunner.func1(0xc4203ef0e0)
[WARNING] [11:27:48+0000] 	/usr/local/go/src/testing/testing.go:741 +0x19b
[WARNING] [11:27:48+0000] testing.tRunner(0xc4203ef0e0, 0xc42032f7c0)
[WARNING] [11:27:48+0000] 	/usr/local/go/src/testing/testing.go:748 +0xda
[WARNING] [11:27:48+0000] created by testing.(*T).Run
[WARNING] [11:27:48+0000] 	/usr/local/go/src/testing/testing.go:789 +0x2de
[WARNING] [11:27:48+0000] goroutine 143 [chan send, 18 minutes]:
[WARNING] [11:27:48+0000] testing.tRunner.func1(0xc4203ef1d0)
[WARNING] [11:27:48+0000] 	/usr/local/go/src/testing/testing.go:741 +0x19b
[WARNING] [11:27:48+0000] testing.tRunner(0xc4203ef1d0, 0xc42032f840)
[WARNING] [11:27:48+0000] 	/usr/local/go/src/testing/testing.go:748 +0xda
[WARNING] [11:27:48+0000] created by testing.(*T).Run
[WARNING] [11:27:48+0000] 	/usr/local/go/src/testing/testing.go:789 +0x2de
[WARNING] [11:27:48+0000] goroutine 144 [chan send, 19 minutes]:
[WARNING] [11:27:48+0000] testing.tRunner.func1(0xc4203ef2c0)
[WARNING] [11:27:48+0000] 	/usr/local/go/src/testing/testing.go:741 +0x19b
[WARNING] [11:27:48+0000] testing.tRunner(0xc4203ef2c0, 0xc42032f8c0)
[WARNING] [11:27:48+0000] 	/usr/local/go/src/testing/testing.go:748 +0xda
[WARNING] [11:27:48+0000] created by testing.(*T).Run
[WARNING] [11:27:48+0000] 	/usr/local/go/src/testing/testing.go:789 +0x2de
[WARNING] [11:27:48+0000] goroutine 145 [chan send, 11 minutes]:
[WARNING] [11:27:48+0000] testing.tRunner.func1(0xc4203ef3b0)
[WARNING] [11:27:48+0000] 	/usr/local/go/src/testing/testing.go:741 +0x19b
[WARNING] [11:27:48+0000] testing.tRunner(0xc4203ef3b0, 0xc42032f940)
[WARNING] [11:27:48+0000] 	/usr/local/go/src/testing/testing.go:748 +0xda
[WARNING] [11:27:48+0000] created by testing.(*T).Run
[WARNING] [11:27:48+0000] 	/usr/local/go/src/testing/testing.go:789 +0x2de
[WARNING] [11:27:48+0000] goroutine 146 [chan send, 14 minutes]:
[WARNING] [11:27:48+0000] testing.tRunner.func1(0xc4203ef4a0)
[WARNING] [11:27:48+0000] 	/usr/local/go/src/testing/testing.go:741 +0x19b
[WARNING] [11:27:48+0000] testing.tRunner(0xc4203ef4a0, 0xc42032f9c0)
[WARNING] [11:27:48+0000] 	/usr/local/go/src/testing/testing.go:748 +0xda
[WARNING] [11:27:48+0000] created by testing.(*T).Run
[WARNING] [11:27:48+0000] 	/usr/local/go/src/testing/testing.go:789 +0x2de
[WARNING] [11:27:48+0000] goroutine 147 [chan send, 19 minutes]:
[WARNING] [11:27:48+0000] testing.tRunner.func1(0xc4203ef590)
[WARNING] [11:27:48+0000] 	/usr/local/go/src/testing/testing.go:741 +0x19b
[WARNING] [11:27:48+0000] testing.tRunner(0xc4203ef590, 0xc42032fa40)
[WARNING] [11:27:48+0000] 	/usr/local/go/src/testing/testing.go:748 +0xda
[WARNING] [11:27:48+0000] created by testing.(*T).Run
[WARNING] [11:27:48+0000] 	/usr/local/go/src/testing/testing.go:789 +0x2de
[WARNING] [11:27:48+0000] goroutine 148 [chan send, 19 minutes]:
[WARNING] [11:27:48+0000] testing.tRunner.func1(0xc4203ef680)
[WARNING] [11:27:48+0000] 	/usr/local/go/src/testing/testing.go:741 +0x19b
[WARNING] [11:27:48+0000] testing.tRunner(0xc4203ef680, 0xc42032fac0)
[WARNING] [11:27:48+0000] 	/usr/local/go/src/testing/testing.go:748 +0xda
[WARNING] [11:27:48+0000] created by testing.(*T).Run
[WARNING] [11:27:48+0000] 	/usr/local/go/src/testing/testing.go:789 +0x2de
[WARNING] [11:27:48+0000] goroutine 149 [chan send, 19 minutes]:
[WARNING] [11:27:48+0000] testing.tRunner.func1(0xc4203ef770)
[WARNING] [11:27:48+0000] 	/usr/local/go/src/testing/testing.go:741 +0x19b
[WARNING] [11:27:48+0000] testing.tRunner(0xc4203ef770, 0xc42032fb40)
[WARNING] [11:27:48+0000] 	/usr/local/go/src/testing/testing.go:748 +0xda
[WARNING] [11:27:48+0000] created by testing.(*T).Run
[WARNING] [11:27:48+0000] 	/usr/local/go/src/testing/testing.go:789 +0x2de
[WARNING] [11:27:48+0000] goroutine 150 [chan send, 20 minutes]:
[WARNING] [11:27:48+0000] testing.tRunner.func1(0xc4203ef860)
[WARNING] [11:27:48+0000] 	/usr/local/go/src/testing/testing.go:741 +0x19b
[WARNING] [11:27:48+0000] testing.tRunner(0xc4203ef860, 0xc42032fbc0)
[WARNING] [11:27:48+0000] 	/usr/local/go/src/testing/testing.go:748 +0xda
[WARNING] [11:27:48+0000] created by testing.(*T).Run
[WARNING] [11:27:48+0000] 	/usr/local/go/src/testing/testing.go:789 +0x2de
[WARNING] [11:27:48+0000] goroutine 151 [chan send, 20 minutes]:
[WARNING] [11:27:48+0000] testing.tRunner.func1(0xc4203ef950)
[WARNING] [11:27:48+0000] 	/usr/local/go/src/testing/testing.go:741 +0x19b
[WARNING] [11:27:48+0000] testing.tRunner(0xc4203ef950, 0xc42032fc40)
[WARNING] [11:27:48+0000] 	/usr/local/go/src/testing/testing.go:748 +0xda
[WARNING] [11:27:48+0000] created by testing.(*T).Run
[WARNING] [11:27:48+0000] 	/usr/local/go/src/testing/testing.go:789 +0x2de
[WARNING] [11:27:48+0000] goroutine 152 [chan send, 20 minutes]:
[WARNING] [11:27:48+0000] testing.tRunner.func1(0xc4203efa40)
[WARNING] [11:27:48+0000] 	/usr/local/go/src/testing/testing.go:741 +0x19b
[WARNING] [11:27:48+0000] testing.tRunner(0xc4203efa40, 0xc42032fcc0)
[WARNING] [11:27:48+0000] 	/usr/local/go/src/testing/testing.go:748 +0xda
[WARNING] [11:27:48+0000] created by testing.(*T).Run
[WARNING] [11:27:48+0000] 	/usr/local/go/src/testing/testing.go:789 +0x2de
[WARNING] [11:27:48+0000] goroutine 153 [chan send, 20 minutes]:
[WARNING] [11:27:48+0000] testing.tRunner.func1(0xc4203efb30)
[WARNING] [11:27:48+0000] 	/usr/local/go/src/testing/testing.go:741 +0x19b
[WARNING] [11:27:48+0000] testing.tRunner(0xc4203efb30, 0xc42032fd40)
[WARNING] [11:27:48+0000] 	/usr/local/go/src/testing/testing.go:748 +0xda
[WARNING] [11:27:48+0000] created by testing.(*T).Run
[WARNING] [11:27:48+0000] 	/usr/local/go/src/testing/testing.go:789 +0x2de
[WARNING] [11:27:48+0000] goroutine 154 [chan send, 20 minutes]:
[WARNING] [11:27:48+0000] testing.tRunner.func1(0xc4203efc20)
[WARNING] [11:27:48+0000] 	/usr/local/go/src/testing/testing.go:741 +0x19b
[WARNING] [11:27:48+0000] testing.tRunner(0xc4203efc20, 0xc42032fdc0)
[WARNING] [11:27:48+0000] 	/usr/local/go/src/testing/testing.go:748 +0xda
[WARNING] [11:27:48+0000] created by testing.(*T).Run
[WARNING] [11:27:48+0000] 	/usr/local/go/src/testing/testing.go:789 +0x2de
[WARNING] [11:27:48+0000] goroutine 155 [chan send, 21 minutes]:
[WARNING] [11:27:48+0000] testing.tRunner.func1(0xc4203efd10)
[WARNING] [11:27:48+0000] 	/usr/local/go/src/testing/testing.go:741 +0x19b
[WARNING] [11:27:48+0000] testing.tRunner(0xc4203efd10, 0xc42032fe40)
[WARNING] [11:27:48+0000] 	/usr/local/go/src/testing/testing.go:748 +0xda
[WARNING] [11:27:48+0000] created by testing.(*T).Run
[WARNING] [11:27:48+0000] 	/usr/local/go/src/testing/testing.go:789 +0x2de
[WARNING] [11:27:48+0000] goroutine 156 [chan send, 21 minutes]:
[WARNING] [11:27:48+0000] testing.tRunner.func1(0xc4203efe00)
[WARNING] [11:27:48+0000] 	/usr/local/go/src/testing/testing.go:741 +0x19b
[WARNING] [11:27:48+0000] testing.tRunner(0xc4203efe00, 0xc42032fec0)
[WARNING] [11:27:48+0000] 	/usr/local/go/src/testing/testing.go:748 +0xda
[WARNING] [11:27:48+0000] created by testing.(*T).Run
[WARNING] [11:27:48+0000] 	/usr/local/go/src/testing/testing.go:789 +0x2de
[WARNING] [11:27:48+0000] goroutine 157 [chan send, 21 minutes]:
[WARNING] [11:27:48+0000] testing.tRunner.func1(0xc4203efef0)
[WARNING] [11:27:48+0000] 	/usr/local/go/src/testing/testing.go:741 +0x19b
[WARNING] [11:27:48+0000] testing.tRunner(0xc4203efef0, 0xc42032ff40)
[WARNING] [11:27:48+0000] 	/usr/local/go/src/testing/testing.go:748 +0xda
[WARNING] [11:27:48+0000] created by testing.(*T).Run
[WARNING] [11:27:48+0000] 	/usr/local/go/src/testing/testing.go:789 +0x2de
[WARNING] [11:27:48+0000] goroutine 158 [chan send, 21 minutes]:
[WARNING] [11:27:48+0000] testing.tRunner.func1(0xc420248000)
[WARNING] [11:27:48+0000] 	/usr/local/go/src/testing/testing.go:741 +0x19b
[WARNING] [11:27:48+0000] testing.tRunner(0xc420248000, 0xc42032ffc0)
[WARNING] [11:27:48+0000] 	/usr/local/go/src/testing/testing.go:748 +0xda
[WARNING] [11:27:48+0000] created by testing.(*T).Run
[WARNING] [11:27:48+0000] 	/usr/local/go/src/testing/testing.go:789 +0x2de
[WARNING] [11:27:48+0000] goroutine 159 [chan send, 21 minutes]:
[WARNING] [11:27:48+0000] testing.tRunner.func1(0xc4202480f0)
[WARNING] [11:27:48+0000] 	/usr/local/go/src/testing/testing.go:741 +0x19b
[WARNING] [11:27:48+0000] testing.tRunner(0xc4202480f0, 0xc4201c4040)
[WARNING] [11:27:48+0000] 	/usr/local/go/src/testing/testing.go:748 +0xda
[WARNING] [11:27:48+0000] created by testing.(*T).Run
[WARNING] [11:27:48+0000] 	/usr/local/go/src/testing/testing.go:789 +0x2de
[WARNING] [11:27:48+0000] goroutine 160 [chan send, 21 minutes]:
[WARNING] [11:27:48+0000] testing.tRunner.func1(0xc4202481e0)
[WARNING] [11:27:48+0000] 	/usr/local/go/src/testing/testing.go:741 +0x19b
[WARNING] [11:27:48+0000] testing.tRunner(0xc4202481e0, 0xc4201c40c0)
[WARNING] [11:27:48+0000] 	/usr/local/go/src/testing/testing.go:748 +0xda
[WARNING] [11:27:48+0000] created by testing.(*T).Run
[WARNING] [11:27:48+0000] 	/usr/local/go/src/testing/testing.go:789 +0x2de
[WARNING] [11:27:48+0000] goroutine 161 [chan send, 21 minutes]:
[WARNING] [11:27:48+0000] testing.tRunner.func1(0xc4202482d0)
[WARNING] [11:27:48+0000] 	/usr/local/go/src/testing/testing.go:741 +0x19b
[WARNING] [11:27:48+0000] testing.tRunner(0xc4202482d0, 0xc4201c4140)
[WARNING] [11:27:48+0000] 	/usr/local/go/src/testing/testing.go:748 +0xda
[WARNING] [11:27:48+0000] created by testing.(*T).Run
[WARNING] [11:27:48+0000] 	/usr/local/go/src/testing/testing.go:789 +0x2de
[WARNING] [11:27:48+0000] goroutine 162 [chan send, 21 minutes]:
[WARNING] [11:27:48+0000] testing.tRunner.func1(0xc4202483c0)
[WARNING] [11:27:48+0000] 	/usr/local/go/src/testing/testing.go:741 +0x19b
[WARNING] [11:27:48+0000] testing.tRunner(0xc4202483c0, 0xc4201c41c0)
[WARNING] [11:27:48+0000] 	/usr/local/go/src/testing/testing.go:748 +0xda
[WARNING] [11:27:48+0000] created by testing.(*T).Run
[WARNING] [11:27:48+0000] 	/usr/local/go/src/testing/testing.go:789 +0x2de
[WARNING] [11:27:48+0000] goroutine 163 [chan send, 22 minutes]:
[WARNING] [11:27:48+0000] testing.tRunner.func1(0xc4202484b0)
[WARNING] [11:27:48+0000] 	/usr/local/go/src/testing/testing.go:741 +0x19b
[WARNING] [11:27:48+0000] testing.tRunner(0xc4202484b0, 0xc4201c4240)
[WARNING] [11:27:48+0000] 	/usr/local/go/src/testing/testing.go:748 +0xda
[WARNING] [11:27:48+0000] created by testing.(*T).Run
[WARNING] [11:27:48+0000] 	/usr/local/go/src/testing/testing.go:789 +0x2de
[WARNING] [11:27:48+0000] goroutine 164 [chan send, 22 minutes]:
[WARNING] [11:27:48+0000] testing.tRunner.func1(0xc4202485a0)
[WARNING] [11:27:48+0000] 	/usr/local/go/src/testing/testing.go:741 +0x19b
[WARNING] [11:27:48+0000] testing.tRunner(0xc4202485a0, 0xc4201c42c0)
[WARNING] [11:27:48+0000] 	/usr/local/go/src/testing/testing.go:748 +0xda
[WARNING] [11:27:48+0000] created by testing.(*T).Run
[WARNING] [11:27:48+0000] 	/usr/local/go/src/testing/testing.go:789 +0x2de
[WARNING] [11:27:48+0000] goroutine 165 [chan send, 22 minutes]:
[WARNING] [11:27:48+0000] testing.tRunner.func1(0xc420248690)
[WARNING] [11:27:48+0000] 	/usr/local/go/src/testing/testing.go:741 +0x19b
[WARNING] [11:27:48+0000] testing.tRunner(0xc420248690, 0xc4201c4340)
[WARNING] [11:27:48+0000] 	/usr/local/go/src/testing/testing.go:748 +0xda
[WARNING] [11:27:48+0000] created by testing.(*T).Run
[WARNING] [11:27:48+0000] 	/usr/local/go/src/testing/testing.go:789 +0x2de
[WARNING] [11:27:48+0000] goroutine 166 [chan send, 22 minutes]:
[WARNING] [11:27:48+0000] testing.tRunner.func1(0xc420248780)
[WARNING] [11:27:48+0000] 	/usr/local/go/src/testing/testing.go:741 +0x19b
[WARNING] [11:27:48+0000] testing.tRunner(0xc420248780, 0xc4201c43c0)
[WARNING] [11:27:48+0000] 	/usr/local/go/src/testing/testing.go:748 +0xda
[WARNING] [11:27:48+0000] created by testing.(*T).Run
[WARNING] [11:27:48+0000] 	/usr/local/go/src/testing/testing.go:789 +0x2de
[WARNING] [11:27:48+0000] goroutine 167 [chan send, 22 minutes]:
[WARNING] [11:27:48+0000] testing.tRunner.func1(0xc420248870)
[WARNING] [11:27:48+0000] 	/usr/local/go/src/testing/testing.go:741 +0x19b
[WARNING] [11:27:48+0000] testing.tRunner(0xc420248870, 0xc4201c4440)
[WARNING] [11:27:48+0000] 	/usr/local/go/src/testing/testing.go:748 +0xda
[WARNING] [11:27:48+0000] created by testing.(*T).Run
[WARNING] [11:27:48+0000] 	/usr/local/go/src/testing/testing.go:789 +0x2de
[WARNING] [11:27:48+0000] goroutine 168 [chan send, 23 minutes]:
[WARNING] [11:27:48+0000] testing.tRunner.func1(0xc420248960)
[WARNING] [11:27:48+0000] 	/usr/local/go/src/testing/testing.go:741 +0x19b
[WARNING] [11:27:48+0000] testing.tRunner(0xc420248960, 0xc4201c44c0)
[WARNING] [11:27:48+0000] 	/usr/local/go/src/testing/testing.go:748 +0xda
[WARNING] [11:27:48+0000] created by testing.(*T).Run
[WARNING] [11:27:48+0000] 	/usr/local/go/src/testing/testing.go:789 +0x2de
[WARNING] [11:27:48+0000] goroutine 169 [chan send, 23 minutes]:
[WARNING] [11:27:48+0000] testing.tRunner.func1(0xc420248a50)
[WARNING] [11:27:48+0000] 	/usr/local/go/src/testing/testing.go:741 +0x19b
[WARNING] [11:27:48+0000] testing.tRunner(0xc420248a50, 0xc4201c4540)
[WARNING] [11:27:48+0000] 	/usr/local/go/src/testing/testing.go:748 +0xda
[WARNING] [11:27:48+0000] created by testing.(*T).Run
[WARNING] [11:27:48+0000] 	/usr/local/go/src/testing/testing.go:789 +0x2de
[WARNING] [11:27:48+0000] goroutine 170 [chan send, 23 minutes]:
[WARNING] [11:27:48+0000] testing.tRunner.func1(0xc420248b40)
[WARNING] [11:27:48+0000] 	/usr/local/go/src/testing/testing.go:741 +0x19b
[WARNING] [11:27:48+0000] testing.tRunner(0xc420248b40, 0xc4201c45c0)
[WARNING] [11:27:48+0000] 	/usr/local/go/src/testing/testing.go:748 +0xda
[WARNING] [11:27:48+0000] created by testing.(*T).Run
[WARNING] [11:27:48+0000] 	/usr/local/go/src/testing/testing.go:789 +0x2de
[WARNING] [11:27:48+0000] goroutine 171 [chan send, 23 minutes]:
[WARNING] [11:27:48+0000] testing.tRunner.func1(0xc420248c30)
[WARNING] [11:27:48+0000] 	/usr/local/go/src/testing/testing.go:741 +0x19b
[WARNING] [11:27:48+0000] testing.tRunner(0xc420248c30, 0xc4201c4640)
[WARNING] [11:27:48+0000] 	/usr/local/go/src/testing/testing.go:748 +0xda
[WARNING] [11:27:48+0000] created by testing.(*T).Run
[WARNING] [11:27:48+0000] 	/usr/local/go/src/testing/testing.go:789 +0x2de
[WARNING] [11:27:48+0000] goroutine 172 [chan send, 23 minutes]:
[WARNING] [11:27:48+0000] testing.tRunner.func1(0xc420248d20)
[WARNING] [11:27:48+0000] 	/usr/local/go/src/testing/testing.go:741 +0x19b
[WARNING] [11:27:48+0000] testing.tRunner(0xc420248d20, 0xc4201c46c0)
[WARNING] [11:27:48+0000] 	/usr/local/go/src/testing/testing.go:748 +0xda
[WARNING] [11:27:48+0000] created by testing.(*T).Run
[WARNING] [11:27:48+0000] 	/usr/local/go/src/testing/testing.go:789 +0x2de
[WARNING] [11:27:48+0000] goroutine 173 [chan send, 24 minutes]:
[WARNING] [11:27:48+0000] testing.tRunner.func1(0xc420248e10)
[WARNING] [11:27:48+0000] 	/usr/local/go/src/testing/testing.go:741 +0x19b
[WARNING] [11:27:48+0000] testing.tRunner(0xc420248e10, 0xc4201c4740)
[WARNING] [11:27:48+0000] 	/usr/local/go/src/testing/testing.go:748 +0xda
[WARNING] [11:27:48+0000] created by testing.(*T).Run
[WARNING] [11:27:48+0000] 	/usr/local/go/src/testing/testing.go:789 +0x2de
[WARNING] [11:27:48+0000] goroutine 174 [chan send, 24 minutes]:
[WARNING] [11:27:48+0000] testing.tRunner.func1(0xc420248f00)
[WARNING] [11:27:48+0000] 	/usr/local/go/src/testing/testing.go:741 +0x19b
[WARNING] [11:27:48+0000] testing.tRunner(0xc420248f00, 0xc4201c47c0)
[WARNING] [11:27:48+0000] 	/usr/local/go/src/testing/testing.go:748 +0xda
[WARNING] [11:27:48+0000] created by testing.(*T).Run
[WARNING] [11:27:48+0000] 	/usr/local/go/src/testing/testing.go:789 +0x2de
[WARNING] [11:27:48+0000] goroutine 175 [chan send, 24 minutes]:
[WARNING] [11:27:48+0000] testing.tRunner.func1(0xc420248ff0)
[WARNING] [11:27:48+0000] 	/usr/local/go/src/testing/testing.go:741 +0x19b
[WARNING] [11:27:48+0000] testing.tRunner(0xc420248ff0, 0xc4201c4840)
[WARNING] [11:27:48+0000] 	/usr/local/go/src/testing/testing.go:748 +0xda
[WARNING] [11:27:48+0000] created by testing.(*T).Run
[WARNING] [11:27:48+0000] 	/usr/local/go/src/testing/testing.go:789 +0x2de
[WARNING] [11:27:48+0000] goroutine 176 [chan send, 24 minutes]:
[WARNING] [11:27:48+0000] testing.tRunner.func1(0xc4202490e0)
[WARNING] [11:27:48+0000] 	/usr/local/go/src/testing/testing.go:741 +0x19b
[WARNING] [11:27:48+0000] testing.tRunner(0xc4202490e0, 0xc4201c48c0)
[WARNING] [11:27:48+0000] 	/usr/local/go/src/testing/testing.go:748 +0xda
[WARNING] [11:27:48+0000] created by testing.(*T).Run
[WARNING] [11:27:48+0000] 	/usr/local/go/src/testing/testing.go:789 +0x2de
[WARNING] [11:27:48+0000] goroutine 177 [chan send, 24 minutes]:
[WARNING] [11:27:48+0000] testing.tRunner.func1(0xc4202491d0)
[WARNING] [11:27:48+0000] 	/usr/local/go/src/testing/testing.go:741 +0x19b
[WARNING] [11:27:48+0000] testing.tRunner(0xc4202491d0, 0xc4201c4940)
[WARNING] [11:27:48+0000] 	/usr/local/go/src/testing/testing.go:748 +0xda
[WARNING] [11:27:48+0000] created by testing.(*T).Run
[WARNING] [11:27:48+0000] 	/usr/local/go/src/testing/testing.go:789 +0x2de
[WARNING] [11:27:48+0000] goroutine 178 [chan send, 24 minutes]:
[WARNING] [11:27:48+0000] testing.tRunner.func1(0xc4202492c0)
[WARNING] [11:27:48+0000] 	/usr/local/go/src/testing/testing.go:741 +0x19b
[WARNING] [11:27:48+0000] testing.tRunner(0xc4202492c0, 0xc4201c49c0)
[WARNING] [11:27:48+0000] 	/usr/local/go/src/testing/testing.go:748 +0xda
[WARNING] [11:27:48+0000] created by testing.(*T).Run
[WARNING] [11:27:48+0000] 	/usr/local/go/src/testing/testing.go:789 +0x2de
[WARNING] [11:27:48+0000] goroutine 179 [chan send, 24 minutes]:
[WARNING] [11:27:48+0000] testing.tRunner.func1(0xc4202493b0)
[WARNING] [11:27:48+0000] 	/usr/local/go/src/testing/testing.go:741 +0x19b
[WARNING] [11:27:48+0000] testing.tRunner(0xc4202493b0, 0xc4201c4a40)
[WARNING] [11:27:48+0000] 	/usr/local/go/src/testing/testing.go:748 +0xda
[WARNING] [11:27:48+0000] created by testing.(*T).Run
[WARNING] [11:27:48+0000] 	/usr/local/go/src/testing/testing.go:789 +0x2de
[WARNING] [11:27:48+0000] goroutine 180 [chan send, 24 minutes]:
[WARNING] [11:27:48+0000] testing.tRunner.func1(0xc4202494a0)
[WARNING] [11:27:48+0000] 	/usr/local/go/src/testing/testing.go:741 +0x19b
[WARNING] [11:27:48+0000] testing.tRunner(0xc4202494a0, 0xc4201c4ac0)
[WARNING] [11:27:48+0000] 	/usr/local/go/src/testing/testing.go:748 +0xda
[WARNING] [11:27:48+0000] created by testing.(*T).Run
[WARNING] [11:27:48+0000] 	/usr/local/go/src/testing/testing.go:789 +0x2de
[WARNING] [11:27:48+0000] goroutine 181 [chan send, 23 minutes]:
[WARNING] [11:27:48+0000] testing.tRunner.func1(0xc420249590)
[WARNING] [11:27:48+0000] 	/usr/local/go/src/testing/testing.go:741 +0x19b
[WARNING] [11:27:48+0000] testing.tRunner(0xc420249590, 0xc4201c4b40)
[WARNING] [11:27:48+0000] 	/usr/local/go/src/testing/testing.go:748 +0xda
[WARNING] [11:27:48+0000] created by testing.(*T).Run
[WARNING] [11:27:48+0000] 	/usr/local/go/src/testing/testing.go:789 +0x2de
[WARNING] [11:27:48+0000] goroutine 182 [chan send, 23 minutes]:
[WARNING] [11:27:48+0000] testing.tRunner.func1(0xc420249680)
[WARNING] [11:27:48+0000] 	/usr/local/go/src/testing/testing.go:741 +0x19b
[WARNING] [11:27:48+0000] testing.tRunner(0xc420249680, 0xc4201c4bc0)
[WARNING] [11:27:48+0000] 	/usr/local/go/src/testing/testing.go:748 +0xda
[WARNING] [11:27:48+0000] created by testing.(*T).Run
[WARNING] [11:27:48+0000] 	/usr/local/go/src/testing/testing.go:789 +0x2de
[WARNING] [11:27:48+0000] goroutine 183 [chan send, 23 minutes]:
[WARNING] [11:27:48+0000] testing.tRunner.func1(0xc420249770)
[WARNING] [11:27:48+0000] 	/usr/local/go/src/testing/testing.go:741 +0x19b
[WARNING] [11:27:48+0000] testing.tRunner(0xc420249770, 0xc4201c4c40)
[WARNING] [11:27:48+0000] 	/usr/local/go/src/testing/testing.go:748 +0xda
[WARNING] [11:27:48+0000] created by testing.(*T).Run
[WARNING] [11:27:48+0000] 	/usr/local/go/src/testing/testing.go:789 +0x2de
[WARNING] [11:27:48+0000] goroutine 184 [chan send, 24 minutes]:
[WARNING] [11:27:48+0000] testing.tRunner.func1(0xc420249860)
[WARNING] [11:27:48+0000] 	/usr/local/go/src/testing/testing.go:741 +0x19b
[WARNING] [11:27:48+0000] testing.tRunner(0xc420249860, 0xc4201c4cc0)
[WARNING] [11:27:48+0000] 	/usr/local/go/src/testing/testing.go:748 +0xda
[WARNING] [11:27:48+0000] created by testing.(*T).Run
[WARNING] [11:27:48+0000] 	/usr/local/go/src/testing/testing.go:789 +0x2de
[WARNING] [11:27:48+0000] goroutine 185 [chan send, 24 minutes]:
[WARNING] [11:27:48+0000] testing.tRunner.func1(0xc420249950)
[WARNING] [11:27:48+0000] 	/usr/local/go/src/testing/testing.go:741 +0x19b
[WARNING] [11:27:48+0000] testing.tRunner(0xc420249950, 0xc4201c4d40)
[WARNING] [11:27:48+0000] 	/usr/local/go/src/testing/testing.go:748 +0xda
[WARNING] [11:27:48+0000] created by testing.(*T).Run
[WARNING] [11:27:48+0000] 	/usr/local/go/src/testing/testing.go:789 +0x2de
[WARNING] [11:27:48+0000] goroutine 186 [chan send, 24 minutes]:
[WARNING] [11:27:48+0000] testing.tRunner.func1(0xc420249a40)
[WARNING] [11:27:48+0000] 	/usr/local/go/src/testing/testing.go:741 +0x19b
[WARNING] [11:27:48+0000] testing.tRunner(0xc420249a40, 0xc4201c4dc0)
[WARNING] [11:27:48+0000] 	/usr/local/go/src/testing/testing.go:748 +0xda
[WARNING] [11:27:48+0000] created by testing.(*T).Run
[WARNING] [11:27:48+0000] 	/usr/local/go/src/testing/testing.go:789 +0x2de
[WARNING] [11:27:48+0000] goroutine 187 [chan send, 24 minutes]:
[WARNING] [11:27:48+0000] testing.tRunner.func1(0xc420249b30)
[WARNING] [11:27:48+0000] 	/usr/local/go/src/testing/testing.go:741 +0x19b
[WARNING] [11:27:48+0000] testing.tRunner(0xc420249b30, 0xc4201c4e40)
[WARNING] [11:27:48+0000] 	/usr/local/go/src/testing/testing.go:748 +0xda
[WARNING] [11:27:48+0000] created by testing.(*T).Run
[WARNING] [11:27:48+0000] 	/usr/local/go/src/testing/testing.go:789 +0x2de
[WARNING] [11:27:48+0000] goroutine 188 [chan send, 24 minutes]:
[WARNING] [11:27:48+0000] testing.tRunner.func1(0xc420249c20)
[WARNING] [11:27:48+0000] 	/usr/local/go/src/testing/testing.go:741 +0x19b
[WARNING] [11:27:48+0000] testing.tRunner(0xc420249c20, 0xc4201c4ec0)
[WARNING] [11:27:48+0000] 	/usr/local/go/src/testing/testing.go:748 +0xda
[WARNING] [11:27:48+0000] created by testing.(*T).Run
[WARNING] [11:27:48+0000] 	/usr/local/go/src/testing/testing.go:789 +0x2de
[WARNING] [11:27:48+0000] goroutine 189 [chan send, 25 minutes]:
[WARNING] [11:27:48+0000] testing.tRunner.func1(0xc420249d10)
[WARNING] [11:27:48+0000] 	/usr/local/go/src/testing/testing.go:741 +0x19b
[WARNING] [11:27:48+0000] testing.tRunner(0xc420249d10, 0xc4201c4f40)
[WARNING] [11:27:48+0000] 	/usr/local/go/src/testing/testing.go:748 +0xda
[WARNING] [11:27:48+0000] created by testing.(*T).Run
[WARNING] [11:27:48+0000] 	/usr/local/go/src/testing/testing.go:789 +0x2de
[WARNING] [11:27:48+0000] goroutine 190 [chan send, 25 minutes]:
[WARNING] [11:27:48+0000] testing.tRunner.func1(0xc420249e00)
[WARNING] [11:27:48+0000] 	/usr/local/go/src/testing/testing.go:741 +0x19b
[WARNING] [11:27:48+0000] testing.tRunner(0xc420249e00, 0xc4201c4fc0)
[WARNING] [11:27:48+0000] 	/usr/local/go/src/testing/testing.go:748 +0xda
[WARNING] [11:27:48+0000] created by testing.(*T).Run
[WARNING] [11:27:48+0000] 	/usr/local/go/src/testing/testing.go:789 +0x2de
[WARNING] [11:27:48+0000] goroutine 191 [chan send, 25 minutes]:
[WARNING] [11:27:48+0000] testing.tRunner.func1(0xc420249ef0)
[WARNING] [11:27:48+0000] 	/usr/local/go/src/testing/testing.go:741 +0x19b
[WARNING] [11:27:48+0000] testing.tRunner(0xc420249ef0, 0xc4201c5040)
[WARNING] [11:27:48+0000] 	/usr/local/go/src/testing/testing.go:748 +0xda
[WARNING] [11:27:48+0000] created by testing.(*T).Run
[WARNING] [11:27:48+0000] 	/usr/local/go/src/testing/testing.go:789 +0x2de
[WARNING] [11:27:48+0000] goroutine 192 [chan send, 25 minutes]:
[WARNING] [11:27:48+0000] testing.tRunner.func1(0xc420258000)
[WARNING] [11:27:48+0000] 	/usr/local/go/src/testing/testing.go:741 +0x19b
[WARNING] [11:27:48+0000] testing.tRunner(0xc420258000, 0xc4201c50c0)
[WARNING] [11:27:48+0000] 	/usr/local/go/src/testing/testing.go:748 +0xda
[WARNING] [11:27:48+0000] created by testing.(*T).Run
[WARNING] [11:27:48+0000] 	/usr/local/go/src/testing/testing.go:789 +0x2de
[WARNING] [11:27:48+0000] goroutine 193 [chan send, 25 minutes]:
[WARNING] [11:27:48+0000] testing.tRunner.func1(0xc4202580f0)
[WARNING] [11:27:48+0000] 	/usr/local/go/src/testing/testing.go:741 +0x19b
[WARNING] [11:27:48+0000] testing.tRunner(0xc4202580f0, 0xc4201c5140)
[WARNING] [11:27:48+0000] 	/usr/local/go/src/testing/testing.go:748 +0xda
[WARNING] [11:27:48+0000] created by testing.(*T).Run
[WARNING] [11:27:48+0000] 	/usr/local/go/src/testing/testing.go:789 +0x2de
[WARNING] [11:27:48+0000] goroutine 194 [chan send, 25 minutes]:
[WARNING] [11:27:48+0000] testing.tRunner.func1(0xc4202581e0)
[WARNING] [11:27:48+0000] 	/usr/local/go/src/testing/testing.go:741 +0x19b
[WARNING] [11:27:48+0000] testing.tRunner(0xc4202581e0, 0xc4201c51c0)
[WARNING] [11:27:48+0000] 	/usr/local/go/src/testing/testing.go:748 +0xda
[WARNING] [11:27:48+0000] created by testing.(*T).Run
[WARNING] [11:27:48+0000] 	/usr/local/go/src/testing/testing.go:789 +0x2de
[WARNING] [11:27:48+0000] goroutine 195 [chan send, 25 minutes]:
[WARNING] [11:27:48+0000] testing.tRunner.func1(0xc4202582d0)
[WARNING] [11:27:48+0000] 	/usr/local/go/src/testing/testing.go:741 +0x19b
[WARNING] [11:27:48+0000] testing.tRunner(0xc4202582d0, 0xc4201c5240)
[WARNING] [11:27:48+0000] 	/usr/local/go/src/testing/testing.go:748 +0xda
[WARNING] [11:27:48+0000] created by testing.(*T).Run
[WARNING] [11:27:48+0000] 	/usr/local/go/src/testing/testing.go:789 +0x2de
[WARNING] [11:27:48+0000] goroutine 196 [chan send, 25 minutes]:
[WARNING] [11:27:48+0000] testing.tRunner.func1(0xc4202583c0)
[WARNING] [11:27:48+0000] 	/usr/local/go/src/testing/testing.go:741 +0x19b
[WARNING] [11:27:48+0000] testing.tRunner(0xc4202583c0, 0xc4201c52c0)
[WARNING] [11:27:48+0000] 	/usr/local/go/src/testing/testing.go:748 +0xda
[WARNING] [11:27:48+0000] created by testing.(*T).Run
[WARNING] [11:27:48+0000] 	/usr/local/go/src/testing/testing.go:789 +0x2de
[WARNING] [11:27:48+0000] goroutine 197 [chan send, 26 minutes]:
[WARNING] [11:27:48+0000] testing.tRunner.func1(0xc4202584b0)
[WARNING] [11:27:48+0000] 	/usr/local/go/src/testing/testing.go:741 +0x19b
[WARNING] [11:27:48+0000] testing.tRunner(0xc4202584b0, 0xc4201c5340)
[WARNING] [11:27:48+0000] 	/usr/local/go/src/testing/testing.go:748 +0xda
[WARNING] [11:27:48+0000] created by testing.(*T).Run
[WARNING] [11:27:48+0000] 	/usr/local/go/src/testing/testing.go:789 +0x2de
[WARNING] [11:27:48+0000] goroutine 198 [chan send, 26 minutes]:
[WARNING] [11:27:48+0000] testing.tRunner.func1(0xc4202585a0)
[WARNING] [11:27:48+0000] 	/usr/local/go/src/testing/testing.go:741 +0x19b
[WARNING] [11:27:48+0000] testing.tRunner(0xc4202585a0, 0xc4201c53c0)
[WARNING] [11:27:48+0000] 	/usr/local/go/src/testing/testing.go:748 +0xda
[WARNING] [11:27:48+0000] created by testing.(*T).Run
[WARNING] [11:27:48+0000] 	/usr/local/go/src/testing/testing.go:789 +0x2de
[WARNING] [11:27:48+0000] goroutine 199 [chan send, 26 minutes]:
[WARNING] [11:27:48+0000] testing.tRunner.func1(0xc420258690)
[WARNING] [11:27:48+0000] 	/usr/local/go/src/testing/testing.go:741 +0x19b
[WARNING] [11:27:48+0000] testing.tRunner(0xc420258690, 0xc4201c5440)
[WARNING] [11:27:48+0000] 	/usr/local/go/src/testing/testing.go:748 +0xda
[WARNING] [11:27:48+0000] created by testing.(*T).Run
[WARNING] [11:27:48+0000] 	/usr/local/go/src/testing/testing.go:789 +0x2de
[WARNING] [11:27:48+0000] goroutine 200 [chan send, 26 minutes]:
[WARNING] [11:27:48+0000] testing.tRunner.func1(0xc420258780)
[WARNING] [11:27:48+0000] 	/usr/local/go/src/testing/testing.go:741 +0x19b
[WARNING] [11:27:48+0000] testing.tRunner(0xc420258780, 0xc4201c54c0)
[WARNING] [11:27:48+0000] 	/usr/local/go/src/testing/testing.go:748 +0xda
[WARNING] [11:27:48+0000] created by testing.(*T).Run
[WARNING] [11:27:48+0000] 	/usr/local/go/src/testing/testing.go:789 +0x2de
[WARNING] [11:27:48+0000] goroutine 201 [chan send, 26 minutes]:
[WARNING] [11:27:48+0000] testing.tRunner.func1(0xc420258870)
[WARNING] [11:27:48+0000] 	/usr/local/go/src/testing/testing.go:741 +0x19b
[WARNING] [11:27:48+0000] testing.tRunner(0xc420258870, 0xc4201c5540)
[WARNING] [11:27:48+0000] 	/usr/local/go/src/testing/testing.go:748 +0xda
[WARNING] [11:27:48+0000] created by testing.(*T).Run
[WARNING] [11:27:48+0000] 	/usr/local/go/src/testing/testing.go:789 +0x2de
[WARNING] [11:27:48+0000] goroutine 202 [chan send, 26 minutes]:
[WARNING] [11:27:48+0000] testing.tRunner.func1(0xc420258960)
[WARNING] [11:27:48+0000] 	/usr/local/go/src/testing/testing.go:741 +0x19b
[WARNING] [11:27:48+0000] testing.tRunner(0xc420258960, 0xc4201c55c0)
[WARNING] [11:27:48+0000] 	/usr/local/go/src/testing/testing.go:748 +0xda
[WARNING] [11:27:48+0000] created by testing.(*T).Run
[WARNING] [11:27:48+0000] 	/usr/local/go/src/testing/testing.go:789 +0x2de
[WARNING] [11:27:48+0000] goroutine 203 [chan send, 27 minutes]:
[WARNING] [11:27:48+0000] testing.tRunner.func1(0xc420258a50)
[WARNING] [11:27:48+0000] 	/usr/local/go/src/testing/testing.go:741 +0x19b
[WARNING] [11:27:48+0000] testing.tRunner(0xc420258a50, 0xc4201c5640)
[WARNING] [11:27:48+0000] 	/usr/local/go/src/testing/testing.go:748 +0xda
[WARNING] [11:27:48+0000] created by testing.(*T).Run
[WARNING] [11:27:48+0000] 	/usr/local/go/src/testing/testing.go:789 +0x2de
[WARNING] [11:27:48+0000] goroutine 204 [chan send, 27 minutes]:
[WARNING] [11:27:48+0000] testing.tRunner.func1(0xc420258b40)
[WARNING] [11:27:48+0000] 	/usr/local/go/src/testing/testing.go:741 +0x19b
[WARNING] [11:27:48+0000] testing.tRunner(0xc420258b40, 0xc4201c56c0)
[WARNING] [11:27:48+0000] 	/usr/local/go/src/testing/testing.go:748 +0xda
[WARNING] [11:27:48+0000] created by testing.(*T).Run
[WARNING] [11:27:48+0000] 	/usr/local/go/src/testing/testing.go:789 +0x2de
[WARNING] [11:27:48+0000] goroutine 205 [chan send, 27 minutes]:
[WARNING] [11:27:48+0000] testing.tRunner.func1(0xc420258c30)
[WARNING] [11:27:48+0000] 	/usr/local/go/src/testing/testing.go:741 +0x19b
[WARNING] [11:27:48+0000] testing.tRunner(0xc420258c30, 0xc4201c5740)
[WARNING] [11:27:48+0000] 	/usr/local/go/src/testing/testing.go:748 +0xda
[WARNING] [11:27:48+0000] created by testing.(*T).Run
[WARNING] [11:27:48+0000] 	/usr/local/go/src/testing/testing.go:789 +0x2de
[WARNING] [11:27:48+0000] goroutine 206 [chan send, 27 minutes]:
[WARNING] [11:27:48+0000] testing.tRunner.func1(0xc420258d20)
[WARNING] [11:27:48+0000] 	/usr/local/go/src/testing/testing.go:741 +0x19b
[WARNING] [11:27:48+0000] testing.tRunner(0xc420258d20, 0xc4201c57c0)
[WARNING] [11:27:48+0000] 	/usr/local/go/src/testing/testing.go:748 +0xda
[WARNING] [11:27:48+0000] created by testing.(*T).Run
[WARNING] [11:27:48+0000] 	/usr/local/go/src/testing/testing.go:789 +0x2de
[WARNING] [11:27:48+0000] goroutine 207 [chan send, 27 minutes]:
[WARNING] [11:27:48+0000] testing.tRunner.func1(0xc420258e10)
[WARNING] [11:27:48+0000] 	/usr/local/go/src/testing/testing.go:741 +0x19b
[WARNING] [11:27:48+0000] testing.tRunner(0xc420258e10, 0xc4201c5840)
[WARNING] [11:27:48+0000] 	/usr/local/go/src/testing/testing.go:748 +0xda
[WARNING] [11:27:48+0000] created by testing.(*T).Run
[WARNING] [11:27:48+0000] 	/usr/local/go/src/testing/testing.go:789 +0x2de
[WARNING] [11:27:48+0000] goroutine 208 [chan send, 27 minutes]:
[WARNING] [11:27:48+0000] testing.tRunner.func1(0xc420258f00)
[WARNING] [11:27:48+0000] 	/usr/local/go/src/testing/testing.go:741 +0x19b
[WARNING] [11:27:48+0000] testing.tRunner(0xc420258f00, 0xc4201c58c0)
[WARNING] [11:27:48+0000] 	/usr/local/go/src/testing/testing.go:748 +0xda
[WARNING] [11:27:48+0000] created by testing.(*T).Run
[WARNING] [11:27:48+0000] 	/usr/local/go/src/testing/testing.go:789 +0x2de
[WARNING] [11:27:48+0000] goroutine 209 [chan send, 27 minutes]:
[WARNING] [11:27:48+0000] testing.tRunner.func1(0xc420258ff0)
[WARNING] [11:27:48+0000] 	/usr/local/go/src/testing/testing.go:741 +0x19b
[WARNING] [11:27:48+0000] testing.tRunner(0xc420258ff0, 0xc4201c5940)
[WARNING] [11:27:48+0000] 	/usr/local/go/src/testing/testing.go:748 +0xda
[WARNING] [11:27:48+0000] created by testing.(*T).Run
[WARNING] [11:27:48+0000] 	/usr/local/go/src/testing/testing.go:789 +0x2de
[WARNING] [11:27:48+0000] goroutine 210 [chan send, 27 minutes]:
[WARNING] [11:27:48+0000] testing.tRunner.func1(0xc4202590e0)
[WARNING] [11:27:48+0000] 	/usr/local/go/src/testing/testing.go:741 +0x19b
[WARNING] [11:27:48+0000] testing.tRunner(0xc4202590e0, 0xc4201c59c0)
[WARNING] [11:27:48+0000] 	/usr/local/go/src/testing/testing.go:748 +0xda
[WARNING] [11:27:48+0000] created by testing.(*T).Run
[WARNING] [11:27:48+0000] 	/usr/local/go/src/testing/testing.go:789 +0x2de
[WARNING] [11:27:48+0000] goroutine 211 [chan send, 28 minutes]:
[WARNING] [11:27:48+0000] testing.tRunner.func1(0xc4202591d0)
[WARNING] [11:27:48+0000] 	/usr/local/go/src/testing/testing.go:741 +0x19b
[WARNING] [11:27:48+0000] testing.tRunner(0xc4202591d0, 0xc4201c5a40)
[WARNING] [11:27:48+0000] 	/usr/local/go/src/testing/testing.go:748 +0xda
[WARNING] [11:27:48+0000] created by testing.(*T).Run
[WARNING] [11:27:48+0000] 	/usr/local/go/src/testing/testing.go:789 +0x2de
[WARNING] [11:27:48+0000] goroutine 212 [chan send, 27 minutes]:
[WARNING] [11:27:48+0000] testing.tRunner.func1(0xc4202592c0)
[WARNING] [11:27:48+0000] 	/usr/local/go/src/testing/testing.go:741 +0x19b
[WARNING] [11:27:48+0000] testing.tRunner(0xc4202592c0, 0xc4201c5ac0)
[WARNING] [11:27:48+0000] 	/usr/local/go/src/testing/testing.go:748 +0xda
[WARNING] [11:27:48+0000] created by testing.(*T).Run
[WARNING] [11:27:48+0000] 	/usr/local/go/src/testing/testing.go:789 +0x2de
[WARNING] [11:27:48+0000] goroutine 213 [chan send, 28 minutes]:
[WARNING] [11:27:48+0000] testing.tRunner.func1(0xc4202593b0)
[WARNING] [11:27:48+0000] 	/usr/local/go/src/testing/testing.go:741 +0x19b
[WARNING] [11:27:48+0000] testing.tRunner(0xc4202593b0, 0xc4201c5b40)
[WARNING] [11:27:48+0000] 	/usr/local/go/src/testing/testing.go:748 +0xda
[WARNING] [11:27:48+0000] created by testing.(*T).Run
[WARNING] [11:27:48+0000] 	/usr/local/go/src/testing/testing.go:789 +0x2de
[WARNING] [11:27:48+0000] goroutine 214 [chan send, 28 minutes]:
[WARNING] [11:27:48+0000] testing.tRunner.func1(0xc4202594a0)
[WARNING] [11:27:48+0000] 	/usr/local/go/src/testing/testing.go:741 +0x19b
[WARNING] [11:27:48+0000] testing.tRunner(0xc4202594a0, 0xc4201c5bc0)
[WARNING] [11:27:48+0000] 	/usr/local/go/src/testing/testing.go:748 +0xda
[WARNING] [11:27:48+0000] created by testing.(*T).Run
[WARNING] [11:27:48+0000] 	/usr/local/go/src/testing/testing.go:789 +0x2de
[WARNING] [11:27:48+0000] goroutine 215 [chan send, 28 minutes]:
[WARNING] [11:27:48+0000] testing.tRunner.func1(0xc420259590)
[WARNING] [11:27:48+0000] 	/usr/local/go/src/testing/testing.go:741 +0x19b
[WARNING] [11:27:48+0000] testing.tRunner(0xc420259590, 0xc4201c5c40)
[WARNING] [11:27:48+0000] 	/usr/local/go/src/testing/testing.go:748 +0xda
[WARNING] [11:27:48+0000] created by testing.(*T).Run
[WARNING] [11:27:48+0000] 	/usr/local/go/src/testing/testing.go:789 +0x2de
[WARNING] [11:27:48+0000] goroutine 216 [chan send, 28 minutes]:
[WARNING] [11:27:48+0000] testing.tRunner.func1(0xc420259680)
[WARNING] [11:27:48+0000] 	/usr/local/go/src/testing/testing.go:741 +0x19b
[WARNING] [11:27:48+0000] testing.tRunner(0xc420259680, 0xc4201c5cc0)
[WARNING] [11:27:48+0000] 	/usr/local/go/src/testing/testing.go:748 +0xda
[WARNING] [11:27:48+0000] created by testing.(*T).Run
[WARNING] [11:27:48+0000] 	/usr/local/go/src/testing/testing.go:789 +0x2de
[WARNING] [11:27:48+0000] goroutine 217 [chan send, 29 minutes]:
[WARNING] [11:27:48+0000] testing.tRunner.func1(0xc420259770)
[WARNING] [11:27:48+0000] 	/usr/local/go/src/testing/testing.go:741 +0x19b
[WARNING] [11:27:48+0000] testing.tRunner(0xc420259770, 0xc4201c5d40)
[WARNING] [11:27:48+0000] 	/usr/local/go/src/testing/testing.go:748 +0xda
[WARNING] [11:27:48+0000] created by testing.(*T).Run
[WARNING] [11:27:48+0000] 	/usr/local/go/src/testing/testing.go:789 +0x2de
[WARNING] [11:27:48+0000] goroutine 218 [chan send, 29 minutes]:
[WARNING] [11:27:48+0000] testing.tRunner.func1(0xc420259860)
[WARNING] [11:27:48+0000] 	/usr/local/go/src/testing/testing.go:741 +0x19b
[WARNING] [11:27:48+0000] testing.tRunner(0xc420259860, 0xc4201c5dc0)
[WARNING] [11:27:48+0000] 	/usr/local/go/src/testing/testing.go:748 +0xda
[WARNING] [11:27:48+0000] created by testing.(*T).Run
[WARNING] [11:27:48+0000] 	/usr/local/go/src/testing/testing.go:789 +0x2de
[WARNING] [11:27:48+0000] goroutine 219 [chan send, 29 minutes]:
[WARNING] [11:27:48+0000] testing.tRunner.func1(0xc420259950)
[WARNING] [11:27:48+0000] 	/usr/local/go/src/testing/testing.go:741 +0x19b
[WARNING] [11:27:48+0000] testing.tRunner(0xc420259950, 0xc4201c5e40)
[WARNING] [11:27:48+0000] 	/usr/local/go/src/testing/testing.go:748 +0xda
[WARNING] [11:27:48+0000] created by testing.(*T).Run
[WARNING] [11:27:48+0000] 	/usr/local/go/src/testing/testing.go:789 +0x2de
[WARNING] [11:27:48+0000] goroutine 220 [chan send, 29 minutes]:
[WARNING] [11:27:48+0000] testing.tRunner.func1(0xc420259a40)
[WARNING] [11:27:48+0000] 	/usr/local/go/src/testing/testing.go:741 +0x19b
[WARNING] [11:27:48+0000] testing.tRunner(0xc420259a40, 0xc4201c5ec0)
[WARNING] [11:27:48+0000] 	/usr/local/go/src/testing/testing.go:748 +0xda
[WARNING] [11:27:48+0000] created by testing.(*T).Run
[WARNING] [11:27:48+0000] 	/usr/local/go/src/testing/testing.go:789 +0x2de
[WARNING] [11:27:48+0000] goroutine 221 [chan send, 29 minutes]:
[WARNING] [11:27:48+0000] testing.tRunner.func1(0xc420259b30)
[WARNING] [11:27:48+0000] 	/usr/local/go/src/testing/testing.go:741 +0x19b
[WARNING] [11:27:48+0000] testing.tRunner(0xc420259b30, 0xc4201c5f40)
[WARNING] [11:27:48+0000] 	/usr/local/go/src/testing/testing.go:748 +0xda
[WARNING] [11:27:48+0000] created by testing.(*T).Run
[WARNING] [11:27:48+0000] 	/usr/local/go/src/testing/testing.go:789 +0x2de
[WARNING] [11:27:48+0000] goroutine 222 [chan send, 29 minutes]:
[WARNING] [11:27:48+0000] testing.tRunner.func1(0xc420259c20)
[WARNING] [11:27:48+0000] 	/usr/local/go/src/testing/testing.go:741 +0x19b
[WARNING] [11:27:48+0000] testing.tRunner(0xc420259c20, 0xc4201c5fc0)
[WARNING] [11:27:48+0000] 	/usr/local/go/src/testing/testing.go:748 +0xda
[WARNING] [11:27:48+0000] created by testing.(*T).Run
[WARNING] [11:27:48+0000] 	/usr/local/go/src/testing/testing.go:789 +0x2de
[WARNING] [11:27:48+0000] goroutine 223 [chan send, 30 minutes]:
[WARNING] [11:27:48+0000] testing.tRunner.func1(0xc420259d10)
[WARNING] [11:27:48+0000] 	/usr/local/go/src/testing/testing.go:741 +0x19b
[WARNING] [11:27:48+0000] testing.tRunner(0xc420259d10, 0xc420440040)
[WARNING] [11:27:48+0000] 	/usr/local/go/src/testing/testing.go:748 +0xda
[WARNING] [11:27:48+0000] created by testing.(*T).Run
[WARNING] [11:27:48+0000] 	/usr/local/go/src/testing/testing.go:789 +0x2de
[WARNING] [11:27:48+0000] goroutine 224 [chan send, 30 minutes]:
[WARNING] [11:27:48+0000] testing.tRunner.func1(0xc420259e00)
[WARNING] [11:27:48+0000] 	/usr/local/go/src/testing/testing.go:741 +0x19b
[WARNING] [11:27:48+0000] testing.tRunner(0xc420259e00, 0xc4204400c0)
[WARNING] [11:27:48+0000] 	/usr/local/go/src/testing/testing.go:748 +0xda
[WARNING] [11:27:48+0000] created by testing.(*T).Run
[WARNING] [11:27:48+0000] 	/usr/local/go/src/testing/testing.go:789 +0x2de
[WARNING] [11:27:48+0000] goroutine 225 [chan send, 30 minutes]:
[WARNING] [11:27:48+0000] testing.tRunner.func1(0xc420259ef0)
[WARNING] [11:27:48+0000] 	/usr/local/go/src/testing/testing.go:741 +0x19b
[WARNING] [11:27:48+0000] testing.tRunner(0xc420259ef0, 0xc420440140)
[WARNING] [11:27:48+0000] 	/usr/local/go/src/testing/testing.go:748 +0xda
[WARNING] [11:27:48+0000] created by testing.(*T).Run
[WARNING] [11:27:48+0000] 	/usr/local/go/src/testing/testing.go:789 +0x2de
[WARNING] [11:27:48+0000] goroutine 408 [IO wait]:
[WARNING] [11:27:48+0000] internal/poll.runtime_pollWait(0x7fa2bf80ff70, 0x72, 0x1)
[WARNING] [11:27:48+0000] 	/usr/local/go/src/runtime/netpoll.go:173 +0x57
[WARNING] [11:27:48+0000] internal/poll.(*pollDesc).wait(0xc42020c1a8, 0x72, 0xffffffffffffff01, 0x6a6b20, 0x6a51d0)
[WARNING] [11:27:48+0000] 	/usr/local/go/src/internal/poll/fd_poll_runtime.go:85 +0xae
[WARNING] [11:27:48+0000] internal/poll.(*pollDesc).waitRead(0xc42020c1a8, 0xc420720201, 0x3fb9c, 0x3fb9c)
[WARNING] [11:27:48+0000] 	/usr/local/go/src/internal/poll/fd_poll_runtime.go:90 +0x3d
[WARNING] [11:27:48+0000] internal/poll.(*FD).Read(0xc42020c190, 0xc420720264, 0x3fb9c, 0x3fb9c, 0x0, 0x0, 0x0)
[WARNING] [11:27:48+0000] 	/usr/local/go/src/internal/poll/fd_unix.go:125 +0x18a
[WARNING] [11:27:48+0000] os.(*File).read(0xc42023a050, 0xc420720264, 0x3fb9c, 0x3fb9c, 0x168, 0x0, 0x0)
[WARNING] [11:27:48+0000] 	/usr/local/go/src/os/file_unix.go:216 +0x4e
[WARNING] [11:27:48+0000] os.(*File).Read(0xc42023a050, 0xc420720264, 0x3fb9c, 0x3fb9c, 0x168, 0x0, 0x0)
[WARNING] [11:27:48+0000] 	/usr/local/go/src/os/file.go:103 +0x6d
[WARNING] [11:27:48+0000] bytes.(*Buffer).ReadFrom(0xc4200b4150, 0x6a65e0, 0xc42023a050, 0x7fa2bf65fad8, 0xc4200b4150, 0xc42001ad01)
[WARNING] [11:27:48+0000] 	/usr/local/go/src/bytes/buffer.go:209 +0x177
[WARNING] [11:27:48+0000] io.copyBuffer(0x6a63e0, 0xc4200b4150, 0x6a65e0, 0xc42023a050, 0x0, 0x0, 0x0, 0xff, 0xc4201eb740, 0x45c136)
[WARNING] [11:27:48+0000] 	/usr/local/go/src/io/io.go:386 +0x2bb
[WARNING] [11:27:48+0000] io.Copy(0x6a63e0, 0xc4200b4150, 0x6a65e0, 0xc42023a050, 0x31ff6c8700000008, 0x5b02a5ed, 0xc4201eb798)
[WARNING] [11:27:48+0000] 	/usr/local/go/src/io/io.go:362 +0x68
[WARNING] [11:27:48+0000] os/exec.(*Cmd).writerDescriptor.func1(0x4ddc00, 0xc4200baf00)
[WARNING] [11:27:48+0000] 	/usr/local/go/src/os/exec/exec.go:264 +0x4d
[WARNING] [11:27:48+0000] os/exec.(*Cmd).Start.func1(0xc42023e2c0, 0xc42000a160)
[WARNING] [11:27:48+0000] 	/usr/local/go/src/os/exec/exec.go:380 +0x27
[WARNING] [11:27:48+0000] created by os/exec.(*Cmd).Start
[WARNING] [11:27:48+0000] 	/usr/local/go/src/os/exec/exec.go:379 +0x646
[WARNING] [11:27:48+0000] goroutine 390 [IO wait]:
[WARNING] [11:27:48+0000] internal/poll.runtime_pollWait(0x7fa2bf80fdf0, 0x72, 0x1)
[WARNING] [11:27:48+0000] 	/usr/local/go/src/runtime/netpoll.go:173 +0x57
[WARNING] [11:27:48+0000] internal/poll.(*pollDesc).wait(0xc4201c6658, 0x72, 0xffffffffffffff01, 0x6a6b20, 0x6a51d0)
[WARNING] [11:27:48+0000] 	/usr/local/go/src/internal/poll/fd_poll_runtime.go:85 +0xae
[WARNING] [11:27:48+0000] internal/poll.(*pollDesc).waitRead(0xc4201c6658, 0xc4216e0401, 0x3d93a, 0x3d93a)
[WARNING] [11:27:48+0000] 	/usr/local/go/src/internal/poll/fd_poll_runtime.go:90 +0x3d
[WARNING] [11:27:48+0000] internal/poll.(*FD).Read(0xc4201c6640, 0xc4216e04c6, 0x3d93a, 0x3d93a, 0x0, 0x0, 0x0)
[WARNING] [11:27:48+0000] 	/usr/local/go/src/internal/poll/fd_unix.go:125 +0x18a
[WARNING] [11:27:48+0000] os.(*File).read(0xc4228140c0, 0xc4216e04c6, 0x3d93a, 0x3d93a, 0x11e, 0x0, 0x0)
[WARNING] [11:27:48+0000] 	/usr/local/go/src/os/file_unix.go:216 +0x4e
[WARNING] [11:27:48+0000] os.(*File).Read(0xc4228140c0, 0xc4216e04c6, 0x3d93a, 0x3d93a, 0x11e, 0x0, 0x0)
[WARNING] [11:27:48+0000] 	/usr/local/go/src/os/file.go:103 +0x6d
[WARNING] [11:27:48+0000] bytes.(*Buffer).ReadFrom(0xc420a2e230, 0x6a65e0, 0xc4228140c0, 0x7fa2bf65fad8, 0xc420a2e230, 0xc42001ad01)
[WARNING] [11:27:48+0000] 	/usr/local/go/src/bytes/buffer.go:209 +0x177
[WARNING] [11:27:48+0000] io.copyBuffer(0x6a63e0, 0xc420a2e230, 0x6a65e0, 0xc4228140c0, 0x0, 0x0, 0x0, 0xff, 0xc4201ebf40, 0x45c136)
[WARNING] [11:27:48+0000] 	/usr/local/go/src/io/io.go:386 +0x2bb
[WARNING] [11:27:48+0000] io.Copy(0x6a63e0, 0xc420a2e230, 0x6a65e0, 0xc4228140c0, 0x32001a5000000008, 0x5b02a5ed, 0xc4201ebf98)
[WARNING] [11:27:48+0000] 	/usr/local/go/src/io/io.go:362 +0x68
[WARNING] [11:27:48+0000] os/exec.(*Cmd).writerDescriptor.func1(0x4ddc00, 0xc4200bb0e0)
[WARNING] [11:27:48+0000] 	/usr/local/go/src/os/exec/exec.go:264 +0x4d
[WARNING] [11:27:48+0000] os/exec.(*Cmd).Start.func1(0xc4203342c0, 0xc420198200)
[WARNING] [11:27:48+0000] 	/usr/local/go/src/os/exec/exec.go:380 +0x27
[WARNING] [11:27:48+0000] created by os/exec.(*Cmd).Start
[WARNING] [11:27:48+0000] 	/usr/local/go/src/os/exec/exec.go:379 +0x646
[WARNING] [11:27:48+0000] goroutine 391 [IO wait]:
[WARNING] [11:27:48+0000] internal/poll.runtime_pollWait(0x7fa2bf80fc70, 0x72, 0x1)
[WARNING] [11:27:48+0000] 	/usr/local/go/src/runtime/netpoll.go:173 +0x57
[WARNING] [11:27:48+0000] internal/poll.(*pollDesc).wait(0xc4201c6928, 0x72, 0xffffffffffffff01, 0x6a6b20, 0x6a51d0)
[WARNING] [11:27:48+0000] 	/usr/local/go/src/internal/poll/fd_poll_runtime.go:85 +0xae
[WARNING] [11:27:48+0000] internal/poll.(*pollDesc).waitRead(0xc4201c6928, 0xc421760601, 0x3d745, 0x3d745)
[WARNING] [11:27:48+0000] 	/usr/local/go/src/internal/poll/fd_poll_runtime.go:90 +0x3d
[WARNING] [11:27:48+0000] internal/poll.(*FD).Read(0xc4201c6910, 0xc4217606bb, 0x3d745, 0x3d745, 0x0, 0x0, 0x0)
[WARNING] [11:27:48+0000] 	/usr/local/go/src/internal/poll/fd_unix.go:125 +0x18a
[WARNING] [11:27:48+0000] os.(*File).read(0xc422814108, 0xc4217606bb, 0x3d745, 0x3d745, 0x177, 0x0, 0x0)
[WARNING] [11:27:48+0000] 	/usr/local/go/src/os/file_unix.go:216 +0x4e
[WARNING] [11:27:48+0000] os.(*File).Read(0xc422814108, 0xc4217606bb, 0x3d745, 0x3d745, 0x177, 0x0, 0x0)
[WARNING] [11:27:48+0000] 	/usr/local/go/src/os/file.go:103 +0x6d
[WARNING] [11:27:48+0000] bytes.(*Buffer).ReadFrom(0xc420a2e310, 0x6a65e0, 0xc422814108, 0x7fa2bf65fad8, 0xc420a2e310, 0xc42001ad01)
[WARNING] [11:27:48+0000] 	/usr/local/go/src/bytes/buffer.go:209 +0x177
[WARNING] [11:27:48+0000] io.copyBuffer(0x6a63e0, 0xc420a2e310, 0x6a65e0, 0xc422814108, 0x0, 0x0, 0x0, 0xff, 0xc4201e4f40, 0x45c136)
[WARNING] [11:27:48+0000] 	/usr/local/go/src/io/io.go:386 +0x2bb
[WARNING] [11:27:48+0000] io.Copy(0x6a63e0, 0xc420a2e310, 0x6a65e0, 0xc422814108, 0x320081b600000008, 0x5b02a5ed, 0xc4201e4f98)
[WARNING] [11:27:48+0000] 	/usr/local/go/src/io/io.go:362 +0x68
[WARNING] [11:27:48+0000] os/exec.(*Cmd).writerDescriptor.func1(0x4ddc00, 0xc4200bb2c0)
[WARNING] [11:27:48+0000] 	/usr/local/go/src/os/exec/exec.go:264 +0x4d
[WARNING] [11:27:48+0000] os/exec.(*Cmd).Start.func1(0xc420334420, 0xc4201982c0)
[WARNING] [11:27:48+0000] 	/usr/local/go/src/os/exec/exec.go:380 +0x27
[WARNING] [11:27:48+0000] created by os/exec.(*Cmd).Start
[WARNING] [11:27:48+0000] 	/usr/local/go/src/os/exec/exec.go:379 +0x646 
[INFO] [11:27:49+0000] jUnit XML report placed at _output/scripts/test-integration/artifacts/gotest_report_QannM.xml
Of 0 tests executed in 0.000s, 0 succeeded, 0 failed, and 0 were skipped.
[WARNING] [11:27:49+0000] While the jUnit report found no failed tests, the `go test` process failed.
[WARNING] [11:27:49+0000] This usually means that the unit test suite failed to compile.
[ERROR] [11:27:49+0000] hack/test-go.sh exited with code 1 after 00h 31m 04s
[ERROR] [11:27:49+0000] PID 1259: hack/test-integration.sh:18: `COVERAGE_SPEC=" " DETECT_RACES=false TMPDIR="${BASETMPDIR}" TIMEOUT=45m GOTEST_FLAGS="${gotest_flags}" "${OS_ROOT}/hack/test-go.sh" "test/integration/runner"` exited with status 1.
[INFO] [11:27:49+0000] 		Stack Trace: 
[INFO] [11:27:49+0000] 		  1: hack/test-integration.sh:18: `COVERAGE_SPEC=" " DETECT_RACES=false TMPDIR="${BASETMPDIR}" TIMEOUT=45m GOTEST_FLAGS="${gotest_flags}" "${OS_ROOT}/hack/test-go.sh" "test/integration/runner"`
[INFO] [11:27:49+0000]   Exiting with code 1.
make: *** [test-integration] Error 1
[WARNING] [11:27:50+0000] Copying _output/local/releases from the container failed!
[WARNING] [11:27:50+0000] Error response from daemon: lstat /var/lib/docker/overlay2/2acea08da3061ac297355db79f0e8a28a03dc7eea3674c5d44fc03e0fb7571b3/merged/go/src/github.com/openshift/origin/_output/local/releases: no such file or directory
[ERROR] [11:27:50+0000] PID 10822: hack/lib/build/environment.sh:172: `return "${exitcode}"` exited with status 2.
[INFO] [11:27:50+0000] 		Stack Trace: 
[INFO] [11:27:50+0000] 		  1: hack/lib/build/environment.sh:172: `return "${exitcode}"`
[INFO] [11:27:51+0000] 		  2: hack/lib/build/environment.sh:281: os::build::environment::withsource
[INFO] [11:27:51+0000] 		  3: hack/env:42: os::build::environment::run
[INFO] [11:27:51+0000]   Exiting with code 2.
++ export status=FAILURE
++ status=FAILURE
+ set +o xtrace
########## FINISHED STAGE: FAILURE: RUN INTEGRATION TESTS [00h 42m 32s] ##########
Build step 'Execute shell' marked build as failure
[PostBuildScript] - Executing post build scripts.
[workspace@5] $ /bin/bash /tmp/jenkins2931420992312229738.sh
########## STARTING STAGE: DOWNLOAD ARTIFACTS FROM THE REMOTE HOST ##########
+ [[ -s /var/lib/jenkins/jobs/test_pull_request_origin_integration/workspace@5/activate ]]
+ source /var/lib/jenkins/jobs/test_pull_request_origin_integration/workspace@5/activate
++ export VIRTUAL_ENV=/var/lib/jenkins/origin-ci-tool/7a5c5e83c372ad2e6b3b64b3efa16fe2cb37ef83
++ VIRTUAL_ENV=/var/lib/jenkins/origin-ci-tool/7a5c5e83c372ad2e6b3b64b3efa16fe2cb37ef83
++ export PATH=/var/lib/jenkins/origin-ci-tool/7a5c5e83c372ad2e6b3b64b3efa16fe2cb37ef83/bin:/sbin:/usr/sbin:/bin:/usr/bin
++ PATH=/var/lib/jenkins/origin-ci-tool/7a5c5e83c372ad2e6b3b64b3efa16fe2cb37ef83/bin:/sbin:/usr/sbin:/bin:/usr/bin
++ unset PYTHON_HOME
++ export OCT_CONFIG_HOME=/var/lib/jenkins/jobs/test_pull_request_origin_integration/workspace@5/.config
++ OCT_CONFIG_HOME=/var/lib/jenkins/jobs/test_pull_request_origin_integration/workspace@5/.config
+ trap 'exit 0' EXIT
++ pwd
+ ARTIFACT_DIR=/var/lib/jenkins/jobs/test_pull_request_origin_integration/workspace@5/artifacts/gathered
+ rm -rf /var/lib/jenkins/jobs/test_pull_request_origin_integration/workspace@5/artifacts/gathered
+ mkdir -p /var/lib/jenkins/jobs/test_pull_request_origin_integration/workspace@5/artifacts/gathered
+ ssh -F /var/lib/jenkins/jobs/test_pull_request_origin_integration/workspace@5/.config/origin-ci-tool/inventory/.ssh_config openshiftdevel sudo stat /data/src/github.com/openshift/origin/_output/scripts
  File: ‘/data/src/github.com/openshift/origin/_output/scripts’
  Size: 61        	Blocks: 0          IO Block: 4096   directory
Device: ca02h/51714d	Inode: 63256755    Links: 5
Access: (2755/drwxr-sr-x)  Uid: ( 1001/  origin)   Gid: ( 1003/origin-git)
Context: unconfined_u:object_r:container_file_t:s0
Access: 1970-01-01 00:00:00.000000000 +0000
Modify: 2018-05-21 10:46:29.000000000 +0000
Change: 2018-05-21 11:27:50.936876630 +0000
 Birth: -
+ ssh -F /var/lib/jenkins/jobs/test_pull_request_origin_integration/workspace@5/.config/origin-ci-tool/inventory/.ssh_config openshiftdevel sudo chmod -R o+rX /data/src/github.com/openshift/origin/_output/scripts
+ scp -r -F /var/lib/jenkins/jobs/test_pull_request_origin_integration/workspace@5/.config/origin-ci-tool/inventory/.ssh_config openshiftdevel:/data/src/github.com/openshift/origin/_output/scripts /var/lib/jenkins/jobs/test_pull_request_origin_integration/workspace@5/artifacts/gathered
+ tree /var/lib/jenkins/jobs/test_pull_request_origin_integration/workspace@5/artifacts/gathered
/var/lib/jenkins/jobs/test_pull_request_origin_integration/workspace@5/artifacts/gathered
└── scripts
    ├── shell
    │   ├── artifacts
    │   ├── logs
    │   │   ├── 0649fc3e98b5f2281c243dd20b636c494dea3adc95168367476dc4fa6f3ac336.json
    │   │   └── scripts.log
    │   └── openshift.local.home
    ├── test-integration
    │   ├── artifacts
    │   │   ├── gotest_report_QannM
    │   │   └── gotest_report_QannM.xml
    │   ├── logs
    │   │   ├── raw_test_output.log
    │   │   ├── scripts.log
    │   │   └── test-go-err.log
    │   └── openshift.local.home
    └── test-tools
        ├── artifacts
        ├── logs
        │   ├── raw_test_output.log
        │   └── scripts.log
        └── openshift.local.home

13 directories, 9 files
+ exit 0
[workspace@5] $ /bin/bash /tmp/jenkins7883475124177269727.sh
########## STARTING STAGE: GENERATE ARTIFACTS FROM THE REMOTE HOST ##########
+ [[ -s /var/lib/jenkins/jobs/test_pull_request_origin_integration/workspace@5/activate ]]
+ source /var/lib/jenkins/jobs/test_pull_request_origin_integration/workspace@5/activate
++ export VIRTUAL_ENV=/var/lib/jenkins/origin-ci-tool/7a5c5e83c372ad2e6b3b64b3efa16fe2cb37ef83
++ VIRTUAL_ENV=/var/lib/jenkins/origin-ci-tool/7a5c5e83c372ad2e6b3b64b3efa16fe2cb37ef83
++ export PATH=/var/lib/jenkins/origin-ci-tool/7a5c5e83c372ad2e6b3b64b3efa16fe2cb37ef83/bin:/sbin:/usr/sbin:/bin:/usr/bin
++ PATH=/var/lib/jenkins/origin-ci-tool/7a5c5e83c372ad2e6b3b64b3efa16fe2cb37ef83/bin:/sbin:/usr/sbin:/bin:/usr/bin
++ unset PYTHON_HOME
++ export OCT_CONFIG_HOME=/var/lib/jenkins/jobs/test_pull_request_origin_integration/workspace@5/.config
++ OCT_CONFIG_HOME=/var/lib/jenkins/jobs/test_pull_request_origin_integration/workspace@5/.config
+ trap 'exit 0' EXIT
++ pwd
+ ARTIFACT_DIR=/var/lib/jenkins/jobs/test_pull_request_origin_integration/workspace@5/artifacts/generated
+ rm -rf /var/lib/jenkins/jobs/test_pull_request_origin_integration/workspace@5/artifacts/generated
+ mkdir /var/lib/jenkins/jobs/test_pull_request_origin_integration/workspace@5/artifacts/generated
+ ssh -F /var/lib/jenkins/jobs/test_pull_request_origin_integration/workspace@5/.config/origin-ci-tool/inventory/.ssh_config openshiftdevel 'sudo docker version && sudo docker info && sudo docker images && sudo docker ps -a 2>&1'
  WARNING: You're not using the default seccomp profile
+ ssh -F /var/lib/jenkins/jobs/test_pull_request_origin_integration/workspace@5/.config/origin-ci-tool/inventory/.ssh_config openshiftdevel 'sudo cat /etc/sysconfig/docker /etc/sysconfig/docker-network /etc/sysconfig/docker-storage /etc/sysconfig/docker-storage-setup /etc/systemd/system/docker.service 2>&1'
+ true
+ ssh -F /var/lib/jenkins/jobs/test_pull_request_origin_integration/workspace@5/.config/origin-ci-tool/inventory/.ssh_config openshiftdevel 'sudo find /var/lib/docker/containers -name *.log | sudo xargs tail -vn +1 2>&1'
+ ssh -F /var/lib/jenkins/jobs/test_pull_request_origin_integration/workspace@5/.config/origin-ci-tool/inventory/.ssh_config openshiftdevel 'oc get --raw /metrics --server=https://$( uname --nodename ):10250 --config=/etc/origin/master/admin.kubeconfig 2>&1'
+ true
+ ssh -F /var/lib/jenkins/jobs/test_pull_request_origin_integration/workspace@5/.config/origin-ci-tool/inventory/.ssh_config openshiftdevel 'sudo ausearch -m AVC -m SELINUX_ERR -m USER_AVC 2>&1'
+ true
+ ssh -F /var/lib/jenkins/jobs/test_pull_request_origin_integration/workspace@5/.config/origin-ci-tool/inventory/.ssh_config openshiftdevel 'oc get --raw /metrics --config=/etc/origin/master/admin.kubeconfig 2>&1'
+ true
+ ssh -F /var/lib/jenkins/jobs/test_pull_request_origin_integration/workspace@5/.config/origin-ci-tool/inventory/.ssh_config openshiftdevel 'sudo df -T -h && sudo pvs && sudo vgs && sudo lvs && sudo findmnt --all 2>&1'
+ ssh -F /var/lib/jenkins/jobs/test_pull_request_origin_integration/workspace@5/.config/origin-ci-tool/inventory/.ssh_config openshiftdevel 'sudo yum list installed 2>&1'
+ ssh -F /var/lib/jenkins/jobs/test_pull_request_origin_integration/workspace@5/.config/origin-ci-tool/inventory/.ssh_config openshiftdevel 'sudo journalctl --dmesg --no-pager --all --lines=all 2>&1'
+ ssh -F /var/lib/jenkins/jobs/test_pull_request_origin_integration/workspace@5/.config/origin-ci-tool/inventory/.ssh_config openshiftdevel 'sudo journalctl _PID=1 --no-pager --all --lines=all 2>&1'
+ tree /var/lib/jenkins/jobs/test_pull_request_origin_integration/workspace@5/artifacts/generated
/var/lib/jenkins/jobs/test_pull_request_origin_integration/workspace@5/artifacts/generated
├── avc_denials.log
├── containers.log
├── dmesg.log
├── docker.config
├── docker.info
├── filesystem.info
├── installed_packages.log
├── master-metrics.log
├── node-metrics.log
└── pid1.journal

0 directories, 10 files
+ exit 0
[workspace@5] $ /bin/bash /tmp/jenkins3873851483535313930.sh
########## STARTING STAGE: FETCH SYSTEMD JOURNALS FROM THE REMOTE HOST ##########
+ [[ -s /var/lib/jenkins/jobs/test_pull_request_origin_integration/workspace@5/activate ]]
+ source /var/lib/jenkins/jobs/test_pull_request_origin_integration/workspace@5/activate
++ export VIRTUAL_ENV=/var/lib/jenkins/origin-ci-tool/7a5c5e83c372ad2e6b3b64b3efa16fe2cb37ef83
++ VIRTUAL_ENV=/var/lib/jenkins/origin-ci-tool/7a5c5e83c372ad2e6b3b64b3efa16fe2cb37ef83
++ export PATH=/var/lib/jenkins/origin-ci-tool/7a5c5e83c372ad2e6b3b64b3efa16fe2cb37ef83/bin:/sbin:/usr/sbin:/bin:/usr/bin
++ PATH=/var/lib/jenkins/origin-ci-tool/7a5c5e83c372ad2e6b3b64b3efa16fe2cb37ef83/bin:/sbin:/usr/sbin:/bin:/usr/bin
++ unset PYTHON_HOME
++ export OCT_CONFIG_HOME=/var/lib/jenkins/jobs/test_pull_request_origin_integration/workspace@5/.config
++ OCT_CONFIG_HOME=/var/lib/jenkins/jobs/test_pull_request_origin_integration/workspace@5/.config
+ trap 'exit 0' EXIT
++ pwd
+ ARTIFACT_DIR=/var/lib/jenkins/jobs/test_pull_request_origin_integration/workspace@5/artifacts/journals
+ rm -rf /var/lib/jenkins/jobs/test_pull_request_origin_integration/workspace@5/artifacts/journals
+ mkdir /var/lib/jenkins/jobs/test_pull_request_origin_integration/workspace@5/artifacts/journals
+ ssh -F /var/lib/jenkins/jobs/test_pull_request_origin_integration/workspace@5/.config/origin-ci-tool/inventory/.ssh_config openshiftdevel sudo journalctl --unit docker.service --no-pager --all --lines=all
+ ssh -F /var/lib/jenkins/jobs/test_pull_request_origin_integration/workspace@5/.config/origin-ci-tool/inventory/.ssh_config openshiftdevel sudo journalctl --unit dnsmasq.service --no-pager --all --lines=all
+ ssh -F /var/lib/jenkins/jobs/test_pull_request_origin_integration/workspace@5/.config/origin-ci-tool/inventory/.ssh_config openshiftdevel sudo journalctl --unit systemd-journald.service --no-pager --all --lines=all
+ tree /var/lib/jenkins/jobs/test_pull_request_origin_integration/workspace@5/artifacts/journals
/var/lib/jenkins/jobs/test_pull_request_origin_integration/workspace@5/artifacts/journals
├── dnsmasq.service
├── docker.service
└── systemd-journald.service

0 directories, 3 files
+ exit 0
[workspace@5] $ /bin/bash /tmp/jenkins444859454891508533.sh
########## STARTING STAGE: ASSEMBLE GCS OUTPUT ##########
+ [[ -s /var/lib/jenkins/jobs/test_pull_request_origin_integration/workspace@5/activate ]]
+ source /var/lib/jenkins/jobs/test_pull_request_origin_integration/workspace@5/activate
++ export VIRTUAL_ENV=/var/lib/jenkins/origin-ci-tool/7a5c5e83c372ad2e6b3b64b3efa16fe2cb37ef83
++ VIRTUAL_ENV=/var/lib/jenkins/origin-ci-tool/7a5c5e83c372ad2e6b3b64b3efa16fe2cb37ef83
++ export PATH=/var/lib/jenkins/origin-ci-tool/7a5c5e83c372ad2e6b3b64b3efa16fe2cb37ef83/bin:/sbin:/usr/sbin:/bin:/usr/bin
++ PATH=/var/lib/jenkins/origin-ci-tool/7a5c5e83c372ad2e6b3b64b3efa16fe2cb37ef83/bin:/sbin:/usr/sbin:/bin:/usr/bin
++ unset PYTHON_HOME
++ export OCT_CONFIG_HOME=/var/lib/jenkins/jobs/test_pull_request_origin_integration/workspace@5/.config
++ OCT_CONFIG_HOME=/var/lib/jenkins/jobs/test_pull_request_origin_integration/workspace@5/.config
+ trap 'exit 0' EXIT
+ mkdir -p gcs/artifacts gcs/artifacts/generated gcs/artifacts/journals gcs/artifacts/gathered
++ python -c 'import json; import urllib; print json.load(urllib.urlopen('\''https://ci.openshift.redhat.com/jenkins/job/test_pull_request_origin_integration/17977/api/json'\''))['\''result'\'']'
+ result=FAILURE
+ cat
++ date +%s
+ cat /var/lib/jenkins/jobs/test_pull_request_origin_integration/builds/17977/log
+ cp artifacts/generated/avc_denials.log artifacts/generated/containers.log artifacts/generated/dmesg.log artifacts/generated/docker.config artifacts/generated/docker.info artifacts/generated/filesystem.info artifacts/generated/installed_packages.log artifacts/generated/master-metrics.log artifacts/generated/node-metrics.log artifacts/generated/pid1.journal gcs/artifacts/generated/
+ cp artifacts/journals/dnsmasq.service artifacts/journals/docker.service artifacts/journals/systemd-journald.service gcs/artifacts/journals/
+ cp -r artifacts/gathered/scripts gcs/artifacts/
++ pwd
+ scp -F /var/lib/jenkins/jobs/test_pull_request_origin_integration/workspace@5/.config/origin-ci-tool/inventory/.ssh_config -r /var/lib/jenkins/jobs/test_pull_request_origin_integration/workspace@5/gcs openshiftdevel:/data
+ scp -F /var/lib/jenkins/jobs/test_pull_request_origin_integration/workspace@5/.config/origin-ci-tool/inventory/.ssh_config /var/lib/jenkins/.config/gcloud/gcs-publisher-credentials.json openshiftdevel:/data/credentials.json
+ exit 0
[workspace@5] $ /bin/bash /tmp/jenkins3770844043526317337.sh
########## STARTING STAGE: PUSH THE ARTIFACTS AND METADATA ##########
+ [[ -s /var/lib/jenkins/jobs/test_pull_request_origin_integration/workspace@5/activate ]]
+ source /var/lib/jenkins/jobs/test_pull_request_origin_integration/workspace@5/activate
++ export VIRTUAL_ENV=/var/lib/jenkins/origin-ci-tool/7a5c5e83c372ad2e6b3b64b3efa16fe2cb37ef83
++ VIRTUAL_ENV=/var/lib/jenkins/origin-ci-tool/7a5c5e83c372ad2e6b3b64b3efa16fe2cb37ef83
++ export PATH=/var/lib/jenkins/origin-ci-tool/7a5c5e83c372ad2e6b3b64b3efa16fe2cb37ef83/bin:/sbin:/usr/sbin:/bin:/usr/bin
++ PATH=/var/lib/jenkins/origin-ci-tool/7a5c5e83c372ad2e6b3b64b3efa16fe2cb37ef83/bin:/sbin:/usr/sbin:/bin:/usr/bin
++ unset PYTHON_HOME
++ export OCT_CONFIG_HOME=/var/lib/jenkins/jobs/test_pull_request_origin_integration/workspace@5/.config
++ OCT_CONFIG_HOME=/var/lib/jenkins/jobs/test_pull_request_origin_integration/workspace@5/.config
++ mktemp
+ script=/tmp/tmp.Yw6FeK6BW9
+ cat
+ chmod +x /tmp/tmp.Yw6FeK6BW9
+ scp -F /var/lib/jenkins/jobs/test_pull_request_origin_integration/workspace@5/.config/origin-ci-tool/inventory/.ssh_config /tmp/tmp.Yw6FeK6BW9 openshiftdevel:/tmp/tmp.Yw6FeK6BW9
+ ssh -F /var/lib/jenkins/jobs/test_pull_request_origin_integration/workspace@5/.config/origin-ci-tool/inventory/.ssh_config -t openshiftdevel 'bash -l -c "timeout 300 /tmp/tmp.Yw6FeK6BW9"'
+ cd /home/origin
+ trap 'exit 0' EXIT
+ [[ -n {"type":"presubmit","job":"test_pull_request_origin_integration","buildid":"7ae499df-5ce3-11e8-ae4a-0a58ac100556","refs":{"org":"openshift","repo":"origin","base_ref":"master","base_sha":"23a04201b84307588e1d527b09c82714d9cbf788","pulls":[{"number":19759,"author":"wozniakjan","sha":"52a7a2ecfa0eafb15ee12c68bed009eb4ffb77b5"}]}} ]]
++ jq --compact-output .buildid
Using BUILD_NUMBER
+ [[ "7ae499df-5ce3-11e8-ae4a-0a58ac100556" =~ ^"[0-9]+"$ ]]
+ echo 'Using BUILD_NUMBER'
++ jq --compact-output '.buildid |= "17977"'
+ JOB_SPEC='{"type":"presubmit","job":"test_pull_request_origin_integration","buildid":"17977","refs":{"org":"openshift","repo":"origin","base_ref":"master","base_sha":"23a04201b84307588e1d527b09c82714d9cbf788","pulls":[{"number":19759,"author":"wozniakjan","sha":"52a7a2ecfa0eafb15ee12c68bed009eb4ffb77b5"}]}}'
+ docker run -e 'JOB_SPEC={"type":"presubmit","job":"test_pull_request_origin_integration","buildid":"17977","refs":{"org":"openshift","repo":"origin","base_ref":"master","base_sha":"23a04201b84307588e1d527b09c82714d9cbf788","pulls":[{"number":19759,"author":"wozniakjan","sha":"52a7a2ecfa0eafb15ee12c68bed009eb4ffb77b5"}]}}' -v /data:/data:z registry.svc.ci.openshift.org/ci/gcsupload:latest --dry-run=false --gcs-path=gs://origin-ci-test --gcs-credentials-file=/data/credentials.json --path-strategy=single --default-org=openshift --default-repo=origin /data/gcs/artifacts /data/gcs/build-log.txt /data/gcs/finished.json
Unable to find image 'registry.svc.ci.openshift.org/ci/gcsupload:latest' locally
Trying to pull repository registry.svc.ci.openshift.org/ci/gcsupload ... 
latest: Pulling from registry.svc.ci.openshift.org/ci/gcsupload
6d987f6f4279: Already exists
4cccebe844ee: Already exists
cafcba51f636: Pulling fs layer
cafcba51f636: Verifying Checksum
cafcba51f636: Download complete
cafcba51f636: Pull complete
Digest: sha256:c452798b56e3f4649c557c3ff7273126042065e3be152689a1ffb880638e617d
Status: Downloaded newer image for registry.svc.ci.openshift.org/ci/gcsupload:latest
{"component":"gcsupload","level":"info","msg":"Gathering artifacts from artifact directory: /data/gcs/artifacts","time":"2018-05-21T11:28:14Z"}
{"component":"gcsupload","level":"info","msg":"Found /data/gcs/artifacts/generated/avc_denials.log in artifact directory. Uploading as artifacts/generated/avc_denials.log\n","time":"2018-05-21T11:28:14Z"}
{"component":"gcsupload","level":"info","msg":"Found /data/gcs/artifacts/generated/containers.log in artifact directory. Uploading as artifacts/generated/containers.log\n","time":"2018-05-21T11:28:14Z"}
{"component":"gcsupload","level":"info","msg":"Found /data/gcs/artifacts/generated/dmesg.log in artifact directory. Uploading as artifacts/generated/dmesg.log\n","time":"2018-05-21T11:28:14Z"}
{"component":"gcsupload","level":"info","msg":"Found /data/gcs/artifacts/generated/docker.config in artifact directory. Uploading as artifacts/generated/docker.config\n","time":"2018-05-21T11:28:14Z"}
{"component":"gcsupload","level":"info","msg":"Found /data/gcs/artifacts/generated/docker.info in artifact directory. Uploading as artifacts/generated/docker.info\n","time":"2018-05-21T11:28:14Z"}
{"component":"gcsupload","level":"info","msg":"Found /data/gcs/artifacts/generated/filesystem.info in artifact directory. Uploading as artifacts/generated/filesystem.info\n","time":"2018-05-21T11:28:14Z"}
{"component":"gcsupload","level":"info","msg":"Found /data/gcs/artifacts/generated/installed_packages.log in artifact directory. Uploading as artifacts/generated/installed_packages.log\n","time":"2018-05-21T11:28:14Z"}
{"component":"gcsupload","level":"info","msg":"Found /data/gcs/artifacts/generated/master-metrics.log in artifact directory. Uploading as artifacts/generated/master-metrics.log\n","time":"2018-05-21T11:28:14Z"}
{"component":"gcsupload","level":"info","msg":"Found /data/gcs/artifacts/generated/node-metrics.log in artifact directory. Uploading as artifacts/generated/node-metrics.log\n","time":"2018-05-21T11:28:14Z"}
{"component":"gcsupload","level":"info","msg":"Found /data/gcs/artifacts/generated/pid1.journal in artifact directory. Uploading as artifacts/generated/pid1.journal\n","time":"2018-05-21T11:28:14Z"}
{"component":"gcsupload","level":"info","msg":"Found /data/gcs/artifacts/journals/dnsmasq.service in artifact directory. Uploading as artifacts/journals/dnsmasq.service\n","time":"2018-05-21T11:28:14Z"}
{"component":"gcsupload","level":"info","msg":"Found /data/gcs/artifacts/journals/docker.service in artifact directory. Uploading as artifacts/journals/docker.service\n","time":"2018-05-21T11:28:14Z"}
{"component":"gcsupload","level":"info","msg":"Found /data/gcs/artifacts/journals/systemd-journald.service in artifact directory. Uploading as artifacts/journals/systemd-journald.service\n","time":"2018-05-21T11:28:14Z"}
{"component":"gcsupload","level":"info","msg":"Found /data/gcs/artifacts/scripts/shell/logs/0649fc3e98b5f2281c243dd20b636c494dea3adc95168367476dc4fa6f3ac336.json in artifact directory. Uploading as artifacts/scripts/shell/logs/0649fc3e98b5f2281c243dd20b636c494dea3adc95168367476dc4fa6f3ac336.json\n","time":"2018-05-21T11:28:14Z"}
{"component":"gcsupload","level":"info","msg":"Found /data/gcs/artifacts/scripts/shell/logs/scripts.log in artifact directory. Uploading as artifacts/scripts/shell/logs/scripts.log\n","time":"2018-05-21T11:28:14Z"}
{"component":"gcsupload","level":"info","msg":"Found /data/gcs/artifacts/scripts/test-integration/artifacts/gotest_report_QannM in artifact directory. Uploading as artifacts/scripts/test-integration/artifacts/gotest_report_QannM\n","time":"2018-05-21T11:28:14Z"}
{"component":"gcsupload","level":"info","msg":"Found /data/gcs/artifacts/scripts/test-integration/artifacts/gotest_report_QannM.xml in artifact directory. Uploading as artifacts/scripts/test-integration/artifacts/gotest_report_QannM.xml\n","time":"2018-05-21T11:28:14Z"}
{"component":"gcsupload","level":"info","msg":"Found /data/gcs/artifacts/scripts/test-integration/logs/raw_test_output.log in artifact directory. Uploading as artifacts/scripts/test-integration/logs/raw_test_output.log\n","time":"2018-05-21T11:28:14Z"}
{"component":"gcsupload","level":"info","msg":"Found /data/gcs/artifacts/scripts/test-integration/logs/scripts.log in artifact directory. Uploading as artifacts/scripts/test-integration/logs/scripts.log\n","time":"2018-05-21T11:28:14Z"}
{"component":"gcsupload","level":"info","msg":"Found /data/gcs/artifacts/scripts/test-integration/logs/test-go-err.log in artifact directory. Uploading as artifacts/scripts/test-integration/logs/test-go-err.log\n","time":"2018-05-21T11:28:14Z"}
{"component":"gcsupload","level":"info","msg":"Found /data/gcs/artifacts/scripts/test-tools/logs/raw_test_output.log in artifact directory. Uploading as artifacts/scripts/test-tools/logs/raw_test_output.log\n","time":"2018-05-21T11:28:14Z"}
{"component":"gcsupload","level":"info","msg":"Found /data/gcs/artifacts/scripts/test-tools/logs/scripts.log in artifact directory. Uploading as artifacts/scripts/test-tools/logs/scripts.log\n","time":"2018-05-21T11:28:14Z"}
{"component":"gcsupload","dest":"pr-logs/pull/19759/test_pull_request_origin_integration/17977/artifacts/scripts/shell/logs/0649fc3e98b5f2281c243dd20b636c494dea3adc95168367476dc4fa6f3ac336.json","level":"info","msg":"Queued for upload","time":"2018-05-21T11:28:14Z"}
{"component":"gcsupload","dest":"pr-logs/pull/19759/test_pull_request_origin_integration/17977/artifacts/scripts/test-integration/logs/scripts.log","level":"info","msg":"Queued for upload","time":"2018-05-21T11:28:14Z"}
{"component":"gcsupload","dest":"pr-logs/directory/test_pull_request_origin_integration/17977.txt","level":"info","msg":"Queued for upload","time":"2018-05-21T11:28:14Z"}
{"component":"gcsupload","dest":"pr-logs/directory/test_pull_request_origin_integration/latest-build.txt","level":"info","msg":"Queued for upload","time":"2018-05-21T11:28:14Z"}
{"component":"gcsupload","dest":"pr-logs/pull/19759/test_pull_request_origin_integration/17977/artifacts/generated/master-metrics.log","level":"info","msg":"Queued for upload","time":"2018-05-21T11:28:14Z"}
{"component":"gcsupload","dest":"pr-logs/pull/19759/test_pull_request_origin_integration/17977/artifacts/journals/systemd-journald.service","level":"info","msg":"Queued for upload","time":"2018-05-21T11:28:14Z"}
{"component":"gcsupload","dest":"pr-logs/pull/19759/test_pull_request_origin_integration/17977/artifacts/generated/filesystem.info","level":"info","msg":"Queued for upload","time":"2018-05-21T11:28:14Z"}
{"component":"gcsupload","dest":"pr-logs/pull/19759/test_pull_request_origin_integration/17977/artifacts/journals/dnsmasq.service","level":"info","msg":"Queued for upload","time":"2018-05-21T11:28:14Z"}
{"component":"gcsupload","dest":"pr-logs/pull/19759/test_pull_request_origin_integration/17977/artifacts/scripts/test-tools/logs/scripts.log","level":"info","msg":"Queued for upload","time":"2018-05-21T11:28:14Z"}
{"component":"gcsupload","dest":"pr-logs/pull/19759/test_pull_request_origin_integration/latest-build.txt","level":"info","msg":"Queued for upload","time":"2018-05-21T11:28:14Z"}
{"component":"gcsupload","dest":"pr-logs/pull/19759/test_pull_request_origin_integration/17977/artifacts/generated/docker.config","level":"info","msg":"Queued for upload","time":"2018-05-21T11:28:14Z"}
{"component":"gcsupload","dest":"pr-logs/pull/19759/test_pull_request_origin_integration/17977/artifacts/scripts/shell/logs/scripts.log","level":"info","msg":"Queued for upload","time":"2018-05-21T11:28:14Z"}
{"component":"gcsupload","dest":"pr-logs/pull/19759/test_pull_request_origin_integration/17977/artifacts/scripts/test-integration/artifacts/gotest_report_QannM.xml","level":"info","msg":"Queued for upload","time":"2018-05-21T11:28:14Z"}
{"component":"gcsupload","dest":"pr-logs/pull/19759/test_pull_request_origin_integration/17977/artifacts/generated/avc_denials.log","level":"info","msg":"Queued for upload","time":"2018-05-21T11:28:14Z"}
{"component":"gcsupload","dest":"pr-logs/pull/19759/test_pull_request_origin_integration/17977/artifacts/generated/docker.info","level":"info","msg":"Queued for upload","time":"2018-05-21T11:28:14Z"}
{"component":"gcsupload","dest":"pr-logs/pull/19759/test_pull_request_origin_integration/17977/artifacts/generated/pid1.journal","level":"info","msg":"Queued for upload","time":"2018-05-21T11:28:14Z"}
{"component":"gcsupload","dest":"pr-logs/pull/19759/test_pull_request_origin_integration/17977/artifacts/scripts/test-integration/artifacts/gotest_report_QannM","level":"info","msg":"Queued for upload","time":"2018-05-21T11:28:14Z"}
{"component":"gcsupload","dest":"pr-logs/pull/19759/test_pull_request_origin_integration/17977/artifacts/generated/containers.log","level":"info","msg":"Queued for upload","time":"2018-05-21T11:28:14Z"}
{"component":"gcsupload","dest":"pr-logs/pull/19759/test_pull_request_origin_integration/17977/artifacts/generated/dmesg.log","level":"info","msg":"Queued for upload","time":"2018-05-21T11:28:14Z"}
{"component":"gcsupload","dest":"pr-logs/pull/19759/test_pull_request_origin_integration/17977/artifacts/generated/node-metrics.log","level":"info","msg":"Queued for upload","time":"2018-05-21T11:28:14Z"}
{"component":"gcsupload","dest":"pr-logs/pull/19759/test_pull_request_origin_integration/17977/finished.json","level":"info","msg":"Queued for upload","time":"2018-05-21T11:28:14Z"}
{"component":"gcsupload","dest":"pr-logs/pull/19759/test_pull_request_origin_integration/17977/artifacts/generated/installed_packages.log","level":"info","msg":"Queued for upload","time":"2018-05-21T11:28:14Z"}
{"component":"gcsupload","dest":"pr-logs/pull/19759/test_pull_request_origin_integration/17977/artifacts/scripts/test-integration/logs/test-go-err.log","level":"info","msg":"Queued for upload","time":"2018-05-21T11:28:14Z"}
{"component":"gcsupload","dest":"pr-logs/pull/19759/test_pull_request_origin_integration/17977/artifacts/scripts/test-tools/logs/raw_test_output.log","level":"info","msg":"Queued for upload","time":"2018-05-21T11:28:14Z"}
{"component":"gcsupload","dest":"pr-logs/pull/19759/test_pull_request_origin_integration/17977/build-log.txt","level":"info","msg":"Queued for upload","time":"2018-05-21T11:28:14Z"}
{"component":"gcsupload","dest":"pr-logs/pull/19759/test_pull_request_origin_integration/17977/artifacts/journals/docker.service","level":"info","msg":"Queued for upload","time":"2018-05-21T11:28:14Z"}
{"component":"gcsupload","dest":"pr-logs/pull/19759/test_pull_request_origin_integration/17977/artifacts/scripts/test-integration/logs/raw_test_output.log","level":"info","msg":"Queued for upload","time":"2018-05-21T11:28:14Z"}
{"component":"gcsupload","dest":"pr-logs/pull/19759/test_pull_request_origin_integration/17977/artifacts/generated/docker.info","level":"info","msg":"Finished upload","time":"2018-05-21T11:28:15Z"}
{"component":"gcsupload","dest":"pr-logs/pull/19759/test_pull_request_origin_integration/17977/artifacts/scripts/test-tools/logs/raw_test_output.log","level":"info","msg":"Finished upload","time":"2018-05-21T11:28:15Z"}
{"component":"gcsupload","dest":"pr-logs/pull/19759/test_pull_request_origin_integration/17977/artifacts/generated/master-metrics.log","level":"info","msg":"Finished upload","time":"2018-05-21T11:28:15Z"}
{"component":"gcsupload","dest":"pr-logs/pull/19759/test_pull_request_origin_integration/17977/artifacts/journals/docker.service","level":"info","msg":"Finished upload","time":"2018-05-21T11:28:15Z"}
{"component":"gcsupload","dest":"pr-logs/pull/19759/test_pull_request_origin_integration/17977/artifacts/scripts/test-tools/logs/scripts.log","level":"info","msg":"Finished upload","time":"2018-05-21T11:28:15Z"}
{"component":"gcsupload","dest":"pr-logs/pull/19759/test_pull_request_origin_integration/17977/finished.json","level":"info","msg":"Finished upload","time":"2018-05-21T11:28:15Z"}
{"component":"gcsupload","dest":"pr-logs/pull/19759/test_pull_request_origin_integration/17977/artifacts/scripts/test-integration/artifacts/gotest_report_QannM","level":"info","msg":"Finished upload","time":"2018-05-21T11:28:15Z"}
{"component":"gcsupload","dest":"pr-logs/pull/19759/test_pull_request_origin_integration/17977/artifacts/generated/filesystem.info","level":"info","msg":"Finished upload","time":"2018-05-21T11:28:15Z"}
{"component":"gcsupload","dest":"pr-logs/pull/19759/test_pull_request_origin_integration/17977/artifacts/generated/node-metrics.log","level":"info","msg":"Finished upload","time":"2018-05-21T11:28:15Z"}
{"component":"gcsupload","dest":"pr-logs/pull/19759/test_pull_request_origin_integration/17977/artifacts/generated/docker.config","level":"info","msg":"Finished upload","time":"2018-05-21T11:28:15Z"}
{"component":"gcsupload","dest":"pr-logs/pull/19759/test_pull_request_origin_integration/17977/artifacts/generated/installed_packages.log","level":"info","msg":"Finished upload","time":"2018-05-21T11:28:15Z"}
{"component":"gcsupload","dest":"pr-logs/pull/19759/test_pull_request_origin_integration/17977/artifacts/scripts/test-integration/artifacts/gotest_report_QannM.xml","level":"info","msg":"Finished upload","time":"2018-05-21T11:28:15Z"}
{"component":"gcsupload","dest":"pr-logs/pull/19759/test_pull_request_origin_integration/17977/build-log.txt","level":"info","msg":"Finished upload","time":"2018-05-21T11:28:15Z"}
{"component":"gcsupload","dest":"pr-logs/directory/test_pull_request_origin_integration/latest-build.txt","level":"info","msg":"Finished upload","time":"2018-05-21T11:28:15Z"}
{"component":"gcsupload","dest":"pr-logs/pull/19759/test_pull_request_origin_integration/latest-build.txt","level":"info","msg":"Finished upload","time":"2018-05-21T11:28:15Z"}
{"component":"gcsupload","dest":"pr-logs/pull/19759/test_pull_request_origin_integration/17977/artifacts/scripts/shell/logs/0649fc3e98b5f2281c243dd20b636c494dea3adc95168367476dc4fa6f3ac336.json","level":"info","msg":"Finished upload","time":"2018-05-21T11:28:15Z"}
{"component":"gcsupload","dest":"pr-logs/pull/19759/test_pull_request_origin_integration/17977/artifacts/journals/systemd-journald.service","level":"info","msg":"Finished upload","time":"2018-05-21T11:28:15Z"}
{"component":"gcsupload","dest":"pr-logs/pull/19759/test_pull_request_origin_integration/17977/artifacts/scripts/shell/logs/scripts.log","level":"info","msg":"Finished upload","time":"2018-05-21T11:28:15Z"}
{"component":"gcsupload","dest":"pr-logs/pull/19759/test_pull_request_origin_integration/17977/artifacts/generated/avc_denials.log","level":"info","msg":"Finished upload","time":"2018-05-21T11:28:15Z"}
{"component":"gcsupload","dest":"pr-logs/pull/19759/test_pull_request_origin_integration/17977/artifacts/generated/containers.log","level":"info","msg":"Finished upload","time":"2018-05-21T11:28:15Z"}
{"component":"gcsupload","dest":"pr-logs/directory/test_pull_request_origin_integration/17977.txt","level":"info","msg":"Finished upload","time":"2018-05-21T11:28:15Z"}
{"component":"gcsupload","dest":"pr-logs/pull/19759/test_pull_request_origin_integration/17977/artifacts/generated/dmesg.log","level":"info","msg":"Finished upload","time":"2018-05-21T11:28:15Z"}
{"component":"gcsupload","dest":"pr-logs/pull/19759/test_pull_request_origin_integration/17977/artifacts/journals/dnsmasq.service","level":"info","msg":"Finished upload","time":"2018-05-21T11:28:15Z"}
{"component":"gcsupload","dest":"pr-logs/pull/19759/test_pull_request_origin_integration/17977/artifacts/generated/pid1.journal","level":"info","msg":"Finished upload","time":"2018-05-21T11:28:15Z"}
{"component":"gcsupload","dest":"pr-logs/pull/19759/test_pull_request_origin_integration/17977/artifacts/scripts/test-integration/logs/scripts.log","level":"info","msg":"Finished upload","time":"2018-05-21T11:28:15Z"}
{"component":"gcsupload","dest":"pr-logs/pull/19759/test_pull_request_origin_integration/17977/artifacts/scripts/test-integration/logs/test-go-err.log","level":"info","msg":"Finished upload","time":"2018-05-21T11:28:15Z"}
{"component":"gcsupload","dest":"pr-logs/pull/19759/test_pull_request_origin_integration/17977/artifacts/scripts/test-integration/logs/raw_test_output.log","level":"info","msg":"Finished upload","time":"2018-05-21T11:28:15Z"}
{"component":"gcsupload","level":"info","msg":"Finished upload to GCS","time":"2018-05-21T11:28:15Z"}
+ exit 0
+ set +o xtrace
########## FINISHED STAGE: SUCCESS: PUSH THE ARTIFACTS AND METADATA [00h 00m 11s] ##########
[workspace@5] $ /bin/bash /tmp/jenkins8867583512950933727.sh
########## STARTING STAGE: DEPROVISION CLOUD RESOURCES ##########
+ [[ -s /var/lib/jenkins/jobs/test_pull_request_origin_integration/workspace@5/activate ]]
+ source /var/lib/jenkins/jobs/test_pull_request_origin_integration/workspace@5/activate
++ export VIRTUAL_ENV=/var/lib/jenkins/origin-ci-tool/7a5c5e83c372ad2e6b3b64b3efa16fe2cb37ef83
++ VIRTUAL_ENV=/var/lib/jenkins/origin-ci-tool/7a5c5e83c372ad2e6b3b64b3efa16fe2cb37ef83
++ export PATH=/var/lib/jenkins/origin-ci-tool/7a5c5e83c372ad2e6b3b64b3efa16fe2cb37ef83/bin:/sbin:/usr/sbin:/bin:/usr/bin
++ PATH=/var/lib/jenkins/origin-ci-tool/7a5c5e83c372ad2e6b3b64b3efa16fe2cb37ef83/bin:/sbin:/usr/sbin:/bin:/usr/bin
++ unset PYTHON_HOME
++ export OCT_CONFIG_HOME=/var/lib/jenkins/jobs/test_pull_request_origin_integration/workspace@5/.config
++ OCT_CONFIG_HOME=/var/lib/jenkins/jobs/test_pull_request_origin_integration/workspace@5/.config
+ oct deprovision

PLAYBOOK: main.yml *************************************************************
4 plays in /var/lib/jenkins/origin-ci-tool/7a5c5e83c372ad2e6b3b64b3efa16fe2cb37ef83/lib/python2.7/site-packages/oct/ansible/oct/playbooks/deprovision/main.yml

PLAY [ensure we have the parameters necessary to deprovision virtual hosts] ****

TASK [ensure all required variables are set] ***********************************
task path: /var/lib/jenkins/origin-ci-tool/7a5c5e83c372ad2e6b3b64b3efa16fe2cb37ef83/lib/python2.7/site-packages/oct/ansible/oct/playbooks/deprovision/main.yml:9
skipping: [localhost] => (item=origin_ci_inventory_dir)  => {
    "changed": false, 
    "generated_timestamp": "2018-05-21 07:28:17.320974", 
    "item": "origin_ci_inventory_dir", 
    "skip_reason": "Conditional check failed", 
    "skipped": true
}
skipping: [localhost] => (item=origin_ci_aws_region)  => {
    "changed": false, 
    "generated_timestamp": "2018-05-21 07:28:17.326336", 
    "item": "origin_ci_aws_region", 
    "skip_reason": "Conditional check failed", 
    "skipped": true
}

PLAY [deprovision virtual hosts in EC2] ****************************************

TASK [Gathering Facts] *********************************************************
ok: [localhost]

TASK [deprovision a virtual EC2 host] ******************************************
task path: /var/lib/jenkins/origin-ci-tool/7a5c5e83c372ad2e6b3b64b3efa16fe2cb37ef83/lib/python2.7/site-packages/oct/ansible/oct/playbooks/deprovision/main.yml:28
included: /var/lib/jenkins/origin-ci-tool/7a5c5e83c372ad2e6b3b64b3efa16fe2cb37ef83/lib/python2.7/site-packages/oct/ansible/oct/playbooks/deprovision/roles/aws-down/tasks/main.yml for localhost

TASK [update the SSH configuration to remove AWS EC2 specifics] ****************
task path: /var/lib/jenkins/origin-ci-tool/7a5c5e83c372ad2e6b3b64b3efa16fe2cb37ef83/lib/python2.7/site-packages/oct/ansible/oct/playbooks/deprovision/roles/aws-down/tasks/main.yml:2
ok: [localhost] => {
    "changed": false, 
    "generated_timestamp": "2018-05-21 07:28:18.155314", 
    "msg": ""
}

TASK [rename EC2 instance for termination reaper] ******************************
task path: /var/lib/jenkins/origin-ci-tool/7a5c5e83c372ad2e6b3b64b3efa16fe2cb37ef83/lib/python2.7/site-packages/oct/ansible/oct/playbooks/deprovision/roles/aws-down/tasks/main.yml:8
changed: [localhost] => {
    "changed": true, 
    "generated_timestamp": "2018-05-21 07:28:18.721586", 
    "msg": "Tags {'Name': 'oct-terminate'} created for resource i-0ba0bc24224a40237."
}

TASK [tear down the EC2 instance] **********************************************
task path: /var/lib/jenkins/origin-ci-tool/7a5c5e83c372ad2e6b3b64b3efa16fe2cb37ef83/lib/python2.7/site-packages/oct/ansible/oct/playbooks/deprovision/roles/aws-down/tasks/main.yml:15
changed: [localhost] => {
    "changed": true, 
    "generated_timestamp": "2018-05-21 07:28:19.649965", 
    "instance_ids": [
        "i-0ba0bc24224a40237"
    ], 
    "instances": [
        {
            "ami_launch_index": "0", 
            "architecture": "x86_64", 
            "block_device_mapping": {
                "/dev/sda1": {
                    "delete_on_termination": true, 
                    "status": "attached", 
                    "volume_id": "vol-035050ca9a548b6fb"
                }, 
                "/dev/sdb": {
                    "delete_on_termination": true, 
                    "status": "attached", 
                    "volume_id": "vol-018561d298bd31dc9"
                }
            }, 
            "dns_name": "ec2-52-200-44-12.compute-1.amazonaws.com", 
            "ebs_optimized": false, 
            "groups": {
                "sg-7e73221a": "default"
            }, 
            "hypervisor": "xen", 
            "id": "i-0ba0bc24224a40237", 
            "image_id": "ami-0f07d2d9a03af96ec", 
            "instance_type": "m4.xlarge", 
            "kernel": null, 
            "key_name": "libra", 
            "launch_time": "2018-05-21T10:41:50.000Z", 
            "placement": "us-east-1d", 
            "private_dns_name": "ip-172-18-11-184.ec2.internal", 
            "private_ip": "172.18.11.184", 
            "public_dns_name": "ec2-52-200-44-12.compute-1.amazonaws.com", 
            "public_ip": "52.200.44.12", 
            "ramdisk": null, 
            "region": "us-east-1", 
            "root_device_name": "/dev/sda1", 
            "root_device_type": "ebs", 
            "state": "running", 
            "state_code": 16, 
            "tags": {
                "Name": "oct-terminate", 
                "openshift_etcd": "", 
                "openshift_master": "", 
                "openshift_node": ""
            }, 
            "tenancy": "default", 
            "virtualization_type": "hvm"
        }
    ], 
    "tagged_instances": []
}

TASK [remove the serialized host variables] ************************************
task path: /var/lib/jenkins/origin-ci-tool/7a5c5e83c372ad2e6b3b64b3efa16fe2cb37ef83/lib/python2.7/site-packages/oct/ansible/oct/playbooks/deprovision/roles/aws-down/tasks/main.yml:22
changed: [localhost] => {
    "changed": true, 
    "generated_timestamp": "2018-05-21 07:28:19.901196", 
    "path": "/var/lib/jenkins/jobs/test_pull_request_origin_integration/workspace@5/.config/origin-ci-tool/inventory/host_vars/172.18.11.184.yml", 
    "state": "absent"
}

PLAY [deprovision virtual hosts locally manged by Vagrant] *********************

TASK [Gathering Facts] *********************************************************
ok: [localhost]

PLAY [clean up local configuration for deprovisioned instances] ****************

TASK [remove inventory configuration directory] ********************************
task path: /var/lib/jenkins/origin-ci-tool/7a5c5e83c372ad2e6b3b64b3efa16fe2cb37ef83/lib/python2.7/site-packages/oct/ansible/oct/playbooks/deprovision/main.yml:61
changed: [localhost] => {
    "changed": true, 
    "generated_timestamp": "2018-05-21 07:28:20.385341", 
    "path": "/var/lib/jenkins/jobs/test_pull_request_origin_integration/workspace@5/.config/origin-ci-tool/inventory", 
    "state": "absent"
}

PLAY RECAP *********************************************************************
localhost                  : ok=8    changed=4    unreachable=0    failed=0   

+ set +o xtrace
########## FINISHED STAGE: SUCCESS: DEPROVISION CLOUD RESOURCES [00h 00m 05s] ##########
Archiving artifacts
[BFA] Scanning build for known causes...
[BFA] Found failure cause(s):
[BFA] Job Stage Failed
[BFA] Done. 0s
[WS-CLEANUP] Deleting project workspace...[WS-CLEANUP] done
Finished: FAILURE