FailedConsole Output

Skipping 103 KB.. Full Log
[WARNING] [12:19:12+0000] main.main()
[WARNING] [12:19:12+0000] 	github.com/openshift/origin/test/integration/runner/_test/_testmain.go:44 +0xdb
[WARNING] [12:19:12+0000] goroutine 6 [chan receive, 30 minutes]:
[WARNING] [12:19:12+0000] testing.tRunner.func1(0xc4200b80f0)
[WARNING] [12:19:12+0000] 	/usr/local/go/src/testing/testing.go:722 +0x131
[WARNING] [12:19:12+0000] testing.tRunner(0xc4200b80f0, 0x5d58c0)
[WARNING] [12:19:12+0000] 	/usr/local/go/src/testing/testing.go:748 +0xda
[WARNING] [12:19:12+0000] created by testing.(*T).Run
[WARNING] [12:19:12+0000] 	/usr/local/go/src/testing/testing.go:789 +0x2de
[WARNING] [12:19:12+0000] goroutine 406 [IO wait]:
[WARNING] [12:19:12+0000] internal/poll.runtime_pollWait(0x7fc21e01bf70, 0x72, 0x1)
[WARNING] [12:19:12+0000] 	/usr/local/go/src/runtime/netpoll.go:173 +0x57
[WARNING] [12:19:12+0000] internal/poll.(*pollDesc).wait(0xc4200789c8, 0x72, 0xffffffffffffff01, 0x6a6b20, 0x6a51d0)
[WARNING] [12:19:12+0000] 	/usr/local/go/src/internal/poll/fd_poll_runtime.go:85 +0xae
[WARNING] [12:19:12+0000] internal/poll.(*pollDesc).waitRead(0xc4200789c8, 0xc4204d9201, 0x3cb1f, 0x3cb1f)
[WARNING] [12:19:12+0000] 	/usr/local/go/src/internal/poll/fd_poll_runtime.go:90 +0x3d
[WARNING] [12:19:12+0000] internal/poll.(*FD).Read(0xc4200789b0, 0xc4204d92e1, 0x3cb1f, 0x3cb1f, 0x0, 0x0, 0x0)
[WARNING] [12:19:12+0000] 	/usr/local/go/src/internal/poll/fd_unix.go:125 +0x18a
[WARNING] [12:19:12+0000] os.(*File).read(0xc42000c118, 0xc4204d92e1, 0x3cb1f, 0x3cb1f, 0x177, 0x0, 0x0)
[WARNING] [12:19:12+0000] 	/usr/local/go/src/os/file_unix.go:216 +0x4e
[WARNING] [12:19:12+0000] os.(*File).Read(0xc42000c118, 0xc4204d92e1, 0x3cb1f, 0x3cb1f, 0x177, 0x0, 0x0)
[WARNING] [12:19:12+0000] 	/usr/local/go/src/os/file.go:103 +0x6d
[WARNING] [12:19:12+0000] bytes.(*Buffer).ReadFrom(0xc420098310, 0x6a65e0, 0xc42000c118, 0x7fc21de17028, 0xc420098310, 0xc42044e901)
[WARNING] [12:19:12+0000] 	/usr/local/go/src/bytes/buffer.go:209 +0x177
[WARNING] [12:19:12+0000] io.copyBuffer(0x6a63e0, 0xc420098310, 0x6a65e0, 0xc42000c118, 0x0, 0x0, 0x0, 0xff, 0xc42034d740, 0x45c136)
[WARNING] [12:19:12+0000] 	/usr/local/go/src/io/io.go:386 +0x2bb
[WARNING] [12:19:12+0000] io.Copy(0x6a63e0, 0xc420098310, 0x6a65e0, 0xc42000c118, 0x6dca95c00000008, 0x5b02b1e7, 0xc42034d798)
[WARNING] [12:19:12+0000] 	/usr/local/go/src/io/io.go:362 +0x68
[WARNING] [12:19:12+0000] os/exec.(*Cmd).writerDescriptor.func1(0x4ddc00, 0xc4200b93b0)
[WARNING] [12:19:12+0000] 	/usr/local/go/src/os/exec/exec.go:264 +0x4d
[WARNING] [12:19:12+0000] os/exec.(*Cmd).Start.func1(0xc4202e26e0, 0xc42000a3a0)
[WARNING] [12:19:12+0000] 	/usr/local/go/src/os/exec/exec.go:380 +0x27
[WARNING] [12:19:12+0000] created by os/exec.(*Cmd).Start
[WARNING] [12:19:12+0000] 	/usr/local/go/src/os/exec/exec.go:379 +0x646
[WARNING] [12:19:12+0000] goroutine 12 [chan receive, 31 minutes]:
[WARNING] [12:19:12+0000] testing.(*testContext).waitParallel(0xc42000e870)
[WARNING] [12:19:12+0000] 	/usr/local/go/src/testing/testing.go:833 +0x9f
[WARNING] [12:19:12+0000] testing.(*T).Parallel(0xc4200b82d0)
[WARNING] [12:19:12+0000] 	/usr/local/go/src/testing/testing.go:678 +0x13f
[WARNING] [12:19:12+0000] github.com/openshift/origin/test/integration/runner.executeTests.func1(0xc4200b82d0)
[WARNING] [12:19:12+0000] 	/go/src/github.com/openshift/origin/_output/local/go/src/github.com/openshift/origin/test/integration/runner/runner_test.go:112 +0x9f
[WARNING] [12:19:12+0000] testing.tRunner(0xc4200b82d0, 0xc4201f3b40)
[WARNING] [12:19:12+0000] 	/usr/local/go/src/testing/testing.go:746 +0xd0
[WARNING] [12:19:12+0000] created by testing.(*T).Run
[WARNING] [12:19:12+0000] 	/usr/local/go/src/testing/testing.go:789 +0x2de
[WARNING] [12:19:12+0000] goroutine 13 [chan receive, 31 minutes]:
[WARNING] [12:19:12+0000] testing.(*testContext).waitParallel(0xc42000e870)
[WARNING] [12:19:12+0000] 	/usr/local/go/src/testing/testing.go:833 +0x9f
[WARNING] [12:19:12+0000] testing.(*T).Parallel(0xc4200b83c0)
[WARNING] [12:19:12+0000] 	/usr/local/go/src/testing/testing.go:678 +0x13f
[WARNING] [12:19:12+0000] github.com/openshift/origin/test/integration/runner.executeTests.func1(0xc4200b83c0)
[WARNING] [12:19:12+0000] 	/go/src/github.com/openshift/origin/_output/local/go/src/github.com/openshift/origin/test/integration/runner/runner_test.go:112 +0x9f
[WARNING] [12:19:12+0000] testing.tRunner(0xc4200b83c0, 0xc4201f3b80)
[WARNING] [12:19:12+0000] 	/usr/local/go/src/testing/testing.go:746 +0xd0
[WARNING] [12:19:12+0000] created by testing.(*T).Run
[WARNING] [12:19:12+0000] 	/usr/local/go/src/testing/testing.go:789 +0x2de
[WARNING] [12:19:12+0000] goroutine 14 [chan receive, 31 minutes]:
[WARNING] [12:19:12+0000] testing.(*testContext).waitParallel(0xc42000e870)
[WARNING] [12:19:12+0000] 	/usr/local/go/src/testing/testing.go:833 +0x9f
[WARNING] [12:19:12+0000] testing.(*T).Parallel(0xc4200b84b0)
[WARNING] [12:19:12+0000] 	/usr/local/go/src/testing/testing.go:678 +0x13f
[WARNING] [12:19:12+0000] github.com/openshift/origin/test/integration/runner.executeTests.func1(0xc4200b84b0)
[WARNING] [12:19:12+0000] 	/go/src/github.com/openshift/origin/_output/local/go/src/github.com/openshift/origin/test/integration/runner/runner_test.go:112 +0x9f
[WARNING] [12:19:12+0000] testing.tRunner(0xc4200b84b0, 0xc4201f3bc0)
[WARNING] [12:19:12+0000] 	/usr/local/go/src/testing/testing.go:746 +0xd0
[WARNING] [12:19:12+0000] created by testing.(*T).Run
[WARNING] [12:19:12+0000] 	/usr/local/go/src/testing/testing.go:789 +0x2de
[WARNING] [12:19:12+0000] goroutine 15 [chan receive, 31 minutes]:
[WARNING] [12:19:12+0000] testing.(*testContext).waitParallel(0xc42000e870)
[WARNING] [12:19:12+0000] 	/usr/local/go/src/testing/testing.go:833 +0x9f
[WARNING] [12:19:12+0000] testing.(*T).Parallel(0xc4200b85a0)
[WARNING] [12:19:12+0000] 	/usr/local/go/src/testing/testing.go:678 +0x13f
[WARNING] [12:19:12+0000] github.com/openshift/origin/test/integration/runner.executeTests.func1(0xc4200b85a0)
[WARNING] [12:19:12+0000] 	/go/src/github.com/openshift/origin/_output/local/go/src/github.com/openshift/origin/test/integration/runner/runner_test.go:112 +0x9f
[WARNING] [12:19:12+0000] testing.tRunner(0xc4200b85a0, 0xc4201f3c00)
[WARNING] [12:19:12+0000] 	/usr/local/go/src/testing/testing.go:746 +0xd0
[WARNING] [12:19:12+0000] created by testing.(*T).Run
[WARNING] [12:19:12+0000] 	/usr/local/go/src/testing/testing.go:789 +0x2de
[WARNING] [12:19:12+0000] goroutine 16 [chan receive, 31 minutes]:
[WARNING] [12:19:12+0000] testing.(*testContext).waitParallel(0xc42000e870)
[WARNING] [12:19:12+0000] 	/usr/local/go/src/testing/testing.go:833 +0x9f
[WARNING] [12:19:12+0000] testing.(*T).Parallel(0xc4200b8690)
[WARNING] [12:19:12+0000] 	/usr/local/go/src/testing/testing.go:678 +0x13f
[WARNING] [12:19:12+0000] github.com/openshift/origin/test/integration/runner.executeTests.func1(0xc4200b8690)
[WARNING] [12:19:12+0000] 	/go/src/github.com/openshift/origin/_output/local/go/src/github.com/openshift/origin/test/integration/runner/runner_test.go:112 +0x9f
[WARNING] [12:19:12+0000] testing.tRunner(0xc4200b8690, 0xc4201f3c80)
[WARNING] [12:19:12+0000] 	/usr/local/go/src/testing/testing.go:746 +0xd0
[WARNING] [12:19:12+0000] created by testing.(*T).Run
[WARNING] [12:19:12+0000] 	/usr/local/go/src/testing/testing.go:789 +0x2de
[WARNING] [12:19:12+0000] goroutine 17 [chan receive, 31 minutes]:
[WARNING] [12:19:12+0000] testing.(*testContext).waitParallel(0xc42000e870)
[WARNING] [12:19:12+0000] 	/usr/local/go/src/testing/testing.go:833 +0x9f
[WARNING] [12:19:12+0000] testing.(*T).Parallel(0xc4200b8780)
[WARNING] [12:19:12+0000] 	/usr/local/go/src/testing/testing.go:678 +0x13f
[WARNING] [12:19:12+0000] github.com/openshift/origin/test/integration/runner.executeTests.func1(0xc4200b8780)
[WARNING] [12:19:12+0000] 	/go/src/github.com/openshift/origin/_output/local/go/src/github.com/openshift/origin/test/integration/runner/runner_test.go:112 +0x9f
[WARNING] [12:19:12+0000] testing.tRunner(0xc4200b8780, 0xc4201f3d00)
[WARNING] [12:19:12+0000] 	/usr/local/go/src/testing/testing.go:746 +0xd0
[WARNING] [12:19:12+0000] created by testing.(*T).Run
[WARNING] [12:19:12+0000] 	/usr/local/go/src/testing/testing.go:789 +0x2de
[WARNING] [12:19:12+0000] goroutine 18 [chan receive, 31 minutes]:
[WARNING] [12:19:12+0000] testing.(*testContext).waitParallel(0xc42000e870)
[WARNING] [12:19:12+0000] 	/usr/local/go/src/testing/testing.go:833 +0x9f
[WARNING] [12:19:12+0000] testing.(*T).Parallel(0xc4200b8870)
[WARNING] [12:19:12+0000] 	/usr/local/go/src/testing/testing.go:678 +0x13f
[WARNING] [12:19:12+0000] github.com/openshift/origin/test/integration/runner.executeTests.func1(0xc4200b8870)
[WARNING] [12:19:12+0000] 	/go/src/github.com/openshift/origin/_output/local/go/src/github.com/openshift/origin/test/integration/runner/runner_test.go:112 +0x9f
[WARNING] [12:19:12+0000] testing.tRunner(0xc4200b8870, 0xc4201f3d80)
[WARNING] [12:19:12+0000] 	/usr/local/go/src/testing/testing.go:746 +0xd0
[WARNING] [12:19:12+0000] created by testing.(*T).Run
[WARNING] [12:19:12+0000] 	/usr/local/go/src/testing/testing.go:789 +0x2de
[WARNING] [12:19:12+0000] goroutine 19 [chan receive, 31 minutes]:
[WARNING] [12:19:12+0000] testing.(*testContext).waitParallel(0xc42000e870)
[WARNING] [12:19:12+0000] 	/usr/local/go/src/testing/testing.go:833 +0x9f
[WARNING] [12:19:12+0000] testing.(*T).Parallel(0xc4200b8960)
[WARNING] [12:19:12+0000] 	/usr/local/go/src/testing/testing.go:678 +0x13f
[WARNING] [12:19:12+0000] github.com/openshift/origin/test/integration/runner.executeTests.func1(0xc4200b8960)
[WARNING] [12:19:12+0000] 	/go/src/github.com/openshift/origin/_output/local/go/src/github.com/openshift/origin/test/integration/runner/runner_test.go:112 +0x9f
[WARNING] [12:19:12+0000] testing.tRunner(0xc4200b8960, 0xc4201f3e00)
[WARNING] [12:19:12+0000] 	/usr/local/go/src/testing/testing.go:746 +0xd0
[WARNING] [12:19:12+0000] created by testing.(*T).Run
[WARNING] [12:19:12+0000] 	/usr/local/go/src/testing/testing.go:789 +0x2de
[WARNING] [12:19:12+0000] goroutine 20 [chan receive, 31 minutes]:
[WARNING] [12:19:12+0000] testing.(*testContext).waitParallel(0xc42000e870)
[WARNING] [12:19:12+0000] 	/usr/local/go/src/testing/testing.go:833 +0x9f
[WARNING] [12:19:12+0000] testing.(*T).Parallel(0xc4200b8a50)
[WARNING] [12:19:12+0000] 	/usr/local/go/src/testing/testing.go:678 +0x13f
[WARNING] [12:19:12+0000] github.com/openshift/origin/test/integration/runner.executeTests.func1(0xc4200b8a50)
[WARNING] [12:19:12+0000] 	/go/src/github.com/openshift/origin/_output/local/go/src/github.com/openshift/origin/test/integration/runner/runner_test.go:112 +0x9f
[WARNING] [12:19:12+0000] testing.tRunner(0xc4200b8a50, 0xc4201f3e80)
[WARNING] [12:19:12+0000] 	/usr/local/go/src/testing/testing.go:746 +0xd0
[WARNING] [12:19:12+0000] created by testing.(*T).Run
[WARNING] [12:19:12+0000] 	/usr/local/go/src/testing/testing.go:789 +0x2de
[WARNING] [12:19:12+0000] goroutine 21 [chan receive, 31 minutes]:
[WARNING] [12:19:12+0000] testing.(*testContext).waitParallel(0xc42000e870)
[WARNING] [12:19:12+0000] 	/usr/local/go/src/testing/testing.go:833 +0x9f
[WARNING] [12:19:12+0000] testing.(*T).Parallel(0xc4200b8b40)
[WARNING] [12:19:12+0000] 	/usr/local/go/src/testing/testing.go:678 +0x13f
[WARNING] [12:19:12+0000] github.com/openshift/origin/test/integration/runner.executeTests.func1(0xc4200b8b40)
[WARNING] [12:19:12+0000] 	/go/src/github.com/openshift/origin/_output/local/go/src/github.com/openshift/origin/test/integration/runner/runner_test.go:112 +0x9f
[WARNING] [12:19:12+0000] testing.tRunner(0xc4200b8b40, 0xc4201f3f00)
[WARNING] [12:19:12+0000] 	/usr/local/go/src/testing/testing.go:746 +0xd0
[WARNING] [12:19:12+0000] created by testing.(*T).Run
[WARNING] [12:19:12+0000] 	/usr/local/go/src/testing/testing.go:789 +0x2de
[WARNING] [12:19:12+0000] goroutine 22 [chan receive, 31 minutes]:
[WARNING] [12:19:12+0000] testing.(*testContext).waitParallel(0xc42000e870)
[WARNING] [12:19:12+0000] 	/usr/local/go/src/testing/testing.go:833 +0x9f
[WARNING] [12:19:12+0000] testing.(*T).Parallel(0xc4200b8c30)
[WARNING] [12:19:12+0000] 	/usr/local/go/src/testing/testing.go:678 +0x13f
[WARNING] [12:19:12+0000] github.com/openshift/origin/test/integration/runner.executeTests.func1(0xc4200b8c30)
[WARNING] [12:19:12+0000] 	/go/src/github.com/openshift/origin/_output/local/go/src/github.com/openshift/origin/test/integration/runner/runner_test.go:112 +0x9f
[WARNING] [12:19:12+0000] testing.tRunner(0xc4200b8c30, 0xc4201f3f80)
[WARNING] [12:19:12+0000] 	/usr/local/go/src/testing/testing.go:746 +0xd0
[WARNING] [12:19:12+0000] created by testing.(*T).Run
[WARNING] [12:19:12+0000] 	/usr/local/go/src/testing/testing.go:789 +0x2de
[WARNING] [12:19:12+0000] goroutine 23 [chan receive, 31 minutes]:
[WARNING] [12:19:12+0000] testing.(*testContext).waitParallel(0xc42000e870)
[WARNING] [12:19:12+0000] 	/usr/local/go/src/testing/testing.go:833 +0x9f
[WARNING] [12:19:12+0000] testing.(*T).Parallel(0xc4200b8d20)
[WARNING] [12:19:12+0000] 	/usr/local/go/src/testing/testing.go:678 +0x13f
[WARNING] [12:19:12+0000] github.com/openshift/origin/test/integration/runner.executeTests.func1(0xc4200b8d20)
[WARNING] [12:19:12+0000] 	/go/src/github.com/openshift/origin/_output/local/go/src/github.com/openshift/origin/test/integration/runner/runner_test.go:112 +0x9f
[WARNING] [12:19:12+0000] testing.tRunner(0xc4200b8d20, 0xc420348000)
[WARNING] [12:19:12+0000] 	/usr/local/go/src/testing/testing.go:746 +0xd0
[WARNING] [12:19:12+0000] created by testing.(*T).Run
[WARNING] [12:19:12+0000] 	/usr/local/go/src/testing/testing.go:789 +0x2de
[WARNING] [12:19:12+0000] goroutine 24 [chan send, 3 minutes]:
[WARNING] [12:19:12+0000] testing.tRunner.func1(0xc4200b8e10)
[WARNING] [12:19:12+0000] 	/usr/local/go/src/testing/testing.go:741 +0x19b
[WARNING] [12:19:12+0000] testing.tRunner(0xc4200b8e10, 0xc420348080)
[WARNING] [12:19:12+0000] 	/usr/local/go/src/testing/testing.go:748 +0xda
[WARNING] [12:19:12+0000] created by testing.(*T).Run
[WARNING] [12:19:12+0000] 	/usr/local/go/src/testing/testing.go:789 +0x2de
[WARNING] [12:19:12+0000] goroutine 25 [syscall, 2 minutes]:
[WARNING] [12:19:12+0000] syscall.Syscall6(0xf7, 0x1, 0x42e, 0xc42257aa08, 0x1000004, 0x0, 0x0, 0x0, 0x0, 0x0)
[WARNING] [12:19:12+0000] 	/usr/local/go/src/syscall/asm_linux_amd64.s:44 +0x5
[WARNING] [12:19:12+0000] os.(*Process).blockUntilWaitable(0xc420012960, 0xc420012960, 0x0, 0x0)
[WARNING] [12:19:12+0000] 	/usr/local/go/src/os/wait_waitid.go:31 +0xa5
[WARNING] [12:19:12+0000] os.(*Process).wait(0xc420012960, 0xc42024a600, 0xc4202e2918, 0x68)
[WARNING] [12:19:12+0000] 	/usr/local/go/src/os/exec_unix.go:22 +0x42
[WARNING] [12:19:12+0000] os.(*Process).Wait(0xc420012960, 0x0, 0x0, 0x5d59a0)
[WARNING] [12:19:12+0000] 	/usr/local/go/src/os/exec.go:115 +0x2b
[WARNING] [12:19:12+0000] os/exec.(*Cmd).Wait(0xc4202e2840, 0x0, 0x0)
[WARNING] [12:19:12+0000] 	/usr/local/go/src/os/exec/exec.go:446 +0x62
[WARNING] [12:19:12+0000] os/exec.(*Cmd).Run(0xc4202e2840, 0xc4200983f0, 0x0)
[WARNING] [12:19:12+0000] 	/usr/local/go/src/os/exec/exec.go:289 +0x5c
[WARNING] [12:19:12+0000] os/exec.(*Cmd).CombinedOutput(0xc4202e2840, 0xc42026e380, 0x4, 0x4, 0x6, 0xc42024a600)
[WARNING] [12:19:12+0000] 	/usr/local/go/src/os/exec/exec.go:506 +0x127
[WARNING] [12:19:12+0000] github.com/openshift/origin/test/integration/runner.runSingleTest(0xc4200b8f00, 0x5ca51e, 0x2, 0xc42044e9c0, 0x52, 0xc4201cbc80, 0x24, 0x0, 0x0)
[WARNING] [12:19:12+0000] 	/go/src/github.com/openshift/origin/_output/local/go/src/github.com/openshift/origin/test/integration/runner/runner_test.go:174 +0x721
[WARNING] [12:19:12+0000] github.com/openshift/origin/test/integration/runner.executeTests.func1(0xc4200b8f00)
[WARNING] [12:19:12+0000] 	/go/src/github.com/openshift/origin/_output/local/go/src/github.com/openshift/origin/test/integration/runner/runner_test.go:116 +0x1dc
[WARNING] [12:19:12+0000] testing.tRunner(0xc4200b8f00, 0xc420348100)
[WARNING] [12:19:12+0000] 	/usr/local/go/src/testing/testing.go:746 +0xd0
[WARNING] [12:19:12+0000] created by testing.(*T).Run
[WARNING] [12:19:12+0000] 	/usr/local/go/src/testing/testing.go:789 +0x2de
[WARNING] [12:19:12+0000] goroutine 26 [syscall, 2 minutes]:
[WARNING] [12:19:12+0000] syscall.Syscall6(0xf7, 0x1, 0x423, 0xc4200f6a08, 0x1000004, 0x0, 0x0, 0x0, 0x0, 0x0)
[WARNING] [12:19:12+0000] 	/usr/local/go/src/syscall/asm_linux_amd64.s:44 +0x5
[WARNING] [12:19:12+0000] os.(*Process).blockUntilWaitable(0xc420012750, 0xc420012750, 0x0, 0x0)
[WARNING] [12:19:12+0000] 	/usr/local/go/src/os/wait_waitid.go:31 +0xa5
[WARNING] [12:19:12+0000] os.(*Process).wait(0xc420012750, 0xc42024a480, 0xc4202e27b8, 0x68)
[WARNING] [12:19:12+0000] 	/usr/local/go/src/os/exec_unix.go:22 +0x42
[WARNING] [12:19:12+0000] os.(*Process).Wait(0xc420012750, 0x0, 0x0, 0x5d59a0)
[WARNING] [12:19:12+0000] 	/usr/local/go/src/os/exec.go:115 +0x2b
[WARNING] [12:19:12+0000] os/exec.(*Cmd).Wait(0xc4202e26e0, 0x0, 0x0)
[WARNING] [12:19:12+0000] 	/usr/local/go/src/os/exec/exec.go:446 +0x62
[WARNING] [12:19:12+0000] os/exec.(*Cmd).Run(0xc4202e26e0, 0xc420098310, 0x0)
[WARNING] [12:19:12+0000] 	/usr/local/go/src/os/exec/exec.go:289 +0x5c
[WARNING] [12:19:12+0000] os/exec.(*Cmd).CombinedOutput(0xc4202e26e0, 0xc42026e280, 0x4, 0x4, 0x6, 0xc42024a480)
[WARNING] [12:19:12+0000] 	/usr/local/go/src/os/exec/exec.go:506 +0x127
[WARNING] [12:19:12+0000] github.com/openshift/origin/test/integration/runner.runSingleTest(0xc4200b8ff0, 0x5ca51e, 0x2, 0xc42044e9c0, 0x52, 0xc4201cbc20, 0x2c, 0x0, 0x0)
[WARNING] [12:19:12+0000] 	/go/src/github.com/openshift/origin/_output/local/go/src/github.com/openshift/origin/test/integration/runner/runner_test.go:174 +0x721
[WARNING] [12:19:12+0000] github.com/openshift/origin/test/integration/runner.executeTests.func1(0xc4200b8ff0)
[WARNING] [12:19:12+0000] 	/go/src/github.com/openshift/origin/_output/local/go/src/github.com/openshift/origin/test/integration/runner/runner_test.go:116 +0x1dc
[WARNING] [12:19:12+0000] testing.tRunner(0xc4200b8ff0, 0xc420348180)
[WARNING] [12:19:12+0000] 	/usr/local/go/src/testing/testing.go:746 +0xd0
[WARNING] [12:19:12+0000] created by testing.(*T).Run
[WARNING] [12:19:12+0000] 	/usr/local/go/src/testing/testing.go:789 +0x2de
[WARNING] [12:19:12+0000] goroutine 27 [syscall, 2 minutes]:
[WARNING] [12:19:12+0000] syscall.Syscall6(0xf7, 0x1, 0x41a, 0xc4225b7a08, 0x1000004, 0x0, 0x0, 0x0, 0x0, 0x0)
[WARNING] [12:19:12+0000] 	/usr/local/go/src/syscall/asm_linux_amd64.s:44 +0x5
[WARNING] [12:19:12+0000] os.(*Process).blockUntilWaitable(0xc420012570, 0xc420012570, 0x0, 0x0)
[WARNING] [12:19:12+0000] 	/usr/local/go/src/os/wait_waitid.go:31 +0xa5
[WARNING] [12:19:12+0000] os.(*Process).wait(0xc420012570, 0xc42024a300, 0xc4202e2658, 0x68)
[WARNING] [12:19:12+0000] 	/usr/local/go/src/os/exec_unix.go:22 +0x42
[WARNING] [12:19:12+0000] os.(*Process).Wait(0xc420012570, 0x0, 0x0, 0x5d59a0)
[WARNING] [12:19:12+0000] 	/usr/local/go/src/os/exec.go:115 +0x2b
[WARNING] [12:19:12+0000] os/exec.(*Cmd).Wait(0xc4202e2580, 0x0, 0x0)
[WARNING] [12:19:12+0000] 	/usr/local/go/src/os/exec/exec.go:446 +0x62
[WARNING] [12:19:12+0000] os/exec.(*Cmd).Run(0xc4202e2580, 0xc420098230, 0x0)
[WARNING] [12:19:12+0000] 	/usr/local/go/src/os/exec/exec.go:289 +0x5c
[WARNING] [12:19:12+0000] os/exec.(*Cmd).CombinedOutput(0xc4202e2580, 0xc42026e180, 0x4, 0x4, 0x6, 0xc42024a300)
[WARNING] [12:19:12+0000] 	/usr/local/go/src/os/exec/exec.go:506 +0x127
[WARNING] [12:19:12+0000] github.com/openshift/origin/test/integration/runner.runSingleTest(0xc4200b90e0, 0x5ca51e, 0x2, 0xc42044e9c0, 0x52, 0xc420013170, 0x22, 0x0, 0x0)
[WARNING] [12:19:12+0000] 	/go/src/github.com/openshift/origin/_output/local/go/src/github.com/openshift/origin/test/integration/runner/runner_test.go:174 +0x721
[WARNING] [12:19:12+0000] github.com/openshift/origin/test/integration/runner.executeTests.func1(0xc4200b90e0)
[WARNING] [12:19:12+0000] 	/go/src/github.com/openshift/origin/_output/local/go/src/github.com/openshift/origin/test/integration/runner/runner_test.go:116 +0x1dc
[WARNING] [12:19:12+0000] testing.tRunner(0xc4200b90e0, 0xc420348200)
[WARNING] [12:19:12+0000] 	/usr/local/go/src/testing/testing.go:746 +0xd0
[WARNING] [12:19:12+0000] created by testing.(*T).Run
[WARNING] [12:19:12+0000] 	/usr/local/go/src/testing/testing.go:789 +0x2de
[WARNING] [12:19:12+0000] goroutine 28 [chan send, 2 minutes]:
[WARNING] [12:19:12+0000] testing.tRunner.func1(0xc4200b91d0)
[WARNING] [12:19:12+0000] 	/usr/local/go/src/testing/testing.go:741 +0x19b
[WARNING] [12:19:12+0000] testing.tRunner(0xc4200b91d0, 0xc420348280)
[WARNING] [12:19:12+0000] 	/usr/local/go/src/testing/testing.go:748 +0xda
[WARNING] [12:19:12+0000] created by testing.(*T).Run
[WARNING] [12:19:12+0000] 	/usr/local/go/src/testing/testing.go:789 +0x2de
[WARNING] [12:19:12+0000] goroutine 29 [chan send, 2 minutes]:
[WARNING] [12:19:12+0000] testing.tRunner.func1(0xc4200b92c0)
[WARNING] [12:19:12+0000] 	/usr/local/go/src/testing/testing.go:741 +0x19b
[WARNING] [12:19:12+0000] testing.tRunner(0xc4200b92c0, 0xc420348300)
[WARNING] [12:19:12+0000] 	/usr/local/go/src/testing/testing.go:748 +0xda
[WARNING] [12:19:12+0000] created by testing.(*T).Run
[WARNING] [12:19:12+0000] 	/usr/local/go/src/testing/testing.go:789 +0x2de
[WARNING] [12:19:12+0000] goroutine 30 [chan send, 2 minutes]:
[WARNING] [12:19:12+0000] testing.tRunner.func1(0xc4200b93b0)
[WARNING] [12:19:12+0000] 	/usr/local/go/src/testing/testing.go:741 +0x19b
[WARNING] [12:19:12+0000] testing.tRunner(0xc4200b93b0, 0xc420348380)
[WARNING] [12:19:12+0000] 	/usr/local/go/src/testing/testing.go:748 +0xda
[WARNING] [12:19:12+0000] created by testing.(*T).Run
[WARNING] [12:19:12+0000] 	/usr/local/go/src/testing/testing.go:789 +0x2de
[WARNING] [12:19:12+0000] goroutine 31 [chan send, 2 minutes]:
[WARNING] [12:19:12+0000] testing.tRunner.func1(0xc4200b94a0)
[WARNING] [12:19:12+0000] 	/usr/local/go/src/testing/testing.go:741 +0x19b
[WARNING] [12:19:12+0000] testing.tRunner(0xc4200b94a0, 0xc420348400)
[WARNING] [12:19:12+0000] 	/usr/local/go/src/testing/testing.go:748 +0xda
[WARNING] [12:19:12+0000] created by testing.(*T).Run
[WARNING] [12:19:12+0000] 	/usr/local/go/src/testing/testing.go:789 +0x2de
[WARNING] [12:19:12+0000] goroutine 32 [chan send, 2 minutes]:
[WARNING] [12:19:12+0000] testing.tRunner.func1(0xc4200b9590)
[WARNING] [12:19:12+0000] 	/usr/local/go/src/testing/testing.go:741 +0x19b
[WARNING] [12:19:12+0000] testing.tRunner(0xc4200b9590, 0xc420348480)
[WARNING] [12:19:12+0000] 	/usr/local/go/src/testing/testing.go:748 +0xda
[WARNING] [12:19:12+0000] created by testing.(*T).Run
[WARNING] [12:19:12+0000] 	/usr/local/go/src/testing/testing.go:789 +0x2de
[WARNING] [12:19:12+0000] goroutine 33 [chan send, 2 minutes]:
[WARNING] [12:19:12+0000] testing.tRunner.func1(0xc4200b9680)
[WARNING] [12:19:12+0000] 	/usr/local/go/src/testing/testing.go:741 +0x19b
[WARNING] [12:19:12+0000] testing.tRunner(0xc4200b9680, 0xc420348500)
[WARNING] [12:19:12+0000] 	/usr/local/go/src/testing/testing.go:748 +0xda
[WARNING] [12:19:12+0000] created by testing.(*T).Run
[WARNING] [12:19:12+0000] 	/usr/local/go/src/testing/testing.go:789 +0x2de
[WARNING] [12:19:12+0000] goroutine 34 [chan send, 2 minutes]:
[WARNING] [12:19:12+0000] testing.tRunner.func1(0xc4200b9770)
[WARNING] [12:19:12+0000] 	/usr/local/go/src/testing/testing.go:741 +0x19b
[WARNING] [12:19:12+0000] testing.tRunner(0xc4200b9770, 0xc420348580)
[WARNING] [12:19:12+0000] 	/usr/local/go/src/testing/testing.go:748 +0xda
[WARNING] [12:19:12+0000] created by testing.(*T).Run
[WARNING] [12:19:12+0000] 	/usr/local/go/src/testing/testing.go:789 +0x2de
[WARNING] [12:19:12+0000] goroutine 35 [chan send, 2 minutes]:
[WARNING] [12:19:12+0000] testing.tRunner.func1(0xc4200b9860)
[WARNING] [12:19:12+0000] 	/usr/local/go/src/testing/testing.go:741 +0x19b
[WARNING] [12:19:12+0000] testing.tRunner(0xc4200b9860, 0xc420348600)
[WARNING] [12:19:12+0000] 	/usr/local/go/src/testing/testing.go:748 +0xda
[WARNING] [12:19:12+0000] created by testing.(*T).Run
[WARNING] [12:19:12+0000] 	/usr/local/go/src/testing/testing.go:789 +0x2de
[WARNING] [12:19:12+0000] goroutine 36 [chan send, 2 minutes]:
[WARNING] [12:19:12+0000] testing.tRunner.func1(0xc4200b9950)
[WARNING] [12:19:12+0000] 	/usr/local/go/src/testing/testing.go:741 +0x19b
[WARNING] [12:19:12+0000] testing.tRunner(0xc4200b9950, 0xc420348680)
[WARNING] [12:19:12+0000] 	/usr/local/go/src/testing/testing.go:748 +0xda
[WARNING] [12:19:12+0000] created by testing.(*T).Run
[WARNING] [12:19:12+0000] 	/usr/local/go/src/testing/testing.go:789 +0x2de
[WARNING] [12:19:12+0000] goroutine 37 [chan send, 8 minutes]:
[WARNING] [12:19:12+0000] testing.tRunner.func1(0xc4200b9a40)
[WARNING] [12:19:12+0000] 	/usr/local/go/src/testing/testing.go:741 +0x19b
[WARNING] [12:19:12+0000] testing.tRunner(0xc4200b9a40, 0xc420348700)
[WARNING] [12:19:12+0000] 	/usr/local/go/src/testing/testing.go:748 +0xda
[WARNING] [12:19:12+0000] created by testing.(*T).Run
[WARNING] [12:19:12+0000] 	/usr/local/go/src/testing/testing.go:789 +0x2de
[WARNING] [12:19:12+0000] goroutine 38 [chan send, 2 minutes]:
[WARNING] [12:19:12+0000] testing.tRunner.func1(0xc4200b9b30)
[WARNING] [12:19:12+0000] 	/usr/local/go/src/testing/testing.go:741 +0x19b
[WARNING] [12:19:12+0000] testing.tRunner(0xc4200b9b30, 0xc420348780)
[WARNING] [12:19:12+0000] 	/usr/local/go/src/testing/testing.go:748 +0xda
[WARNING] [12:19:12+0000] created by testing.(*T).Run
[WARNING] [12:19:12+0000] 	/usr/local/go/src/testing/testing.go:789 +0x2de
[WARNING] [12:19:12+0000] goroutine 39 [chan send, 3 minutes]:
[WARNING] [12:19:12+0000] testing.tRunner.func1(0xc4200b9c20)
[WARNING] [12:19:12+0000] 	/usr/local/go/src/testing/testing.go:741 +0x19b
[WARNING] [12:19:12+0000] testing.tRunner(0xc4200b9c20, 0xc420348800)
[WARNING] [12:19:12+0000] 	/usr/local/go/src/testing/testing.go:748 +0xda
[WARNING] [12:19:12+0000] created by testing.(*T).Run
[WARNING] [12:19:12+0000] 	/usr/local/go/src/testing/testing.go:789 +0x2de
[WARNING] [12:19:12+0000] goroutine 40 [chan send, 3 minutes]:
[WARNING] [12:19:12+0000] testing.tRunner.func1(0xc4200b9d10)
[WARNING] [12:19:12+0000] 	/usr/local/go/src/testing/testing.go:741 +0x19b
[WARNING] [12:19:12+0000] testing.tRunner(0xc4200b9d10, 0xc420348880)
[WARNING] [12:19:12+0000] 	/usr/local/go/src/testing/testing.go:748 +0xda
[WARNING] [12:19:12+0000] created by testing.(*T).Run
[WARNING] [12:19:12+0000] 	/usr/local/go/src/testing/testing.go:789 +0x2de
[WARNING] [12:19:12+0000] goroutine 41 [chan send, 3 minutes]:
[WARNING] [12:19:12+0000] testing.tRunner.func1(0xc4200b9e00)
[WARNING] [12:19:12+0000] 	/usr/local/go/src/testing/testing.go:741 +0x19b
[WARNING] [12:19:12+0000] testing.tRunner(0xc4200b9e00, 0xc420348900)
[WARNING] [12:19:12+0000] 	/usr/local/go/src/testing/testing.go:748 +0xda
[WARNING] [12:19:12+0000] created by testing.(*T).Run
[WARNING] [12:19:12+0000] 	/usr/local/go/src/testing/testing.go:789 +0x2de
[WARNING] [12:19:12+0000] goroutine 42 [chan send, 3 minutes]:
[WARNING] [12:19:12+0000] testing.tRunner.func1(0xc4200b9ef0)
[WARNING] [12:19:12+0000] 	/usr/local/go/src/testing/testing.go:741 +0x19b
[WARNING] [12:19:12+0000] testing.tRunner(0xc4200b9ef0, 0xc420348980)
[WARNING] [12:19:12+0000] 	/usr/local/go/src/testing/testing.go:748 +0xda
[WARNING] [12:19:12+0000] created by testing.(*T).Run
[WARNING] [12:19:12+0000] 	/usr/local/go/src/testing/testing.go:789 +0x2de
[WARNING] [12:19:12+0000] goroutine 43 [chan send, 3 minutes]:
[WARNING] [12:19:12+0000] testing.tRunner.func1(0xc420354000)
[WARNING] [12:19:12+0000] 	/usr/local/go/src/testing/testing.go:741 +0x19b
[WARNING] [12:19:12+0000] testing.tRunner(0xc420354000, 0xc420348a00)
[WARNING] [12:19:12+0000] 	/usr/local/go/src/testing/testing.go:748 +0xda
[WARNING] [12:19:12+0000] created by testing.(*T).Run
[WARNING] [12:19:12+0000] 	/usr/local/go/src/testing/testing.go:789 +0x2de
[WARNING] [12:19:12+0000] goroutine 44 [chan send, 3 minutes]:
[WARNING] [12:19:12+0000] testing.tRunner.func1(0xc4203540f0)
[WARNING] [12:19:12+0000] 	/usr/local/go/src/testing/testing.go:741 +0x19b
[WARNING] [12:19:12+0000] testing.tRunner(0xc4203540f0, 0xc420348a80)
[WARNING] [12:19:12+0000] 	/usr/local/go/src/testing/testing.go:748 +0xda
[WARNING] [12:19:12+0000] created by testing.(*T).Run
[WARNING] [12:19:12+0000] 	/usr/local/go/src/testing/testing.go:789 +0x2de
[WARNING] [12:19:12+0000] goroutine 45 [chan send, 3 minutes]:
[WARNING] [12:19:12+0000] testing.tRunner.func1(0xc4203541e0)
[WARNING] [12:19:12+0000] 	/usr/local/go/src/testing/testing.go:741 +0x19b
[WARNING] [12:19:12+0000] testing.tRunner(0xc4203541e0, 0xc420348b00)
[WARNING] [12:19:12+0000] 	/usr/local/go/src/testing/testing.go:748 +0xda
[WARNING] [12:19:12+0000] created by testing.(*T).Run
[WARNING] [12:19:12+0000] 	/usr/local/go/src/testing/testing.go:789 +0x2de
[WARNING] [12:19:12+0000] goroutine 46 [chan send, 4 minutes]:
[WARNING] [12:19:12+0000] testing.tRunner.func1(0xc4203542d0)
[WARNING] [12:19:12+0000] 	/usr/local/go/src/testing/testing.go:741 +0x19b
[WARNING] [12:19:12+0000] testing.tRunner(0xc4203542d0, 0xc420348b80)
[WARNING] [12:19:12+0000] 	/usr/local/go/src/testing/testing.go:748 +0xda
[WARNING] [12:19:12+0000] created by testing.(*T).Run
[WARNING] [12:19:12+0000] 	/usr/local/go/src/testing/testing.go:789 +0x2de
[WARNING] [12:19:12+0000] goroutine 47 [chan send, 4 minutes]:
[WARNING] [12:19:12+0000] testing.tRunner.func1(0xc4203543c0)
[WARNING] [12:19:12+0000] 	/usr/local/go/src/testing/testing.go:741 +0x19b
[WARNING] [12:19:12+0000] testing.tRunner(0xc4203543c0, 0xc420348c00)
[WARNING] [12:19:12+0000] 	/usr/local/go/src/testing/testing.go:748 +0xda
[WARNING] [12:19:12+0000] created by testing.(*T).Run
[WARNING] [12:19:12+0000] 	/usr/local/go/src/testing/testing.go:789 +0x2de
[WARNING] [12:19:12+0000] goroutine 48 [chan send, 4 minutes]:
[WARNING] [12:19:12+0000] testing.tRunner.func1(0xc4203544b0)
[WARNING] [12:19:12+0000] 	/usr/local/go/src/testing/testing.go:741 +0x19b
[WARNING] [12:19:12+0000] testing.tRunner(0xc4203544b0, 0xc420348c80)
[WARNING] [12:19:12+0000] 	/usr/local/go/src/testing/testing.go:748 +0xda
[WARNING] [12:19:12+0000] created by testing.(*T).Run
[WARNING] [12:19:12+0000] 	/usr/local/go/src/testing/testing.go:789 +0x2de
[WARNING] [12:19:12+0000] goroutine 49 [chan send, 5 minutes]:
[WARNING] [12:19:12+0000] testing.tRunner.func1(0xc4203545a0)
[WARNING] [12:19:12+0000] 	/usr/local/go/src/testing/testing.go:741 +0x19b
[WARNING] [12:19:12+0000] testing.tRunner(0xc4203545a0, 0xc420348d00)
[WARNING] [12:19:12+0000] 	/usr/local/go/src/testing/testing.go:748 +0xda
[WARNING] [12:19:12+0000] created by testing.(*T).Run
[WARNING] [12:19:12+0000] 	/usr/local/go/src/testing/testing.go:789 +0x2de
[WARNING] [12:19:12+0000] goroutine 50 [chan send, 5 minutes]:
[WARNING] [12:19:12+0000] testing.tRunner.func1(0xc420354690)
[WARNING] [12:19:12+0000] 	/usr/local/go/src/testing/testing.go:741 +0x19b
[WARNING] [12:19:12+0000] testing.tRunner(0xc420354690, 0xc420348d80)
[WARNING] [12:19:12+0000] 	/usr/local/go/src/testing/testing.go:748 +0xda
[WARNING] [12:19:12+0000] created by testing.(*T).Run
[WARNING] [12:19:12+0000] 	/usr/local/go/src/testing/testing.go:789 +0x2de
[WARNING] [12:19:12+0000] goroutine 51 [chan send, 5 minutes]:
[WARNING] [12:19:12+0000] testing.tRunner.func1(0xc420354780)
[WARNING] [12:19:12+0000] 	/usr/local/go/src/testing/testing.go:741 +0x19b
[WARNING] [12:19:12+0000] testing.tRunner(0xc420354780, 0xc420348e00)
[WARNING] [12:19:12+0000] 	/usr/local/go/src/testing/testing.go:748 +0xda
[WARNING] [12:19:12+0000] created by testing.(*T).Run
[WARNING] [12:19:12+0000] 	/usr/local/go/src/testing/testing.go:789 +0x2de
[WARNING] [12:19:12+0000] goroutine 52 [chan send, 6 minutes]:
[WARNING] [12:19:12+0000] testing.tRunner.func1(0xc420354870)
[WARNING] [12:19:12+0000] 	/usr/local/go/src/testing/testing.go:741 +0x19b
[WARNING] [12:19:12+0000] testing.tRunner(0xc420354870, 0xc420348e80)
[WARNING] [12:19:12+0000] 	/usr/local/go/src/testing/testing.go:748 +0xda
[WARNING] [12:19:12+0000] created by testing.(*T).Run
[WARNING] [12:19:12+0000] 	/usr/local/go/src/testing/testing.go:789 +0x2de
[WARNING] [12:19:12+0000] goroutine 53 [chan send, 6 minutes]:
[WARNING] [12:19:12+0000] testing.tRunner.func1(0xc420354960)
[WARNING] [12:19:12+0000] 	/usr/local/go/src/testing/testing.go:741 +0x19b
[WARNING] [12:19:12+0000] testing.tRunner(0xc420354960, 0xc420348f00)
[WARNING] [12:19:12+0000] 	/usr/local/go/src/testing/testing.go:748 +0xda
[WARNING] [12:19:12+0000] created by testing.(*T).Run
[WARNING] [12:19:12+0000] 	/usr/local/go/src/testing/testing.go:789 +0x2de
[WARNING] [12:19:12+0000] goroutine 54 [chan send, 6 minutes]:
[WARNING] [12:19:12+0000] testing.tRunner.func1(0xc420354a50)
[WARNING] [12:19:12+0000] 	/usr/local/go/src/testing/testing.go:741 +0x19b
[WARNING] [12:19:12+0000] testing.tRunner(0xc420354a50, 0xc420348f80)
[WARNING] [12:19:12+0000] 	/usr/local/go/src/testing/testing.go:748 +0xda
[WARNING] [12:19:12+0000] created by testing.(*T).Run
[WARNING] [12:19:12+0000] 	/usr/local/go/src/testing/testing.go:789 +0x2de
[WARNING] [12:19:12+0000] goroutine 55 [chan send, 6 minutes]:
[WARNING] [12:19:12+0000] testing.tRunner.func1(0xc420354b40)
[WARNING] [12:19:12+0000] 	/usr/local/go/src/testing/testing.go:741 +0x19b
[WARNING] [12:19:12+0000] testing.tRunner(0xc420354b40, 0xc420349000)
[WARNING] [12:19:12+0000] 	/usr/local/go/src/testing/testing.go:748 +0xda
[WARNING] [12:19:12+0000] created by testing.(*T).Run
[WARNING] [12:19:12+0000] 	/usr/local/go/src/testing/testing.go:789 +0x2de
[WARNING] [12:19:12+0000] goroutine 56 [chan send, 6 minutes]:
[WARNING] [12:19:12+0000] testing.tRunner.func1(0xc420354c30)
[WARNING] [12:19:12+0000] 	/usr/local/go/src/testing/testing.go:741 +0x19b
[WARNING] [12:19:12+0000] testing.tRunner(0xc420354c30, 0xc420349080)
[WARNING] [12:19:12+0000] 	/usr/local/go/src/testing/testing.go:748 +0xda
[WARNING] [12:19:12+0000] created by testing.(*T).Run
[WARNING] [12:19:12+0000] 	/usr/local/go/src/testing/testing.go:789 +0x2de
[WARNING] [12:19:12+0000] goroutine 58 [chan send, 7 minutes]:
[WARNING] [12:19:12+0000] testing.tRunner.func1(0xc420354e10)
[WARNING] [12:19:12+0000] 	/usr/local/go/src/testing/testing.go:741 +0x19b
[WARNING] [12:19:12+0000] testing.tRunner(0xc420354e10, 0xc420349180)
[WARNING] [12:19:12+0000] 	/usr/local/go/src/testing/testing.go:748 +0xda
[WARNING] [12:19:12+0000] created by testing.(*T).Run
[WARNING] [12:19:12+0000] 	/usr/local/go/src/testing/testing.go:789 +0x2de
[WARNING] [12:19:12+0000] goroutine 59 [chan send, 7 minutes]:
[WARNING] [12:19:12+0000] testing.tRunner.func1(0xc420354f00)
[WARNING] [12:19:12+0000] 	/usr/local/go/src/testing/testing.go:741 +0x19b
[WARNING] [12:19:12+0000] testing.tRunner(0xc420354f00, 0xc420349200)
[WARNING] [12:19:12+0000] 	/usr/local/go/src/testing/testing.go:748 +0xda
[WARNING] [12:19:12+0000] created by testing.(*T).Run
[WARNING] [12:19:12+0000] 	/usr/local/go/src/testing/testing.go:789 +0x2de
[WARNING] [12:19:12+0000] goroutine 60 [chan send, 8 minutes]:
[WARNING] [12:19:12+0000] testing.tRunner.func1(0xc420354ff0)
[WARNING] [12:19:12+0000] 	/usr/local/go/src/testing/testing.go:741 +0x19b
[WARNING] [12:19:12+0000] testing.tRunner(0xc420354ff0, 0xc420349280)
[WARNING] [12:19:12+0000] 	/usr/local/go/src/testing/testing.go:748 +0xda
[WARNING] [12:19:12+0000] created by testing.(*T).Run
[WARNING] [12:19:12+0000] 	/usr/local/go/src/testing/testing.go:789 +0x2de
[WARNING] [12:19:12+0000] goroutine 61 [chan send, 8 minutes]:
[WARNING] [12:19:12+0000] testing.tRunner.func1(0xc4203550e0)
[WARNING] [12:19:12+0000] 	/usr/local/go/src/testing/testing.go:741 +0x19b
[WARNING] [12:19:12+0000] testing.tRunner(0xc4203550e0, 0xc420349300)
[WARNING] [12:19:12+0000] 	/usr/local/go/src/testing/testing.go:748 +0xda
[WARNING] [12:19:12+0000] created by testing.(*T).Run
[WARNING] [12:19:12+0000] 	/usr/local/go/src/testing/testing.go:789 +0x2de
[WARNING] [12:19:12+0000] goroutine 62 [chan send, 16 minutes]:
[WARNING] [12:19:12+0000] testing.tRunner.func1(0xc4203551d0)
[WARNING] [12:19:12+0000] 	/usr/local/go/src/testing/testing.go:741 +0x19b
[WARNING] [12:19:12+0000] testing.tRunner(0xc4203551d0, 0xc420349380)
[WARNING] [12:19:12+0000] 	/usr/local/go/src/testing/testing.go:748 +0xda
[WARNING] [12:19:12+0000] created by testing.(*T).Run
[WARNING] [12:19:12+0000] 	/usr/local/go/src/testing/testing.go:789 +0x2de
[WARNING] [12:19:12+0000] goroutine 63 [chan send, 8 minutes]:
[WARNING] [12:19:12+0000] testing.tRunner.func1(0xc4203552c0)
[WARNING] [12:19:12+0000] 	/usr/local/go/src/testing/testing.go:741 +0x19b
[WARNING] [12:19:12+0000] testing.tRunner(0xc4203552c0, 0xc420349400)
[WARNING] [12:19:12+0000] 	/usr/local/go/src/testing/testing.go:748 +0xda
[WARNING] [12:19:12+0000] created by testing.(*T).Run
[WARNING] [12:19:12+0000] 	/usr/local/go/src/testing/testing.go:789 +0x2de
[WARNING] [12:19:12+0000] goroutine 64 [chan send, 8 minutes]:
[WARNING] [12:19:12+0000] testing.tRunner.func1(0xc4203553b0)
[WARNING] [12:19:12+0000] 	/usr/local/go/src/testing/testing.go:741 +0x19b
[WARNING] [12:19:12+0000] testing.tRunner(0xc4203553b0, 0xc420349480)
[WARNING] [12:19:12+0000] 	/usr/local/go/src/testing/testing.go:748 +0xda
[WARNING] [12:19:12+0000] created by testing.(*T).Run
[WARNING] [12:19:12+0000] 	/usr/local/go/src/testing/testing.go:789 +0x2de
[WARNING] [12:19:12+0000] goroutine 65 [chan send, 8 minutes]:
[WARNING] [12:19:12+0000] testing.tRunner.func1(0xc4203554a0)
[WARNING] [12:19:12+0000] 	/usr/local/go/src/testing/testing.go:741 +0x19b
[WARNING] [12:19:12+0000] testing.tRunner(0xc4203554a0, 0xc420349500)
[WARNING] [12:19:12+0000] 	/usr/local/go/src/testing/testing.go:748 +0xda
[WARNING] [12:19:12+0000] created by testing.(*T).Run
[WARNING] [12:19:12+0000] 	/usr/local/go/src/testing/testing.go:789 +0x2de
[WARNING] [12:19:12+0000] goroutine 66 [chan send, 8 minutes]:
[WARNING] [12:19:12+0000] testing.tRunner.func1(0xc420355590)
[WARNING] [12:19:12+0000] 	/usr/local/go/src/testing/testing.go:741 +0x19b
[WARNING] [12:19:12+0000] testing.tRunner(0xc420355590, 0xc420349580)
[WARNING] [12:19:12+0000] 	/usr/local/go/src/testing/testing.go:748 +0xda
[WARNING] [12:19:12+0000] created by testing.(*T).Run
[WARNING] [12:19:12+0000] 	/usr/local/go/src/testing/testing.go:789 +0x2de
[WARNING] [12:19:12+0000] goroutine 67 [chan send, 8 minutes]:
[WARNING] [12:19:12+0000] testing.tRunner.func1(0xc420355680)
[WARNING] [12:19:12+0000] 	/usr/local/go/src/testing/testing.go:741 +0x19b
[WARNING] [12:19:12+0000] testing.tRunner(0xc420355680, 0xc420349600)
[WARNING] [12:19:12+0000] 	/usr/local/go/src/testing/testing.go:748 +0xda
[WARNING] [12:19:12+0000] created by testing.(*T).Run
[WARNING] [12:19:12+0000] 	/usr/local/go/src/testing/testing.go:789 +0x2de
[WARNING] [12:19:12+0000] goroutine 68 [chan send, 9 minutes]:
[WARNING] [12:19:12+0000] testing.tRunner.func1(0xc420355770)
[WARNING] [12:19:12+0000] 	/usr/local/go/src/testing/testing.go:741 +0x19b
[WARNING] [12:19:12+0000] testing.tRunner(0xc420355770, 0xc420349680)
[WARNING] [12:19:12+0000] 	/usr/local/go/src/testing/testing.go:748 +0xda
[WARNING] [12:19:12+0000] created by testing.(*T).Run
[WARNING] [12:19:12+0000] 	/usr/local/go/src/testing/testing.go:789 +0x2de
[WARNING] [12:19:12+0000] goroutine 69 [chan send, 8 minutes]:
[WARNING] [12:19:12+0000] testing.tRunner.func1(0xc420355860)
[WARNING] [12:19:12+0000] 	/usr/local/go/src/testing/testing.go:741 +0x19b
[WARNING] [12:19:12+0000] testing.tRunner(0xc420355860, 0xc420349700)
[WARNING] [12:19:12+0000] 	/usr/local/go/src/testing/testing.go:748 +0xda
[WARNING] [12:19:12+0000] created by testing.(*T).Run
[WARNING] [12:19:12+0000] 	/usr/local/go/src/testing/testing.go:789 +0x2de
[WARNING] [12:19:12+0000] goroutine 70 [chan send, 9 minutes]:
[WARNING] [12:19:12+0000] testing.tRunner.func1(0xc420355950)
[WARNING] [12:19:12+0000] 	/usr/local/go/src/testing/testing.go:741 +0x19b
[WARNING] [12:19:12+0000] testing.tRunner(0xc420355950, 0xc420349780)
[WARNING] [12:19:12+0000] 	/usr/local/go/src/testing/testing.go:748 +0xda
[WARNING] [12:19:12+0000] created by testing.(*T).Run
[WARNING] [12:19:12+0000] 	/usr/local/go/src/testing/testing.go:789 +0x2de
[WARNING] [12:19:12+0000] goroutine 71 [chan send, 9 minutes]:
[WARNING] [12:19:12+0000] testing.tRunner.func1(0xc420355a40)
[WARNING] [12:19:12+0000] 	/usr/local/go/src/testing/testing.go:741 +0x19b
[WARNING] [12:19:12+0000] testing.tRunner(0xc420355a40, 0xc420349800)
[WARNING] [12:19:12+0000] 	/usr/local/go/src/testing/testing.go:748 +0xda
[WARNING] [12:19:12+0000] created by testing.(*T).Run
[WARNING] [12:19:12+0000] 	/usr/local/go/src/testing/testing.go:789 +0x2de
[WARNING] [12:19:12+0000] goroutine 72 [chan send, 9 minutes]:
[WARNING] [12:19:12+0000] testing.tRunner.func1(0xc420355b30)
[WARNING] [12:19:12+0000] 	/usr/local/go/src/testing/testing.go:741 +0x19b
[WARNING] [12:19:12+0000] testing.tRunner(0xc420355b30, 0xc420349880)
[WARNING] [12:19:12+0000] 	/usr/local/go/src/testing/testing.go:748 +0xda
[WARNING] [12:19:12+0000] created by testing.(*T).Run
[WARNING] [12:19:12+0000] 	/usr/local/go/src/testing/testing.go:789 +0x2de
[WARNING] [12:19:12+0000] goroutine 73 [chan send, 9 minutes]:
[WARNING] [12:19:12+0000] testing.tRunner.func1(0xc420355c20)
[WARNING] [12:19:12+0000] 	/usr/local/go/src/testing/testing.go:741 +0x19b
[WARNING] [12:19:12+0000] testing.tRunner(0xc420355c20, 0xc420349900)
[WARNING] [12:19:12+0000] 	/usr/local/go/src/testing/testing.go:748 +0xda
[WARNING] [12:19:12+0000] created by testing.(*T).Run
[WARNING] [12:19:12+0000] 	/usr/local/go/src/testing/testing.go:789 +0x2de
[WARNING] [12:19:12+0000] goroutine 74 [chan send, 9 minutes]:
[WARNING] [12:19:12+0000] testing.tRunner.func1(0xc420355d10)
[WARNING] [12:19:12+0000] 	/usr/local/go/src/testing/testing.go:741 +0x19b
[WARNING] [12:19:12+0000] testing.tRunner(0xc420355d10, 0xc420349980)
[WARNING] [12:19:12+0000] 	/usr/local/go/src/testing/testing.go:748 +0xda
[WARNING] [12:19:12+0000] created by testing.(*T).Run
[WARNING] [12:19:12+0000] 	/usr/local/go/src/testing/testing.go:789 +0x2de
[WARNING] [12:19:12+0000] goroutine 75 [chan send, 10 minutes]:
[WARNING] [12:19:12+0000] testing.tRunner.func1(0xc420355e00)
[WARNING] [12:19:12+0000] 	/usr/local/go/src/testing/testing.go:741 +0x19b
[WARNING] [12:19:12+0000] testing.tRunner(0xc420355e00, 0xc420349a00)
[WARNING] [12:19:12+0000] 	/usr/local/go/src/testing/testing.go:748 +0xda
[WARNING] [12:19:12+0000] created by testing.(*T).Run
[WARNING] [12:19:12+0000] 	/usr/local/go/src/testing/testing.go:789 +0x2de
[WARNING] [12:19:12+0000] goroutine 76 [chan send, 10 minutes]:
[WARNING] [12:19:12+0000] testing.tRunner.func1(0xc420355ef0)
[WARNING] [12:19:12+0000] 	/usr/local/go/src/testing/testing.go:741 +0x19b
[WARNING] [12:19:12+0000] testing.tRunner(0xc420355ef0, 0xc420349a80)
[WARNING] [12:19:12+0000] 	/usr/local/go/src/testing/testing.go:748 +0xda
[WARNING] [12:19:12+0000] created by testing.(*T).Run
[WARNING] [12:19:12+0000] 	/usr/local/go/src/testing/testing.go:789 +0x2de
[WARNING] [12:19:12+0000] goroutine 77 [chan send, 11 minutes]:
[WARNING] [12:19:12+0000] testing.tRunner.func1(0xc4202da000)
[WARNING] [12:19:12+0000] 	/usr/local/go/src/testing/testing.go:741 +0x19b
[WARNING] [12:19:12+0000] testing.tRunner(0xc4202da000, 0xc420349b00)
[WARNING] [12:19:12+0000] 	/usr/local/go/src/testing/testing.go:748 +0xda
[WARNING] [12:19:12+0000] created by testing.(*T).Run
[WARNING] [12:19:12+0000] 	/usr/local/go/src/testing/testing.go:789 +0x2de
[WARNING] [12:19:12+0000] goroutine 78 [chan send, 11 minutes]:
[WARNING] [12:19:12+0000] testing.tRunner.func1(0xc4202da0f0)
[WARNING] [12:19:12+0000] 	/usr/local/go/src/testing/testing.go:741 +0x19b
[WARNING] [12:19:12+0000] testing.tRunner(0xc4202da0f0, 0xc420349b80)
[WARNING] [12:19:12+0000] 	/usr/local/go/src/testing/testing.go:748 +0xda
[WARNING] [12:19:12+0000] created by testing.(*T).Run
[WARNING] [12:19:12+0000] 	/usr/local/go/src/testing/testing.go:789 +0x2de
[WARNING] [12:19:12+0000] goroutine 79 [chan send, 11 minutes]:
[WARNING] [12:19:12+0000] testing.tRunner.func1(0xc4202da1e0)
[WARNING] [12:19:12+0000] 	/usr/local/go/src/testing/testing.go:741 +0x19b
[WARNING] [12:19:12+0000] testing.tRunner(0xc4202da1e0, 0xc420349c00)
[WARNING] [12:19:12+0000] 	/usr/local/go/src/testing/testing.go:748 +0xda
[WARNING] [12:19:12+0000] created by testing.(*T).Run
[WARNING] [12:19:12+0000] 	/usr/local/go/src/testing/testing.go:789 +0x2de
[WARNING] [12:19:12+0000] goroutine 80 [chan send, 11 minutes]:
[WARNING] [12:19:12+0000] testing.tRunner.func1(0xc4202da2d0)
[WARNING] [12:19:12+0000] 	/usr/local/go/src/testing/testing.go:741 +0x19b
[WARNING] [12:19:12+0000] testing.tRunner(0xc4202da2d0, 0xc420349c80)
[WARNING] [12:19:12+0000] 	/usr/local/go/src/testing/testing.go:748 +0xda
[WARNING] [12:19:12+0000] created by testing.(*T).Run
[WARNING] [12:19:12+0000] 	/usr/local/go/src/testing/testing.go:789 +0x2de
[WARNING] [12:19:12+0000] goroutine 81 [chan send, 11 minutes]:
[WARNING] [12:19:12+0000] testing.tRunner.func1(0xc4202da3c0)
[WARNING] [12:19:12+0000] 	/usr/local/go/src/testing/testing.go:741 +0x19b
[WARNING] [12:19:12+0000] testing.tRunner(0xc4202da3c0, 0xc420349d00)
[WARNING] [12:19:12+0000] 	/usr/local/go/src/testing/testing.go:748 +0xda
[WARNING] [12:19:12+0000] created by testing.(*T).Run
[WARNING] [12:19:12+0000] 	/usr/local/go/src/testing/testing.go:789 +0x2de
[WARNING] [12:19:12+0000] goroutine 82 [chan send, 11 minutes]:
[WARNING] [12:19:12+0000] testing.tRunner.func1(0xc4202da4b0)
[WARNING] [12:19:12+0000] 	/usr/local/go/src/testing/testing.go:741 +0x19b
[WARNING] [12:19:12+0000] testing.tRunner(0xc4202da4b0, 0xc420349d80)
[WARNING] [12:19:12+0000] 	/usr/local/go/src/testing/testing.go:748 +0xda
[WARNING] [12:19:12+0000] created by testing.(*T).Run
[WARNING] [12:19:12+0000] 	/usr/local/go/src/testing/testing.go:789 +0x2de
[WARNING] [12:19:12+0000] goroutine 83 [chan send, 11 minutes]:
[WARNING] [12:19:12+0000] testing.tRunner.func1(0xc4202da5a0)
[WARNING] [12:19:12+0000] 	/usr/local/go/src/testing/testing.go:741 +0x19b
[WARNING] [12:19:12+0000] testing.tRunner(0xc4202da5a0, 0xc420349e00)
[WARNING] [12:19:12+0000] 	/usr/local/go/src/testing/testing.go:748 +0xda
[WARNING] [12:19:12+0000] created by testing.(*T).Run
[WARNING] [12:19:12+0000] 	/usr/local/go/src/testing/testing.go:789 +0x2de
[WARNING] [12:19:12+0000] goroutine 84 [chan send, 11 minutes]:
[WARNING] [12:19:12+0000] testing.tRunner.func1(0xc4202da690)
[WARNING] [12:19:12+0000] 	/usr/local/go/src/testing/testing.go:741 +0x19b
[WARNING] [12:19:12+0000] testing.tRunner(0xc4202da690, 0xc420349e80)
[WARNING] [12:19:12+0000] 	/usr/local/go/src/testing/testing.go:748 +0xda
[WARNING] [12:19:12+0000] created by testing.(*T).Run
[WARNING] [12:19:12+0000] 	/usr/local/go/src/testing/testing.go:789 +0x2de
[WARNING] [12:19:12+0000] goroutine 85 [chan send, 11 minutes]:
[WARNING] [12:19:12+0000] testing.tRunner.func1(0xc4202da780)
[WARNING] [12:19:12+0000] 	/usr/local/go/src/testing/testing.go:741 +0x19b
[WARNING] [12:19:12+0000] testing.tRunner(0xc4202da780, 0xc420349f00)
[WARNING] [12:19:12+0000] 	/usr/local/go/src/testing/testing.go:748 +0xda
[WARNING] [12:19:12+0000] created by testing.(*T).Run
[WARNING] [12:19:12+0000] 	/usr/local/go/src/testing/testing.go:789 +0x2de
[WARNING] [12:19:12+0000] goroutine 86 [chan send, 8 minutes]:
[WARNING] [12:19:12+0000] testing.tRunner.func1(0xc4202da870)
[WARNING] [12:19:12+0000] 	/usr/local/go/src/testing/testing.go:741 +0x19b
[WARNING] [12:19:12+0000] testing.tRunner(0xc4202da870, 0xc420349f80)
[WARNING] [12:19:12+0000] 	/usr/local/go/src/testing/testing.go:748 +0xda
[WARNING] [12:19:12+0000] created by testing.(*T).Run
[WARNING] [12:19:12+0000] 	/usr/local/go/src/testing/testing.go:789 +0x2de
[WARNING] [12:19:12+0000] goroutine 87 [chan send, 11 minutes]:
[WARNING] [12:19:12+0000] testing.tRunner.func1(0xc4202da960)
[WARNING] [12:19:12+0000] 	/usr/local/go/src/testing/testing.go:741 +0x19b
[WARNING] [12:19:12+0000] testing.tRunner(0xc4202da960, 0xc420230000)
[WARNING] [12:19:12+0000] 	/usr/local/go/src/testing/testing.go:748 +0xda
[WARNING] [12:19:12+0000] created by testing.(*T).Run
[WARNING] [12:19:12+0000] 	/usr/local/go/src/testing/testing.go:789 +0x2de
[WARNING] [12:19:12+0000] goroutine 88 [chan send, 11 minutes]:
[WARNING] [12:19:12+0000] testing.tRunner.func1(0xc4202daa50)
[WARNING] [12:19:12+0000] 	/usr/local/go/src/testing/testing.go:741 +0x19b
[WARNING] [12:19:12+0000] testing.tRunner(0xc4202daa50, 0xc420230080)
[WARNING] [12:19:12+0000] 	/usr/local/go/src/testing/testing.go:748 +0xda
[WARNING] [12:19:12+0000] created by testing.(*T).Run
[WARNING] [12:19:12+0000] 	/usr/local/go/src/testing/testing.go:789 +0x2de
[WARNING] [12:19:12+0000] goroutine 89 [chan send, 11 minutes]:
[WARNING] [12:19:12+0000] testing.tRunner.func1(0xc4202dab40)
[WARNING] [12:19:12+0000] 	/usr/local/go/src/testing/testing.go:741 +0x19b
[WARNING] [12:19:12+0000] testing.tRunner(0xc4202dab40, 0xc420230100)
[WARNING] [12:19:12+0000] 	/usr/local/go/src/testing/testing.go:748 +0xda
[WARNING] [12:19:12+0000] created by testing.(*T).Run
[WARNING] [12:19:12+0000] 	/usr/local/go/src/testing/testing.go:789 +0x2de
[WARNING] [12:19:12+0000] goroutine 90 [chan send, 11 minutes]:
[WARNING] [12:19:12+0000] testing.tRunner.func1(0xc4202dac30)
[WARNING] [12:19:12+0000] 	/usr/local/go/src/testing/testing.go:741 +0x19b
[WARNING] [12:19:12+0000] testing.tRunner(0xc4202dac30, 0xc420230180)
[WARNING] [12:19:12+0000] 	/usr/local/go/src/testing/testing.go:748 +0xda
[WARNING] [12:19:12+0000] created by testing.(*T).Run
[WARNING] [12:19:12+0000] 	/usr/local/go/src/testing/testing.go:789 +0x2de
[WARNING] [12:19:12+0000] goroutine 91 [chan send, 12 minutes]:
[WARNING] [12:19:12+0000] testing.tRunner.func1(0xc4202dad20)
[WARNING] [12:19:12+0000] 	/usr/local/go/src/testing/testing.go:741 +0x19b
[WARNING] [12:19:12+0000] testing.tRunner(0xc4202dad20, 0xc420230200)
[WARNING] [12:19:12+0000] 	/usr/local/go/src/testing/testing.go:748 +0xda
[WARNING] [12:19:12+0000] created by testing.(*T).Run
[WARNING] [12:19:12+0000] 	/usr/local/go/src/testing/testing.go:789 +0x2de
[WARNING] [12:19:12+0000] goroutine 92 [chan send, 12 minutes]:
[WARNING] [12:19:12+0000] testing.tRunner.func1(0xc4202dae10)
[WARNING] [12:19:12+0000] 	/usr/local/go/src/testing/testing.go:741 +0x19b
[WARNING] [12:19:12+0000] testing.tRunner(0xc4202dae10, 0xc420230280)
[WARNING] [12:19:12+0000] 	/usr/local/go/src/testing/testing.go:748 +0xda
[WARNING] [12:19:12+0000] created by testing.(*T).Run
[WARNING] [12:19:12+0000] 	/usr/local/go/src/testing/testing.go:789 +0x2de
[WARNING] [12:19:12+0000] goroutine 93 [chan send, 12 minutes]:
[WARNING] [12:19:12+0000] testing.tRunner.func1(0xc4202daf00)
[WARNING] [12:19:12+0000] 	/usr/local/go/src/testing/testing.go:741 +0x19b
[WARNING] [12:19:12+0000] testing.tRunner(0xc4202daf00, 0xc420230300)
[WARNING] [12:19:12+0000] 	/usr/local/go/src/testing/testing.go:748 +0xda
[WARNING] [12:19:12+0000] created by testing.(*T).Run
[WARNING] [12:19:12+0000] 	/usr/local/go/src/testing/testing.go:789 +0x2de
[WARNING] [12:19:12+0000] goroutine 94 [chan send, 12 minutes]:
[WARNING] [12:19:12+0000] testing.tRunner.func1(0xc4202daff0)
[WARNING] [12:19:12+0000] 	/usr/local/go/src/testing/testing.go:741 +0x19b
[WARNING] [12:19:12+0000] testing.tRunner(0xc4202daff0, 0xc420230380)
[WARNING] [12:19:12+0000] 	/usr/local/go/src/testing/testing.go:748 +0xda
[WARNING] [12:19:12+0000] created by testing.(*T).Run
[WARNING] [12:19:12+0000] 	/usr/local/go/src/testing/testing.go:789 +0x2de
[WARNING] [12:19:12+0000] goroutine 95 [chan send, 13 minutes]:
[WARNING] [12:19:12+0000] testing.tRunner.func1(0xc4202db0e0)
[WARNING] [12:19:12+0000] 	/usr/local/go/src/testing/testing.go:741 +0x19b
[WARNING] [12:19:12+0000] testing.tRunner(0xc4202db0e0, 0xc420230400)
[WARNING] [12:19:12+0000] 	/usr/local/go/src/testing/testing.go:748 +0xda
[WARNING] [12:19:12+0000] created by testing.(*T).Run
[WARNING] [12:19:12+0000] 	/usr/local/go/src/testing/testing.go:789 +0x2de
[WARNING] [12:19:12+0000] goroutine 96 [chan send, 13 minutes]:
[WARNING] [12:19:12+0000] testing.tRunner.func1(0xc4202db1d0)
[WARNING] [12:19:12+0000] 	/usr/local/go/src/testing/testing.go:741 +0x19b
[WARNING] [12:19:12+0000] testing.tRunner(0xc4202db1d0, 0xc420230480)
[WARNING] [12:19:12+0000] 	/usr/local/go/src/testing/testing.go:748 +0xda
[WARNING] [12:19:12+0000] created by testing.(*T).Run
[WARNING] [12:19:12+0000] 	/usr/local/go/src/testing/testing.go:789 +0x2de
[WARNING] [12:19:12+0000] goroutine 97 [chan send, 14 minutes]:
[WARNING] [12:19:12+0000] testing.tRunner.func1(0xc4202db2c0)
[WARNING] [12:19:12+0000] 	/usr/local/go/src/testing/testing.go:741 +0x19b
[WARNING] [12:19:12+0000] testing.tRunner(0xc4202db2c0, 0xc420230500)
[WARNING] [12:19:12+0000] 	/usr/local/go/src/testing/testing.go:748 +0xda
[WARNING] [12:19:12+0000] created by testing.(*T).Run
[WARNING] [12:19:12+0000] 	/usr/local/go/src/testing/testing.go:789 +0x2de
[WARNING] [12:19:12+0000] goroutine 98 [chan send, 14 minutes]:
[WARNING] [12:19:12+0000] testing.tRunner.func1(0xc4202db3b0)
[WARNING] [12:19:12+0000] 	/usr/local/go/src/testing/testing.go:741 +0x19b
[WARNING] [12:19:12+0000] testing.tRunner(0xc4202db3b0, 0xc420230580)
[WARNING] [12:19:12+0000] 	/usr/local/go/src/testing/testing.go:748 +0xda
[WARNING] [12:19:12+0000] created by testing.(*T).Run
[WARNING] [12:19:12+0000] 	/usr/local/go/src/testing/testing.go:789 +0x2de
[WARNING] [12:19:12+0000] goroutine 99 [chan send, 14 minutes]:
[WARNING] [12:19:12+0000] testing.tRunner.func1(0xc4202db4a0)
[WARNING] [12:19:12+0000] 	/usr/local/go/src/testing/testing.go:741 +0x19b
[WARNING] [12:19:12+0000] testing.tRunner(0xc4202db4a0, 0xc420230600)
[WARNING] [12:19:12+0000] 	/usr/local/go/src/testing/testing.go:748 +0xda
[WARNING] [12:19:12+0000] created by testing.(*T).Run
[WARNING] [12:19:12+0000] 	/usr/local/go/src/testing/testing.go:789 +0x2de
[WARNING] [12:19:12+0000] goroutine 100 [chan send, 14 minutes]:
[WARNING] [12:19:12+0000] testing.tRunner.func1(0xc4202db590)
[WARNING] [12:19:12+0000] 	/usr/local/go/src/testing/testing.go:741 +0x19b
[WARNING] [12:19:12+0000] testing.tRunner(0xc4202db590, 0xc420230680)
[WARNING] [12:19:12+0000] 	/usr/local/go/src/testing/testing.go:748 +0xda
[WARNING] [12:19:12+0000] created by testing.(*T).Run
[WARNING] [12:19:12+0000] 	/usr/local/go/src/testing/testing.go:789 +0x2de
[WARNING] [12:19:12+0000] goroutine 101 [chan send, 14 minutes]:
[WARNING] [12:19:12+0000] testing.tRunner.func1(0xc4202db680)
[WARNING] [12:19:12+0000] 	/usr/local/go/src/testing/testing.go:741 +0x19b
[WARNING] [12:19:12+0000] testing.tRunner(0xc4202db680, 0xc420230700)
[WARNING] [12:19:12+0000] 	/usr/local/go/src/testing/testing.go:748 +0xda
[WARNING] [12:19:12+0000] created by testing.(*T).Run
[WARNING] [12:19:12+0000] 	/usr/local/go/src/testing/testing.go:789 +0x2de
[WARNING] [12:19:12+0000] goroutine 102 [chan send, 14 minutes]:
[WARNING] [12:19:12+0000] testing.tRunner.func1(0xc4202db770)
[WARNING] [12:19:12+0000] 	/usr/local/go/src/testing/testing.go:741 +0x19b
[WARNING] [12:19:12+0000] testing.tRunner(0xc4202db770, 0xc420230780)
[WARNING] [12:19:12+0000] 	/usr/local/go/src/testing/testing.go:748 +0xda
[WARNING] [12:19:12+0000] created by testing.(*T).Run
[WARNING] [12:19:12+0000] 	/usr/local/go/src/testing/testing.go:789 +0x2de
[WARNING] [12:19:12+0000] goroutine 103 [chan send, 14 minutes]:
[WARNING] [12:19:12+0000] testing.tRunner.func1(0xc4202db860)
[WARNING] [12:19:12+0000] 	/usr/local/go/src/testing/testing.go:741 +0x19b
[WARNING] [12:19:12+0000] testing.tRunner(0xc4202db860, 0xc420230800)
[WARNING] [12:19:12+0000] 	/usr/local/go/src/testing/testing.go:748 +0xda
[WARNING] [12:19:12+0000] created by testing.(*T).Run
[WARNING] [12:19:12+0000] 	/usr/local/go/src/testing/testing.go:789 +0x2de
[WARNING] [12:19:12+0000] goroutine 104 [chan send, 14 minutes]:
[WARNING] [12:19:12+0000] testing.tRunner.func1(0xc4202db950)
[WARNING] [12:19:12+0000] 	/usr/local/go/src/testing/testing.go:741 +0x19b
[WARNING] [12:19:12+0000] testing.tRunner(0xc4202db950, 0xc420230880)
[WARNING] [12:19:12+0000] 	/usr/local/go/src/testing/testing.go:748 +0xda
[WARNING] [12:19:12+0000] created by testing.(*T).Run
[WARNING] [12:19:12+0000] 	/usr/local/go/src/testing/testing.go:789 +0x2de
[WARNING] [12:19:12+0000] goroutine 105 [chan send, 15 minutes]:
[WARNING] [12:19:12+0000] testing.tRunner.func1(0xc4202dba40)
[WARNING] [12:19:12+0000] 	/usr/local/go/src/testing/testing.go:741 +0x19b
[WARNING] [12:19:12+0000] testing.tRunner(0xc4202dba40, 0xc420230900)
[WARNING] [12:19:12+0000] 	/usr/local/go/src/testing/testing.go:748 +0xda
[WARNING] [12:19:12+0000] created by testing.(*T).Run
[WARNING] [12:19:12+0000] 	/usr/local/go/src/testing/testing.go:789 +0x2de
[WARNING] [12:19:12+0000] goroutine 106 [chan send, 15 minutes]:
[WARNING] [12:19:12+0000] testing.tRunner.func1(0xc4202dbb30)
[WARNING] [12:19:12+0000] 	/usr/local/go/src/testing/testing.go:741 +0x19b
[WARNING] [12:19:12+0000] testing.tRunner(0xc4202dbb30, 0xc420230980)
[WARNING] [12:19:12+0000] 	/usr/local/go/src/testing/testing.go:748 +0xda
[WARNING] [12:19:12+0000] created by testing.(*T).Run
[WARNING] [12:19:12+0000] 	/usr/local/go/src/testing/testing.go:789 +0x2de
[WARNING] [12:19:12+0000] goroutine 107 [chan send, 15 minutes]:
[WARNING] [12:19:12+0000] testing.tRunner.func1(0xc4202dbc20)
[WARNING] [12:19:12+0000] 	/usr/local/go/src/testing/testing.go:741 +0x19b
[WARNING] [12:19:12+0000] testing.tRunner(0xc4202dbc20, 0xc420230a00)
[WARNING] [12:19:12+0000] 	/usr/local/go/src/testing/testing.go:748 +0xda
[WARNING] [12:19:12+0000] created by testing.(*T).Run
[WARNING] [12:19:12+0000] 	/usr/local/go/src/testing/testing.go:789 +0x2de
[WARNING] [12:19:12+0000] goroutine 108 [chan send, 16 minutes]:
[WARNING] [12:19:12+0000] testing.tRunner.func1(0xc4202dbd10)
[WARNING] [12:19:12+0000] 	/usr/local/go/src/testing/testing.go:741 +0x19b
[WARNING] [12:19:12+0000] testing.tRunner(0xc4202dbd10, 0xc420230a80)
[WARNING] [12:19:12+0000] 	/usr/local/go/src/testing/testing.go:748 +0xda
[WARNING] [12:19:12+0000] created by testing.(*T).Run
[WARNING] [12:19:12+0000] 	/usr/local/go/src/testing/testing.go:789 +0x2de
[WARNING] [12:19:12+0000] goroutine 109 [chan send, 16 minutes]:
[WARNING] [12:19:12+0000] testing.tRunner.func1(0xc4202dbe00)
[WARNING] [12:19:12+0000] 	/usr/local/go/src/testing/testing.go:741 +0x19b
[WARNING] [12:19:12+0000] testing.tRunner(0xc4202dbe00, 0xc420230b00)
[WARNING] [12:19:12+0000] 	/usr/local/go/src/testing/testing.go:748 +0xda
[WARNING] [12:19:12+0000] created by testing.(*T).Run
[WARNING] [12:19:12+0000] 	/usr/local/go/src/testing/testing.go:789 +0x2de
[WARNING] [12:19:12+0000] goroutine 110 [chan send, 16 minutes]:
[WARNING] [12:19:12+0000] testing.tRunner.func1(0xc4202dbef0)
[WARNING] [12:19:12+0000] 	/usr/local/go/src/testing/testing.go:741 +0x19b
[WARNING] [12:19:12+0000] testing.tRunner(0xc4202dbef0, 0xc420230b80)
[WARNING] [12:19:12+0000] 	/usr/local/go/src/testing/testing.go:748 +0xda
[WARNING] [12:19:12+0000] created by testing.(*T).Run
[WARNING] [12:19:12+0000] 	/usr/local/go/src/testing/testing.go:789 +0x2de
[WARNING] [12:19:12+0000] goroutine 111 [chan send, 16 minutes]:
[WARNING] [12:19:12+0000] testing.tRunner.func1(0xc420302000)
[WARNING] [12:19:12+0000] 	/usr/local/go/src/testing/testing.go:741 +0x19b
[WARNING] [12:19:12+0000] testing.tRunner(0xc420302000, 0xc420230c00)
[WARNING] [12:19:12+0000] 	/usr/local/go/src/testing/testing.go:748 +0xda
[WARNING] [12:19:12+0000] created by testing.(*T).Run
[WARNING] [12:19:12+0000] 	/usr/local/go/src/testing/testing.go:789 +0x2de
[WARNING] [12:19:12+0000] goroutine 112 [chan send, 31 minutes]:
[WARNING] [12:19:12+0000] testing.tRunner.func1(0xc4203020f0)
[WARNING] [12:19:12+0000] 	/usr/local/go/src/testing/testing.go:741 +0x19b
[WARNING] [12:19:12+0000] testing.tRunner(0xc4203020f0, 0xc420230c80)
[WARNING] [12:19:12+0000] 	/usr/local/go/src/testing/testing.go:748 +0xda
[WARNING] [12:19:12+0000] created by testing.(*T).Run
[WARNING] [12:19:12+0000] 	/usr/local/go/src/testing/testing.go:789 +0x2de
[WARNING] [12:19:12+0000] goroutine 113 [chan send, 16 minutes]:
[WARNING] [12:19:12+0000] testing.tRunner.func1(0xc4203021e0)
[WARNING] [12:19:12+0000] 	/usr/local/go/src/testing/testing.go:741 +0x19b
[WARNING] [12:19:12+0000] testing.tRunner(0xc4203021e0, 0xc420230d00)
[WARNING] [12:19:12+0000] 	/usr/local/go/src/testing/testing.go:748 +0xda
[WARNING] [12:19:12+0000] created by testing.(*T).Run
[WARNING] [12:19:12+0000] 	/usr/local/go/src/testing/testing.go:789 +0x2de
[WARNING] [12:19:12+0000] goroutine 114 [chan send, 16 minutes]:
[WARNING] [12:19:12+0000] testing.tRunner.func1(0xc4203022d0)
[WARNING] [12:19:12+0000] 	/usr/local/go/src/testing/testing.go:741 +0x19b
[WARNING] [12:19:12+0000] testing.tRunner(0xc4203022d0, 0xc420230d80)
[WARNING] [12:19:12+0000] 	/usr/local/go/src/testing/testing.go:748 +0xda
[WARNING] [12:19:12+0000] created by testing.(*T).Run
[WARNING] [12:19:12+0000] 	/usr/local/go/src/testing/testing.go:789 +0x2de
[WARNING] [12:19:12+0000] goroutine 115 [chan send, 16 minutes]:
[WARNING] [12:19:12+0000] testing.tRunner.func1(0xc4203023c0)
[WARNING] [12:19:12+0000] 	/usr/local/go/src/testing/testing.go:741 +0x19b
[WARNING] [12:19:12+0000] testing.tRunner(0xc4203023c0, 0xc420230e00)
[WARNING] [12:19:12+0000] 	/usr/local/go/src/testing/testing.go:748 +0xda
[WARNING] [12:19:12+0000] created by testing.(*T).Run
[WARNING] [12:19:12+0000] 	/usr/local/go/src/testing/testing.go:789 +0x2de
[WARNING] [12:19:12+0000] goroutine 116 [chan send, 16 minutes]:
[WARNING] [12:19:12+0000] testing.tRunner.func1(0xc4203024b0)
[WARNING] [12:19:12+0000] 	/usr/local/go/src/testing/testing.go:741 +0x19b
[WARNING] [12:19:12+0000] testing.tRunner(0xc4203024b0, 0xc420230e80)
[WARNING] [12:19:12+0000] 	/usr/local/go/src/testing/testing.go:748 +0xda
[WARNING] [12:19:12+0000] created by testing.(*T).Run
[WARNING] [12:19:12+0000] 	/usr/local/go/src/testing/testing.go:789 +0x2de
[WARNING] [12:19:12+0000] goroutine 117 [chan send, 16 minutes]:
[WARNING] [12:19:12+0000] testing.tRunner.func1(0xc4203025a0)
[WARNING] [12:19:12+0000] 	/usr/local/go/src/testing/testing.go:741 +0x19b
[WARNING] [12:19:12+0000] testing.tRunner(0xc4203025a0, 0xc420230f00)
[WARNING] [12:19:12+0000] 	/usr/local/go/src/testing/testing.go:748 +0xda
[WARNING] [12:19:12+0000] created by testing.(*T).Run
[WARNING] [12:19:12+0000] 	/usr/local/go/src/testing/testing.go:789 +0x2de
[WARNING] [12:19:12+0000] goroutine 118 [chan send, 15 minutes]:
[WARNING] [12:19:12+0000] testing.tRunner.func1(0xc420302690)
[WARNING] [12:19:12+0000] 	/usr/local/go/src/testing/testing.go:741 +0x19b
[WARNING] [12:19:12+0000] testing.tRunner(0xc420302690, 0xc420230f80)
[WARNING] [12:19:12+0000] 	/usr/local/go/src/testing/testing.go:748 +0xda
[WARNING] [12:19:12+0000] created by testing.(*T).Run
[WARNING] [12:19:12+0000] 	/usr/local/go/src/testing/testing.go:789 +0x2de
[WARNING] [12:19:12+0000] goroutine 119 [chan send, 16 minutes]:
[WARNING] [12:19:12+0000] testing.tRunner.func1(0xc420302780)
[WARNING] [12:19:12+0000] 	/usr/local/go/src/testing/testing.go:741 +0x19b
[WARNING] [12:19:12+0000] testing.tRunner(0xc420302780, 0xc420231000)
[WARNING] [12:19:12+0000] 	/usr/local/go/src/testing/testing.go:748 +0xda
[WARNING] [12:19:12+0000] created by testing.(*T).Run
[WARNING] [12:19:12+0000] 	/usr/local/go/src/testing/testing.go:789 +0x2de
[WARNING] [12:19:12+0000] goroutine 120 [chan send, 16 minutes]:
[WARNING] [12:19:12+0000] testing.tRunner.func1(0xc420302870)
[WARNING] [12:19:12+0000] 	/usr/local/go/src/testing/testing.go:741 +0x19b
[WARNING] [12:19:12+0000] testing.tRunner(0xc420302870, 0xc420231080)
[WARNING] [12:19:12+0000] 	/usr/local/go/src/testing/testing.go:748 +0xda
[WARNING] [12:19:12+0000] created by testing.(*T).Run
[WARNING] [12:19:12+0000] 	/usr/local/go/src/testing/testing.go:789 +0x2de
[WARNING] [12:19:12+0000] goroutine 121 [chan send, 16 minutes]:
[WARNING] [12:19:12+0000] testing.tRunner.func1(0xc420302960)
[WARNING] [12:19:12+0000] 	/usr/local/go/src/testing/testing.go:741 +0x19b
[WARNING] [12:19:12+0000] testing.tRunner(0xc420302960, 0xc420231100)
[WARNING] [12:19:12+0000] 	/usr/local/go/src/testing/testing.go:748 +0xda
[WARNING] [12:19:12+0000] created by testing.(*T).Run
[WARNING] [12:19:12+0000] 	/usr/local/go/src/testing/testing.go:789 +0x2de
[WARNING] [12:19:12+0000] goroutine 122 [chan send, 16 minutes]:
[WARNING] [12:19:12+0000] testing.tRunner.func1(0xc420302a50)
[WARNING] [12:19:12+0000] 	/usr/local/go/src/testing/testing.go:741 +0x19b
[WARNING] [12:19:12+0000] testing.tRunner(0xc420302a50, 0xc420231180)
[WARNING] [12:19:12+0000] 	/usr/local/go/src/testing/testing.go:748 +0xda
[WARNING] [12:19:12+0000] created by testing.(*T).Run
[WARNING] [12:19:12+0000] 	/usr/local/go/src/testing/testing.go:789 +0x2de
[WARNING] [12:19:12+0000] goroutine 123 [chan send, 17 minutes]:
[WARNING] [12:19:12+0000] testing.tRunner.func1(0xc420302b40)
[WARNING] [12:19:12+0000] 	/usr/local/go/src/testing/testing.go:741 +0x19b
[WARNING] [12:19:12+0000] testing.tRunner(0xc420302b40, 0xc420231200)
[WARNING] [12:19:12+0000] 	/usr/local/go/src/testing/testing.go:748 +0xda
[WARNING] [12:19:12+0000] created by testing.(*T).Run
[WARNING] [12:19:12+0000] 	/usr/local/go/src/testing/testing.go:789 +0x2de
[WARNING] [12:19:12+0000] goroutine 124 [chan send, 17 minutes]:
[WARNING] [12:19:12+0000] testing.tRunner.func1(0xc420302c30)
[WARNING] [12:19:12+0000] 	/usr/local/go/src/testing/testing.go:741 +0x19b
[WARNING] [12:19:12+0000] testing.tRunner(0xc420302c30, 0xc420231280)
[WARNING] [12:19:12+0000] 	/usr/local/go/src/testing/testing.go:748 +0xda
[WARNING] [12:19:12+0000] created by testing.(*T).Run
[WARNING] [12:19:12+0000] 	/usr/local/go/src/testing/testing.go:789 +0x2de
[WARNING] [12:19:12+0000] goroutine 125 [chan send, 18 minutes]:
[WARNING] [12:19:12+0000] testing.tRunner.func1(0xc420302d20)
[WARNING] [12:19:12+0000] 	/usr/local/go/src/testing/testing.go:741 +0x19b
[WARNING] [12:19:12+0000] testing.tRunner(0xc420302d20, 0xc420231300)
[WARNING] [12:19:12+0000] 	/usr/local/go/src/testing/testing.go:748 +0xda
[WARNING] [12:19:12+0000] created by testing.(*T).Run
[WARNING] [12:19:12+0000] 	/usr/local/go/src/testing/testing.go:789 +0x2de
[WARNING] [12:19:12+0000] goroutine 126 [chan send, 18 minutes]:
[WARNING] [12:19:12+0000] testing.tRunner.func1(0xc420302e10)
[WARNING] [12:19:12+0000] 	/usr/local/go/src/testing/testing.go:741 +0x19b
[WARNING] [12:19:12+0000] testing.tRunner(0xc420302e10, 0xc420231380)
[WARNING] [12:19:12+0000] 	/usr/local/go/src/testing/testing.go:748 +0xda
[WARNING] [12:19:12+0000] created by testing.(*T).Run
[WARNING] [12:19:12+0000] 	/usr/local/go/src/testing/testing.go:789 +0x2de
[WARNING] [12:19:12+0000] goroutine 127 [chan send, 18 minutes]:
[WARNING] [12:19:12+0000] testing.tRunner.func1(0xc420302f00)
[WARNING] [12:19:12+0000] 	/usr/local/go/src/testing/testing.go:741 +0x19b
[WARNING] [12:19:12+0000] testing.tRunner(0xc420302f00, 0xc420231400)
[WARNING] [12:19:12+0000] 	/usr/local/go/src/testing/testing.go:748 +0xda
[WARNING] [12:19:12+0000] created by testing.(*T).Run
[WARNING] [12:19:12+0000] 	/usr/local/go/src/testing/testing.go:789 +0x2de
[WARNING] [12:19:12+0000] goroutine 128 [chan send, 18 minutes]:
[WARNING] [12:19:12+0000] testing.tRunner.func1(0xc420302ff0)
[WARNING] [12:19:12+0000] 	/usr/local/go/src/testing/testing.go:741 +0x19b
[WARNING] [12:19:12+0000] testing.tRunner(0xc420302ff0, 0xc420231480)
[WARNING] [12:19:12+0000] 	/usr/local/go/src/testing/testing.go:748 +0xda
[WARNING] [12:19:12+0000] created by testing.(*T).Run
[WARNING] [12:19:12+0000] 	/usr/local/go/src/testing/testing.go:789 +0x2de
[WARNING] [12:19:12+0000] goroutine 129 [chan send, 19 minutes]:
[WARNING] [12:19:12+0000] testing.tRunner.func1(0xc4203030e0)
[WARNING] [12:19:12+0000] 	/usr/local/go/src/testing/testing.go:741 +0x19b
[WARNING] [12:19:12+0000] testing.tRunner(0xc4203030e0, 0xc420231500)
[WARNING] [12:19:12+0000] 	/usr/local/go/src/testing/testing.go:748 +0xda
[WARNING] [12:19:12+0000] created by testing.(*T).Run
[WARNING] [12:19:12+0000] 	/usr/local/go/src/testing/testing.go:789 +0x2de
[WARNING] [12:19:12+0000] goroutine 130 [chan send, 18 minutes]:
[WARNING] [12:19:12+0000] testing.tRunner.func1(0xc4203031d0)
[WARNING] [12:19:12+0000] 	/usr/local/go/src/testing/testing.go:741 +0x19b
[WARNING] [12:19:12+0000] testing.tRunner(0xc4203031d0, 0xc420231580)
[WARNING] [12:19:12+0000] 	/usr/local/go/src/testing/testing.go:748 +0xda
[WARNING] [12:19:12+0000] created by testing.(*T).Run
[WARNING] [12:19:12+0000] 	/usr/local/go/src/testing/testing.go:789 +0x2de
[WARNING] [12:19:12+0000] goroutine 131 [chan send, 19 minutes]:
[WARNING] [12:19:12+0000] testing.tRunner.func1(0xc4203032c0)
[WARNING] [12:19:12+0000] 	/usr/local/go/src/testing/testing.go:741 +0x19b
[WARNING] [12:19:12+0000] testing.tRunner(0xc4203032c0, 0xc420231600)
[WARNING] [12:19:12+0000] 	/usr/local/go/src/testing/testing.go:748 +0xda
[WARNING] [12:19:12+0000] created by testing.(*T).Run
[WARNING] [12:19:12+0000] 	/usr/local/go/src/testing/testing.go:789 +0x2de
[WARNING] [12:19:12+0000] goroutine 132 [chan send, 11 minutes]:
[WARNING] [12:19:12+0000] testing.tRunner.func1(0xc4203033b0)
[WARNING] [12:19:12+0000] 	/usr/local/go/src/testing/testing.go:741 +0x19b
[WARNING] [12:19:12+0000] testing.tRunner(0xc4203033b0, 0xc420231680)
[WARNING] [12:19:12+0000] 	/usr/local/go/src/testing/testing.go:748 +0xda
[WARNING] [12:19:12+0000] created by testing.(*T).Run
[WARNING] [12:19:12+0000] 	/usr/local/go/src/testing/testing.go:789 +0x2de
[WARNING] [12:19:12+0000] goroutine 133 [chan send, 14 minutes]:
[WARNING] [12:19:12+0000] testing.tRunner.func1(0xc4203034a0)
[WARNING] [12:19:12+0000] 	/usr/local/go/src/testing/testing.go:741 +0x19b
[WARNING] [12:19:12+0000] testing.tRunner(0xc4203034a0, 0xc420231700)
[WARNING] [12:19:12+0000] 	/usr/local/go/src/testing/testing.go:748 +0xda
[WARNING] [12:19:12+0000] created by testing.(*T).Run
[WARNING] [12:19:12+0000] 	/usr/local/go/src/testing/testing.go:789 +0x2de
[WARNING] [12:19:12+0000] goroutine 134 [chan send, 19 minutes]:
[WARNING] [12:19:12+0000] testing.tRunner.func1(0xc420303590)
[WARNING] [12:19:12+0000] 	/usr/local/go/src/testing/testing.go:741 +0x19b
[WARNING] [12:19:12+0000] testing.tRunner(0xc420303590, 0xc420231780)
[WARNING] [12:19:12+0000] 	/usr/local/go/src/testing/testing.go:748 +0xda
[WARNING] [12:19:12+0000] created by testing.(*T).Run
[WARNING] [12:19:12+0000] 	/usr/local/go/src/testing/testing.go:789 +0x2de
[WARNING] [12:19:12+0000] goroutine 135 [chan send, 19 minutes]:
[WARNING] [12:19:12+0000] testing.tRunner.func1(0xc420303680)
[WARNING] [12:19:12+0000] 	/usr/local/go/src/testing/testing.go:741 +0x19b
[WARNING] [12:19:12+0000] testing.tRunner(0xc420303680, 0xc420231800)
[WARNING] [12:19:12+0000] 	/usr/local/go/src/testing/testing.go:748 +0xda
[WARNING] [12:19:12+0000] created by testing.(*T).Run
[WARNING] [12:19:12+0000] 	/usr/local/go/src/testing/testing.go:789 +0x2de
[WARNING] [12:19:12+0000] goroutine 136 [chan send, 20 minutes]:
[WARNING] [12:19:12+0000] testing.tRunner.func1(0xc420303770)
[WARNING] [12:19:12+0000] 	/usr/local/go/src/testing/testing.go:741 +0x19b
[WARNING] [12:19:12+0000] testing.tRunner(0xc420303770, 0xc420231880)
[WARNING] [12:19:12+0000] 	/usr/local/go/src/testing/testing.go:748 +0xda
[WARNING] [12:19:12+0000] created by testing.(*T).Run
[WARNING] [12:19:12+0000] 	/usr/local/go/src/testing/testing.go:789 +0x2de
[WARNING] [12:19:12+0000] goroutine 137 [chan send, 20 minutes]:
[WARNING] [12:19:12+0000] testing.tRunner.func1(0xc420303860)
[WARNING] [12:19:12+0000] 	/usr/local/go/src/testing/testing.go:741 +0x19b
[WARNING] [12:19:12+0000] testing.tRunner(0xc420303860, 0xc420231900)
[WARNING] [12:19:12+0000] 	/usr/local/go/src/testing/testing.go:748 +0xda
[WARNING] [12:19:12+0000] created by testing.(*T).Run
[WARNING] [12:19:12+0000] 	/usr/local/go/src/testing/testing.go:789 +0x2de
[WARNING] [12:19:12+0000] goroutine 138 [chan send, 20 minutes]:
[WARNING] [12:19:12+0000] testing.tRunner.func1(0xc420303950)
[WARNING] [12:19:12+0000] 	/usr/local/go/src/testing/testing.go:741 +0x19b
[WARNING] [12:19:12+0000] testing.tRunner(0xc420303950, 0xc420231980)
[WARNING] [12:19:12+0000] 	/usr/local/go/src/testing/testing.go:748 +0xda
[WARNING] [12:19:12+0000] created by testing.(*T).Run
[WARNING] [12:19:12+0000] 	/usr/local/go/src/testing/testing.go:789 +0x2de
[WARNING] [12:19:12+0000] goroutine 139 [chan send, 20 minutes]:
[WARNING] [12:19:12+0000] testing.tRunner.func1(0xc420303a40)
[WARNING] [12:19:12+0000] 	/usr/local/go/src/testing/testing.go:741 +0x19b
[WARNING] [12:19:12+0000] testing.tRunner(0xc420303a40, 0xc420231a00)
[WARNING] [12:19:12+0000] 	/usr/local/go/src/testing/testing.go:748 +0xda
[WARNING] [12:19:12+0000] created by testing.(*T).Run
[WARNING] [12:19:12+0000] 	/usr/local/go/src/testing/testing.go:789 +0x2de
[WARNING] [12:19:12+0000] goroutine 140 [chan send, 20 minutes]:
[WARNING] [12:19:12+0000] testing.tRunner.func1(0xc420303b30)
[WARNING] [12:19:12+0000] 	/usr/local/go/src/testing/testing.go:741 +0x19b
[WARNING] [12:19:12+0000] testing.tRunner(0xc420303b30, 0xc420231a80)
[WARNING] [12:19:12+0000] 	/usr/local/go/src/testing/testing.go:748 +0xda
[WARNING] [12:19:12+0000] created by testing.(*T).Run
[WARNING] [12:19:12+0000] 	/usr/local/go/src/testing/testing.go:789 +0x2de
[WARNING] [12:19:12+0000] goroutine 141 [chan send, 20 minutes]:
[WARNING] [12:19:12+0000] testing.tRunner.func1(0xc420303c20)
[WARNING] [12:19:12+0000] 	/usr/local/go/src/testing/testing.go:741 +0x19b
[WARNING] [12:19:12+0000] testing.tRunner(0xc420303c20, 0xc420231b00)
[WARNING] [12:19:12+0000] 	/usr/local/go/src/testing/testing.go:748 +0xda
[WARNING] [12:19:12+0000] created by testing.(*T).Run
[WARNING] [12:19:12+0000] 	/usr/local/go/src/testing/testing.go:789 +0x2de
[WARNING] [12:19:12+0000] goroutine 142 [chan send, 21 minutes]:
[WARNING] [12:19:12+0000] testing.tRunner.func1(0xc420303d10)
[WARNING] [12:19:12+0000] 	/usr/local/go/src/testing/testing.go:741 +0x19b
[WARNING] [12:19:12+0000] testing.tRunner(0xc420303d10, 0xc420231b80)
[WARNING] [12:19:12+0000] 	/usr/local/go/src/testing/testing.go:748 +0xda
[WARNING] [12:19:12+0000] created by testing.(*T).Run
[WARNING] [12:19:12+0000] 	/usr/local/go/src/testing/testing.go:789 +0x2de
[WARNING] [12:19:12+0000] goroutine 143 [chan send, 21 minutes]:
[WARNING] [12:19:12+0000] testing.tRunner.func1(0xc420303e00)
[WARNING] [12:19:12+0000] 	/usr/local/go/src/testing/testing.go:741 +0x19b
[WARNING] [12:19:12+0000] testing.tRunner(0xc420303e00, 0xc420231c00)
[WARNING] [12:19:12+0000] 	/usr/local/go/src/testing/testing.go:748 +0xda
[WARNING] [12:19:12+0000] created by testing.(*T).Run
[WARNING] [12:19:12+0000] 	/usr/local/go/src/testing/testing.go:789 +0x2de
[WARNING] [12:19:12+0000] goroutine 144 [chan send, 21 minutes]:
[WARNING] [12:19:12+0000] testing.tRunner.func1(0xc420303ef0)
[WARNING] [12:19:12+0000] 	/usr/local/go/src/testing/testing.go:741 +0x19b
[WARNING] [12:19:12+0000] testing.tRunner(0xc420303ef0, 0xc420231c80)
[WARNING] [12:19:12+0000] 	/usr/local/go/src/testing/testing.go:748 +0xda
[WARNING] [12:19:12+0000] created by testing.(*T).Run
[WARNING] [12:19:12+0000] 	/usr/local/go/src/testing/testing.go:789 +0x2de
[WARNING] [12:19:12+0000] goroutine 145 [chan send, 21 minutes]:
[WARNING] [12:19:12+0000] testing.tRunner.func1(0xc420294000)
[WARNING] [12:19:12+0000] 	/usr/local/go/src/testing/testing.go:741 +0x19b
[WARNING] [12:19:12+0000] testing.tRunner(0xc420294000, 0xc420231d00)
[WARNING] [12:19:12+0000] 	/usr/local/go/src/testing/testing.go:748 +0xda
[WARNING] [12:19:12+0000] created by testing.(*T).Run
[WARNING] [12:19:12+0000] 	/usr/local/go/src/testing/testing.go:789 +0x2de
[WARNING] [12:19:12+0000] goroutine 146 [chan send, 21 minutes]:
[WARNING] [12:19:12+0000] testing.tRunner.func1(0xc4202940f0)
[WARNING] [12:19:12+0000] 	/usr/local/go/src/testing/testing.go:741 +0x19b
[WARNING] [12:19:12+0000] testing.tRunner(0xc4202940f0, 0xc420231d80)
[WARNING] [12:19:12+0000] 	/usr/local/go/src/testing/testing.go:748 +0xda
[WARNING] [12:19:12+0000] created by testing.(*T).Run
[WARNING] [12:19:12+0000] 	/usr/local/go/src/testing/testing.go:789 +0x2de
[WARNING] [12:19:12+0000] goroutine 147 [chan send, 21 minutes]:
[WARNING] [12:19:12+0000] testing.tRunner.func1(0xc4202941e0)
[WARNING] [12:19:12+0000] 	/usr/local/go/src/testing/testing.go:741 +0x19b
[WARNING] [12:19:12+0000] testing.tRunner(0xc4202941e0, 0xc420231e00)
[WARNING] [12:19:12+0000] 	/usr/local/go/src/testing/testing.go:748 +0xda
[WARNING] [12:19:12+0000] created by testing.(*T).Run
[WARNING] [12:19:12+0000] 	/usr/local/go/src/testing/testing.go:789 +0x2de
[WARNING] [12:19:12+0000] goroutine 148 [chan send, 21 minutes]:
[WARNING] [12:19:12+0000] testing.tRunner.func1(0xc4202942d0)
[WARNING] [12:19:12+0000] 	/usr/local/go/src/testing/testing.go:741 +0x19b
[WARNING] [12:19:12+0000] testing.tRunner(0xc4202942d0, 0xc420231e80)
[WARNING] [12:19:12+0000] 	/usr/local/go/src/testing/testing.go:748 +0xda
[WARNING] [12:19:12+0000] created by testing.(*T).Run
[WARNING] [12:19:12+0000] 	/usr/local/go/src/testing/testing.go:789 +0x2de
[WARNING] [12:19:12+0000] goroutine 149 [chan send, 21 minutes]:
[WARNING] [12:19:12+0000] testing.tRunner.func1(0xc4202943c0)
[WARNING] [12:19:12+0000] 	/usr/local/go/src/testing/testing.go:741 +0x19b
[WARNING] [12:19:12+0000] testing.tRunner(0xc4202943c0, 0xc420231f00)
[WARNING] [12:19:12+0000] 	/usr/local/go/src/testing/testing.go:748 +0xda
[WARNING] [12:19:12+0000] created by testing.(*T).Run
[WARNING] [12:19:12+0000] 	/usr/local/go/src/testing/testing.go:789 +0x2de
[WARNING] [12:19:12+0000] goroutine 150 [chan send, 22 minutes]:
[WARNING] [12:19:12+0000] testing.tRunner.func1(0xc4202944b0)
[WARNING] [12:19:12+0000] 	/usr/local/go/src/testing/testing.go:741 +0x19b
[WARNING] [12:19:12+0000] testing.tRunner(0xc4202944b0, 0xc420231f80)
[WARNING] [12:19:12+0000] 	/usr/local/go/src/testing/testing.go:748 +0xda
[WARNING] [12:19:12+0000] created by testing.(*T).Run
[WARNING] [12:19:12+0000] 	/usr/local/go/src/testing/testing.go:789 +0x2de
[WARNING] [12:19:12+0000] goroutine 151 [chan send, 22 minutes]:
[WARNING] [12:19:12+0000] testing.tRunner.func1(0xc4202945a0)
[WARNING] [12:19:12+0000] 	/usr/local/go/src/testing/testing.go:741 +0x19b
[WARNING] [12:19:12+0000] testing.tRunner(0xc4202945a0, 0xc42029e000)
[WARNING] [12:19:12+0000] 	/usr/local/go/src/testing/testing.go:748 +0xda
[WARNING] [12:19:12+0000] created by testing.(*T).Run
[WARNING] [12:19:12+0000] 	/usr/local/go/src/testing/testing.go:789 +0x2de
[WARNING] [12:19:12+0000] goroutine 152 [chan send, 22 minutes]:
[WARNING] [12:19:12+0000] testing.tRunner.func1(0xc420294690)
[WARNING] [12:19:12+0000] 	/usr/local/go/src/testing/testing.go:741 +0x19b
[WARNING] [12:19:12+0000] testing.tRunner(0xc420294690, 0xc42029e080)
[WARNING] [12:19:12+0000] 	/usr/local/go/src/testing/testing.go:748 +0xda
[WARNING] [12:19:12+0000] created by testing.(*T).Run
[WARNING] [12:19:12+0000] 	/usr/local/go/src/testing/testing.go:789 +0x2de
[WARNING] [12:19:12+0000] goroutine 153 [chan send, 22 minutes]:
[WARNING] [12:19:12+0000] testing.tRunner.func1(0xc420294780)
[WARNING] [12:19:12+0000] 	/usr/local/go/src/testing/testing.go:741 +0x19b
[WARNING] [12:19:12+0000] testing.tRunner(0xc420294780, 0xc42029e100)
[WARNING] [12:19:12+0000] 	/usr/local/go/src/testing/testing.go:748 +0xda
[WARNING] [12:19:12+0000] created by testing.(*T).Run
[WARNING] [12:19:12+0000] 	/usr/local/go/src/testing/testing.go:789 +0x2de
[WARNING] [12:19:12+0000] goroutine 154 [chan send, 22 minutes]:
[WARNING] [12:19:12+0000] testing.tRunner.func1(0xc420294870)
[WARNING] [12:19:12+0000] 	/usr/local/go/src/testing/testing.go:741 +0x19b
[WARNING] [12:19:12+0000] testing.tRunner(0xc420294870, 0xc42029e180)
[WARNING] [12:19:12+0000] 	/usr/local/go/src/testing/testing.go:748 +0xda
[WARNING] [12:19:12+0000] created by testing.(*T).Run
[WARNING] [12:19:12+0000] 	/usr/local/go/src/testing/testing.go:789 +0x2de
[WARNING] [12:19:12+0000] goroutine 155 [chan send, 23 minutes]:
[WARNING] [12:19:12+0000] testing.tRunner.func1(0xc420294960)
[WARNING] [12:19:12+0000] 	/usr/local/go/src/testing/testing.go:741 +0x19b
[WARNING] [12:19:12+0000] testing.tRunner(0xc420294960, 0xc42029e200)
[WARNING] [12:19:12+0000] 	/usr/local/go/src/testing/testing.go:748 +0xda
[WARNING] [12:19:12+0000] created by testing.(*T).Run
[WARNING] [12:19:12+0000] 	/usr/local/go/src/testing/testing.go:789 +0x2de
[WARNING] [12:19:12+0000] goroutine 156 [chan send, 23 minutes]:
[WARNING] [12:19:12+0000] testing.tRunner.func1(0xc420294a50)
[WARNING] [12:19:12+0000] 	/usr/local/go/src/testing/testing.go:741 +0x19b
[WARNING] [12:19:12+0000] testing.tRunner(0xc420294a50, 0xc42029e280)
[WARNING] [12:19:12+0000] 	/usr/local/go/src/testing/testing.go:748 +0xda
[WARNING] [12:19:12+0000] created by testing.(*T).Run
[WARNING] [12:19:12+0000] 	/usr/local/go/src/testing/testing.go:789 +0x2de
[WARNING] [12:19:12+0000] goroutine 157 [chan send, 23 minutes]:
[WARNING] [12:19:12+0000] testing.tRunner.func1(0xc420294b40)
[WARNING] [12:19:12+0000] 	/usr/local/go/src/testing/testing.go:741 +0x19b
[WARNING] [12:19:12+0000] testing.tRunner(0xc420294b40, 0xc42029e300)
[WARNING] [12:19:12+0000] 	/usr/local/go/src/testing/testing.go:748 +0xda
[WARNING] [12:19:12+0000] created by testing.(*T).Run
[WARNING] [12:19:12+0000] 	/usr/local/go/src/testing/testing.go:789 +0x2de
[WARNING] [12:19:12+0000] goroutine 158 [chan send, 23 minutes]:
[WARNING] [12:19:12+0000] testing.tRunner.func1(0xc420294c30)
[WARNING] [12:19:12+0000] 	/usr/local/go/src/testing/testing.go:741 +0x19b
[WARNING] [12:19:12+0000] testing.tRunner(0xc420294c30, 0xc42029e380)
[WARNING] [12:19:12+0000] 	/usr/local/go/src/testing/testing.go:748 +0xda
[WARNING] [12:19:12+0000] created by testing.(*T).Run
[WARNING] [12:19:12+0000] 	/usr/local/go/src/testing/testing.go:789 +0x2de
[WARNING] [12:19:12+0000] goroutine 159 [chan send, 24 minutes]:
[WARNING] [12:19:12+0000] testing.tRunner.func1(0xc420294d20)
[WARNING] [12:19:12+0000] 	/usr/local/go/src/testing/testing.go:741 +0x19b
[WARNING] [12:19:12+0000] testing.tRunner(0xc420294d20, 0xc42029e400)
[WARNING] [12:19:12+0000] 	/usr/local/go/src/testing/testing.go:748 +0xda
[WARNING] [12:19:12+0000] created by testing.(*T).Run
[WARNING] [12:19:12+0000] 	/usr/local/go/src/testing/testing.go:789 +0x2de
[WARNING] [12:19:12+0000] goroutine 160 [chan send, 24 minutes]:
[WARNING] [12:19:12+0000] testing.tRunner.func1(0xc420294e10)
[WARNING] [12:19:12+0000] 	/usr/local/go/src/testing/testing.go:741 +0x19b
[WARNING] [12:19:12+0000] testing.tRunner(0xc420294e10, 0xc42029e480)
[WARNING] [12:19:12+0000] 	/usr/local/go/src/testing/testing.go:748 +0xda
[WARNING] [12:19:12+0000] created by testing.(*T).Run
[WARNING] [12:19:12+0000] 	/usr/local/go/src/testing/testing.go:789 +0x2de
[WARNING] [12:19:12+0000] goroutine 161 [chan send, 24 minutes]:
[WARNING] [12:19:12+0000] testing.tRunner.func1(0xc420294f00)
[WARNING] [12:19:12+0000] 	/usr/local/go/src/testing/testing.go:741 +0x19b
[WARNING] [12:19:12+0000] testing.tRunner(0xc420294f00, 0xc42029e500)
[WARNING] [12:19:12+0000] 	/usr/local/go/src/testing/testing.go:748 +0xda
[WARNING] [12:19:12+0000] created by testing.(*T).Run
[WARNING] [12:19:12+0000] 	/usr/local/go/src/testing/testing.go:789 +0x2de
[WARNING] [12:19:12+0000] goroutine 162 [chan send, 24 minutes]:
[WARNING] [12:19:12+0000] testing.tRunner.func1(0xc420294ff0)
[WARNING] [12:19:12+0000] 	/usr/local/go/src/testing/testing.go:741 +0x19b
[WARNING] [12:19:12+0000] testing.tRunner(0xc420294ff0, 0xc42029e580)
[WARNING] [12:19:12+0000] 	/usr/local/go/src/testing/testing.go:748 +0xda
[WARNING] [12:19:12+0000] created by testing.(*T).Run
[WARNING] [12:19:12+0000] 	/usr/local/go/src/testing/testing.go:789 +0x2de
[WARNING] [12:19:12+0000] goroutine 163 [chan send, 24 minutes]:
[WARNING] [12:19:12+0000] testing.tRunner.func1(0xc4202950e0)
[WARNING] [12:19:12+0000] 	/usr/local/go/src/testing/testing.go:741 +0x19b
[WARNING] [12:19:12+0000] testing.tRunner(0xc4202950e0, 0xc42029e600)
[WARNING] [12:19:12+0000] 	/usr/local/go/src/testing/testing.go:748 +0xda
[WARNING] [12:19:12+0000] created by testing.(*T).Run
[WARNING] [12:19:12+0000] 	/usr/local/go/src/testing/testing.go:789 +0x2de
[WARNING] [12:19:12+0000] goroutine 164 [chan send, 24 minutes]:
[WARNING] [12:19:12+0000] testing.tRunner.func1(0xc4202951d0)
[WARNING] [12:19:12+0000] 	/usr/local/go/src/testing/testing.go:741 +0x19b
[WARNING] [12:19:12+0000] testing.tRunner(0xc4202951d0, 0xc42029e680)
[WARNING] [12:19:12+0000] 	/usr/local/go/src/testing/testing.go:748 +0xda
[WARNING] [12:19:12+0000] created by testing.(*T).Run
[WARNING] [12:19:12+0000] 	/usr/local/go/src/testing/testing.go:789 +0x2de
[WARNING] [12:19:12+0000] goroutine 165 [chan send, 24 minutes]:
[WARNING] [12:19:12+0000] testing.tRunner.func1(0xc4202952c0)
[WARNING] [12:19:12+0000] 	/usr/local/go/src/testing/testing.go:741 +0x19b
[WARNING] [12:19:12+0000] testing.tRunner(0xc4202952c0, 0xc42029e700)
[WARNING] [12:19:12+0000] 	/usr/local/go/src/testing/testing.go:748 +0xda
[WARNING] [12:19:12+0000] created by testing.(*T).Run
[WARNING] [12:19:12+0000] 	/usr/local/go/src/testing/testing.go:789 +0x2de
[WARNING] [12:19:12+0000] goroutine 166 [chan send, 24 minutes]:
[WARNING] [12:19:12+0000] testing.tRunner.func1(0xc4202953b0)
[WARNING] [12:19:12+0000] 	/usr/local/go/src/testing/testing.go:741 +0x19b
[WARNING] [12:19:12+0000] testing.tRunner(0xc4202953b0, 0xc42029e780)
[WARNING] [12:19:12+0000] 	/usr/local/go/src/testing/testing.go:748 +0xda
[WARNING] [12:19:12+0000] created by testing.(*T).Run
[WARNING] [12:19:12+0000] 	/usr/local/go/src/testing/testing.go:789 +0x2de
[WARNING] [12:19:12+0000] goroutine 167 [chan send, 24 minutes]:
[WARNING] [12:19:12+0000] testing.tRunner.func1(0xc4202954a0)
[WARNING] [12:19:12+0000] 	/usr/local/go/src/testing/testing.go:741 +0x19b
[WARNING] [12:19:12+0000] testing.tRunner(0xc4202954a0, 0xc42029e800)
[WARNING] [12:19:12+0000] 	/usr/local/go/src/testing/testing.go:748 +0xda
[WARNING] [12:19:12+0000] created by testing.(*T).Run
[WARNING] [12:19:12+0000] 	/usr/local/go/src/testing/testing.go:789 +0x2de
[WARNING] [12:19:12+0000] goroutine 168 [chan send, 23 minutes]:
[WARNING] [12:19:12+0000] testing.tRunner.func1(0xc420295590)
[WARNING] [12:19:12+0000] 	/usr/local/go/src/testing/testing.go:741 +0x19b
[WARNING] [12:19:12+0000] testing.tRunner(0xc420295590, 0xc42029e880)
[WARNING] [12:19:12+0000] 	/usr/local/go/src/testing/testing.go:748 +0xda
[WARNING] [12:19:12+0000] created by testing.(*T).Run
[WARNING] [12:19:12+0000] 	/usr/local/go/src/testing/testing.go:789 +0x2de
[WARNING] [12:19:12+0000] goroutine 169 [chan send, 23 minutes]:
[WARNING] [12:19:12+0000] testing.tRunner.func1(0xc420295680)
[WARNING] [12:19:12+0000] 	/usr/local/go/src/testing/testing.go:741 +0x19b
[WARNING] [12:19:12+0000] testing.tRunner(0xc420295680, 0xc42029e900)
[WARNING] [12:19:12+0000] 	/usr/local/go/src/testing/testing.go:748 +0xda
[WARNING] [12:19:12+0000] created by testing.(*T).Run
[WARNING] [12:19:12+0000] 	/usr/local/go/src/testing/testing.go:789 +0x2de
[WARNING] [12:19:12+0000] goroutine 170 [chan send, 23 minutes]:
[WARNING] [12:19:12+0000] testing.tRunner.func1(0xc420295770)
[WARNING] [12:19:12+0000] 	/usr/local/go/src/testing/testing.go:741 +0x19b
[WARNING] [12:19:12+0000] testing.tRunner(0xc420295770, 0xc42029e980)
[WARNING] [12:19:12+0000] 	/usr/local/go/src/testing/testing.go:748 +0xda
[WARNING] [12:19:12+0000] created by testing.(*T).Run
[WARNING] [12:19:12+0000] 	/usr/local/go/src/testing/testing.go:789 +0x2de
[WARNING] [12:19:12+0000] goroutine 171 [chan send, 24 minutes]:
[WARNING] [12:19:12+0000] testing.tRunner.func1(0xc420295860)
[WARNING] [12:19:12+0000] 	/usr/local/go/src/testing/testing.go:741 +0x19b
[WARNING] [12:19:12+0000] testing.tRunner(0xc420295860, 0xc42029ea00)
[WARNING] [12:19:12+0000] 	/usr/local/go/src/testing/testing.go:748 +0xda
[WARNING] [12:19:12+0000] created by testing.(*T).Run
[WARNING] [12:19:12+0000] 	/usr/local/go/src/testing/testing.go:789 +0x2de
[WARNING] [12:19:12+0000] goroutine 172 [chan send, 24 minutes]:
[WARNING] [12:19:12+0000] testing.tRunner.func1(0xc420295950)
[WARNING] [12:19:12+0000] 	/usr/local/go/src/testing/testing.go:741 +0x19b
[WARNING] [12:19:12+0000] testing.tRunner(0xc420295950, 0xc42029ea80)
[WARNING] [12:19:12+0000] 	/usr/local/go/src/testing/testing.go:748 +0xda
[WARNING] [12:19:12+0000] created by testing.(*T).Run
[WARNING] [12:19:12+0000] 	/usr/local/go/src/testing/testing.go:789 +0x2de
[WARNING] [12:19:12+0000] goroutine 173 [chan send, 24 minutes]:
[WARNING] [12:19:12+0000] testing.tRunner.func1(0xc420295a40)
[WARNING] [12:19:12+0000] 	/usr/local/go/src/testing/testing.go:741 +0x19b
[WARNING] [12:19:12+0000] testing.tRunner(0xc420295a40, 0xc42029eb00)
[WARNING] [12:19:12+0000] 	/usr/local/go/src/testing/testing.go:748 +0xda
[WARNING] [12:19:12+0000] created by testing.(*T).Run
[WARNING] [12:19:12+0000] 	/usr/local/go/src/testing/testing.go:789 +0x2de
[WARNING] [12:19:12+0000] goroutine 174 [chan send, 24 minutes]:
[WARNING] [12:19:12+0000] testing.tRunner.func1(0xc420295b30)
[WARNING] [12:19:12+0000] 	/usr/local/go/src/testing/testing.go:741 +0x19b
[WARNING] [12:19:12+0000] testing.tRunner(0xc420295b30, 0xc42029eb80)
[WARNING] [12:19:12+0000] 	/usr/local/go/src/testing/testing.go:748 +0xda
[WARNING] [12:19:12+0000] created by testing.(*T).Run
[WARNING] [12:19:12+0000] 	/usr/local/go/src/testing/testing.go:789 +0x2de
[WARNING] [12:19:12+0000] goroutine 175 [chan send, 24 minutes]:
[WARNING] [12:19:12+0000] testing.tRunner.func1(0xc420295c20)
[WARNING] [12:19:12+0000] 	/usr/local/go/src/testing/testing.go:741 +0x19b
[WARNING] [12:19:12+0000] testing.tRunner(0xc420295c20, 0xc42029ec00)
[WARNING] [12:19:12+0000] 	/usr/local/go/src/testing/testing.go:748 +0xda
[WARNING] [12:19:12+0000] created by testing.(*T).Run
[WARNING] [12:19:12+0000] 	/usr/local/go/src/testing/testing.go:789 +0x2de
[WARNING] [12:19:12+0000] goroutine 176 [chan send, 25 minutes]:
[WARNING] [12:19:12+0000] testing.tRunner.func1(0xc420295d10)
[WARNING] [12:19:12+0000] 	/usr/local/go/src/testing/testing.go:741 +0x19b
[WARNING] [12:19:12+0000] testing.tRunner(0xc420295d10, 0xc42029ec80)
[WARNING] [12:19:12+0000] 	/usr/local/go/src/testing/testing.go:748 +0xda
[WARNING] [12:19:12+0000] created by testing.(*T).Run
[WARNING] [12:19:12+0000] 	/usr/local/go/src/testing/testing.go:789 +0x2de
[WARNING] [12:19:12+0000] goroutine 177 [chan send, 25 minutes]:
[WARNING] [12:19:12+0000] testing.tRunner.func1(0xc420295e00)
[WARNING] [12:19:12+0000] 	/usr/local/go/src/testing/testing.go:741 +0x19b
[WARNING] [12:19:12+0000] testing.tRunner(0xc420295e00, 0xc42029ed00)
[WARNING] [12:19:12+0000] 	/usr/local/go/src/testing/testing.go:748 +0xda
[WARNING] [12:19:12+0000] created by testing.(*T).Run
[WARNING] [12:19:12+0000] 	/usr/local/go/src/testing/testing.go:789 +0x2de
[WARNING] [12:19:12+0000] goroutine 178 [chan send, 25 minutes]:
[WARNING] [12:19:12+0000] testing.tRunner.func1(0xc420295ef0)
[WARNING] [12:19:12+0000] 	/usr/local/go/src/testing/testing.go:741 +0x19b
[WARNING] [12:19:12+0000] testing.tRunner(0xc420295ef0, 0xc42029ed80)
[WARNING] [12:19:12+0000] 	/usr/local/go/src/testing/testing.go:748 +0xda
[WARNING] [12:19:12+0000] created by testing.(*T).Run
[WARNING] [12:19:12+0000] 	/usr/local/go/src/testing/testing.go:789 +0x2de
[WARNING] [12:19:12+0000] goroutine 179 [chan send, 25 minutes]:
[WARNING] [12:19:12+0000] testing.tRunner.func1(0xc4201be000)
[WARNING] [12:19:12+0000] 	/usr/local/go/src/testing/testing.go:741 +0x19b
[WARNING] [12:19:12+0000] testing.tRunner(0xc4201be000, 0xc42029ee00)
[WARNING] [12:19:12+0000] 	/usr/local/go/src/testing/testing.go:748 +0xda
[WARNING] [12:19:12+0000] created by testing.(*T).Run
[WARNING] [12:19:12+0000] 	/usr/local/go/src/testing/testing.go:789 +0x2de
[WARNING] [12:19:12+0000] goroutine 180 [chan send, 25 minutes]:
[WARNING] [12:19:12+0000] testing.tRunner.func1(0xc4201be0f0)
[WARNING] [12:19:12+0000] 	/usr/local/go/src/testing/testing.go:741 +0x19b
[WARNING] [12:19:12+0000] testing.tRunner(0xc4201be0f0, 0xc42029ee80)
[WARNING] [12:19:12+0000] 	/usr/local/go/src/testing/testing.go:748 +0xda
[WARNING] [12:19:12+0000] created by testing.(*T).Run
[WARNING] [12:19:12+0000] 	/usr/local/go/src/testing/testing.go:789 +0x2de
[WARNING] [12:19:12+0000] goroutine 181 [chan send, 25 minutes]:
[WARNING] [12:19:12+0000] testing.tRunner.func1(0xc4201be1e0)
[WARNING] [12:19:12+0000] 	/usr/local/go/src/testing/testing.go:741 +0x19b
[WARNING] [12:19:12+0000] testing.tRunner(0xc4201be1e0, 0xc42029ef00)
[WARNING] [12:19:12+0000] 	/usr/local/go/src/testing/testing.go:748 +0xda
[WARNING] [12:19:12+0000] created by testing.(*T).Run
[WARNING] [12:19:12+0000] 	/usr/local/go/src/testing/testing.go:789 +0x2de
[WARNING] [12:19:12+0000] goroutine 182 [chan send, 26 minutes]:
[WARNING] [12:19:12+0000] testing.tRunner.func1(0xc4201be2d0)
[WARNING] [12:19:12+0000] 	/usr/local/go/src/testing/testing.go:741 +0x19b
[WARNING] [12:19:12+0000] testing.tRunner(0xc4201be2d0, 0xc42029ef80)
[WARNING] [12:19:12+0000] 	/usr/local/go/src/testing/testing.go:748 +0xda
[WARNING] [12:19:12+0000] created by testing.(*T).Run
[WARNING] [12:19:12+0000] 	/usr/local/go/src/testing/testing.go:789 +0x2de
[WARNING] [12:19:12+0000] goroutine 183 [chan send, 26 minutes]:
[WARNING] [12:19:12+0000] testing.tRunner.func1(0xc4201be3c0)
[WARNING] [12:19:12+0000] 	/usr/local/go/src/testing/testing.go:741 +0x19b
[WARNING] [12:19:12+0000] testing.tRunner(0xc4201be3c0, 0xc42029f000)
[WARNING] [12:19:12+0000] 	/usr/local/go/src/testing/testing.go:748 +0xda
[WARNING] [12:19:12+0000] created by testing.(*T).Run
[WARNING] [12:19:12+0000] 	/usr/local/go/src/testing/testing.go:789 +0x2de
[WARNING] [12:19:12+0000] goroutine 184 [chan send, 26 minutes]:
[WARNING] [12:19:12+0000] testing.tRunner.func1(0xc4201be4b0)
[WARNING] [12:19:12+0000] 	/usr/local/go/src/testing/testing.go:741 +0x19b
[WARNING] [12:19:12+0000] testing.tRunner(0xc4201be4b0, 0xc42029f080)
[WARNING] [12:19:12+0000] 	/usr/local/go/src/testing/testing.go:748 +0xda
[WARNING] [12:19:12+0000] created by testing.(*T).Run
[WARNING] [12:19:12+0000] 	/usr/local/go/src/testing/testing.go:789 +0x2de
[WARNING] [12:19:12+0000] goroutine 185 [chan send, 26 minutes]:
[WARNING] [12:19:12+0000] testing.tRunner.func1(0xc4201be5a0)
[WARNING] [12:19:12+0000] 	/usr/local/go/src/testing/testing.go:741 +0x19b
[WARNING] [12:19:12+0000] testing.tRunner(0xc4201be5a0, 0xc42029f100)
[WARNING] [12:19:12+0000] 	/usr/local/go/src/testing/testing.go:748 +0xda
[WARNING] [12:19:12+0000] created by testing.(*T).Run
[WARNING] [12:19:12+0000] 	/usr/local/go/src/testing/testing.go:789 +0x2de
[WARNING] [12:19:12+0000] goroutine 186 [chan send, 26 minutes]:
[WARNING] [12:19:12+0000] testing.tRunner.func1(0xc4201be690)
[WARNING] [12:19:12+0000] 	/usr/local/go/src/testing/testing.go:741 +0x19b
[WARNING] [12:19:12+0000] testing.tRunner(0xc4201be690, 0xc42029f180)
[WARNING] [12:19:12+0000] 	/usr/local/go/src/testing/testing.go:748 +0xda
[WARNING] [12:19:12+0000] created by testing.(*T).Run
[WARNING] [12:19:12+0000] 	/usr/local/go/src/testing/testing.go:789 +0x2de
[WARNING] [12:19:12+0000] goroutine 187 [chan send, 26 minutes]:
[WARNING] [12:19:12+0000] testing.tRunner.func1(0xc4201be780)
[WARNING] [12:19:12+0000] 	/usr/local/go/src/testing/testing.go:741 +0x19b
[WARNING] [12:19:12+0000] testing.tRunner(0xc4201be780, 0xc42029f200)
[WARNING] [12:19:12+0000] 	/usr/local/go/src/testing/testing.go:748 +0xda
[WARNING] [12:19:12+0000] created by testing.(*T).Run
[WARNING] [12:19:12+0000] 	/usr/local/go/src/testing/testing.go:789 +0x2de
[WARNING] [12:19:12+0000] goroutine 188 [chan send, 26 minutes]:
[WARNING] [12:19:12+0000] testing.tRunner.func1(0xc4201be870)
[WARNING] [12:19:12+0000] 	/usr/local/go/src/testing/testing.go:741 +0x19b
[WARNING] [12:19:12+0000] testing.tRunner(0xc4201be870, 0xc42029f280)
[WARNING] [12:19:12+0000] 	/usr/local/go/src/testing/testing.go:748 +0xda
[WARNING] [12:19:12+0000] created by testing.(*T).Run
[WARNING] [12:19:12+0000] 	/usr/local/go/src/testing/testing.go:789 +0x2de
[WARNING] [12:19:12+0000] goroutine 189 [chan send, 26 minutes]:
[WARNING] [12:19:12+0000] testing.tRunner.func1(0xc4201be960)
[WARNING] [12:19:12+0000] 	/usr/local/go/src/testing/testing.go:741 +0x19b
[WARNING] [12:19:12+0000] testing.tRunner(0xc4201be960, 0xc42029f300)
[WARNING] [12:19:12+0000] 	/usr/local/go/src/testing/testing.go:748 +0xda
[WARNING] [12:19:12+0000] created by testing.(*T).Run
[WARNING] [12:19:12+0000] 	/usr/local/go/src/testing/testing.go:789 +0x2de
[WARNING] [12:19:12+0000] goroutine 190 [chan send, 27 minutes]:
[WARNING] [12:19:12+0000] testing.tRunner.func1(0xc4201bea50)
[WARNING] [12:19:12+0000] 	/usr/local/go/src/testing/testing.go:741 +0x19b
[WARNING] [12:19:12+0000] testing.tRunner(0xc4201bea50, 0xc42029f380)
[WARNING] [12:19:12+0000] 	/usr/local/go/src/testing/testing.go:748 +0xda
[WARNING] [12:19:12+0000] created by testing.(*T).Run
[WARNING] [12:19:12+0000] 	/usr/local/go/src/testing/testing.go:789 +0x2de
[WARNING] [12:19:12+0000] goroutine 191 [chan send, 28 minutes]:
[WARNING] [12:19:12+0000] testing.tRunner.func1(0xc4201beb40)
[WARNING] [12:19:12+0000] 	/usr/local/go/src/testing/testing.go:741 +0x19b
[WARNING] [12:19:12+0000] testing.tRunner(0xc4201beb40, 0xc42029f400)
[WARNING] [12:19:12+0000] 	/usr/local/go/src/testing/testing.go:748 +0xda
[WARNING] [12:19:12+0000] created by testing.(*T).Run
[WARNING] [12:19:12+0000] 	/usr/local/go/src/testing/testing.go:789 +0x2de
[WARNING] [12:19:12+0000] goroutine 192 [chan send, 28 minutes]:
[WARNING] [12:19:12+0000] testing.tRunner.func1(0xc4201bec30)
[WARNING] [12:19:12+0000] 	/usr/local/go/src/testing/testing.go:741 +0x19b
[WARNING] [12:19:12+0000] testing.tRunner(0xc4201bec30, 0xc42029f480)
[WARNING] [12:19:12+0000] 	/usr/local/go/src/testing/testing.go:748 +0xda
[WARNING] [12:19:12+0000] created by testing.(*T).Run
[WARNING] [12:19:12+0000] 	/usr/local/go/src/testing/testing.go:789 +0x2de
[WARNING] [12:19:12+0000] goroutine 193 [chan send, 27 minutes]:
[WARNING] [12:19:12+0000] testing.tRunner.func1(0xc4201bed20)
[WARNING] [12:19:12+0000] 	/usr/local/go/src/testing/testing.go:741 +0x19b
[WARNING] [12:19:12+0000] testing.tRunner(0xc4201bed20, 0xc42029f500)
[WARNING] [12:19:12+0000] 	/usr/local/go/src/testing/testing.go:748 +0xda
[WARNING] [12:19:12+0000] created by testing.(*T).Run
[WARNING] [12:19:12+0000] 	/usr/local/go/src/testing/testing.go:789 +0x2de
[WARNING] [12:19:12+0000] goroutine 194 [chan send, 27 minutes]:
[WARNING] [12:19:12+0000] testing.tRunner.func1(0xc4201bee10)
[WARNING] [12:19:12+0000] 	/usr/local/go/src/testing/testing.go:741 +0x19b
[WARNING] [12:19:12+0000] testing.tRunner(0xc4201bee10, 0xc42029f580)
[WARNING] [12:19:12+0000] 	/usr/local/go/src/testing/testing.go:748 +0xda
[WARNING] [12:19:12+0000] created by testing.(*T).Run
[WARNING] [12:19:12+0000] 	/usr/local/go/src/testing/testing.go:789 +0x2de
[WARNING] [12:19:12+0000] goroutine 195 [chan send, 28 minutes]:
[WARNING] [12:19:12+0000] testing.tRunner.func1(0xc4201bef00)
[WARNING] [12:19:12+0000] 	/usr/local/go/src/testing/testing.go:741 +0x19b
[WARNING] [12:19:12+0000] testing.tRunner(0xc4201bef00, 0xc42029f600)
[WARNING] [12:19:12+0000] 	/usr/local/go/src/testing/testing.go:748 +0xda
[WARNING] [12:19:12+0000] created by testing.(*T).Run
[WARNING] [12:19:12+0000] 	/usr/local/go/src/testing/testing.go:789 +0x2de
[WARNING] [12:19:12+0000] goroutine 196 [chan send, 27 minutes]:
[WARNING] [12:19:12+0000] testing.tRunner.func1(0xc4201beff0)
[WARNING] [12:19:12+0000] 	/usr/local/go/src/testing/testing.go:741 +0x19b
[WARNING] [12:19:12+0000] testing.tRunner(0xc4201beff0, 0xc42029f680)
[WARNING] [12:19:12+0000] 	/usr/local/go/src/testing/testing.go:748 +0xda
[WARNING] [12:19:12+0000] created by testing.(*T).Run
[WARNING] [12:19:12+0000] 	/usr/local/go/src/testing/testing.go:789 +0x2de
[WARNING] [12:19:12+0000] goroutine 197 [chan send, 28 minutes]:
[WARNING] [12:19:12+0000] testing.tRunner.func1(0xc4201bf0e0)
[WARNING] [12:19:12+0000] 	/usr/local/go/src/testing/testing.go:741 +0x19b
[WARNING] [12:19:12+0000] testing.tRunner(0xc4201bf0e0, 0xc42029f700)
[WARNING] [12:19:12+0000] 	/usr/local/go/src/testing/testing.go:748 +0xda
[WARNING] [12:19:12+0000] created by testing.(*T).Run
[WARNING] [12:19:12+0000] 	/usr/local/go/src/testing/testing.go:789 +0x2de
[WARNING] [12:19:12+0000] goroutine 198 [chan send, 28 minutes]:
[WARNING] [12:19:12+0000] testing.tRunner.func1(0xc4201bf1d0)
[WARNING] [12:19:12+0000] 	/usr/local/go/src/testing/testing.go:741 +0x19b
[WARNING] [12:19:12+0000] testing.tRunner(0xc4201bf1d0, 0xc42029f780)
[WARNING] [12:19:12+0000] 	/usr/local/go/src/testing/testing.go:748 +0xda
[WARNING] [12:19:12+0000] created by testing.(*T).Run
[WARNING] [12:19:12+0000] 	/usr/local/go/src/testing/testing.go:789 +0x2de
[WARNING] [12:19:12+0000] goroutine 199 [chan send, 28 minutes]:
[WARNING] [12:19:12+0000] testing.tRunner.func1(0xc4201bf2c0)
[WARNING] [12:19:12+0000] 	/usr/local/go/src/testing/testing.go:741 +0x19b
[WARNING] [12:19:12+0000] testing.tRunner(0xc4201bf2c0, 0xc42029f800)
[WARNING] [12:19:12+0000] 	/usr/local/go/src/testing/testing.go:748 +0xda
[WARNING] [12:19:12+0000] created by testing.(*T).Run
[WARNING] [12:19:12+0000] 	/usr/local/go/src/testing/testing.go:789 +0x2de
[WARNING] [12:19:12+0000] goroutine 200 [chan send, 28 minutes]:
[WARNING] [12:19:12+0000] testing.tRunner.func1(0xc4201bf3b0)
[WARNING] [12:19:12+0000] 	/usr/local/go/src/testing/testing.go:741 +0x19b
[WARNING] [12:19:12+0000] testing.tRunner(0xc4201bf3b0, 0xc42029f880)
[WARNING] [12:19:12+0000] 	/usr/local/go/src/testing/testing.go:748 +0xda
[WARNING] [12:19:12+0000] created by testing.(*T).Run
[WARNING] [12:19:12+0000] 	/usr/local/go/src/testing/testing.go:789 +0x2de
[WARNING] [12:19:12+0000] goroutine 201 [chan send, 28 minutes]:
[WARNING] [12:19:12+0000] testing.tRunner.func1(0xc4201bf4a0)
[WARNING] [12:19:12+0000] 	/usr/local/go/src/testing/testing.go:741 +0x19b
[WARNING] [12:19:12+0000] testing.tRunner(0xc4201bf4a0, 0xc42029f900)
[WARNING] [12:19:12+0000] 	/usr/local/go/src/testing/testing.go:748 +0xda
[WARNING] [12:19:12+0000] created by testing.(*T).Run
[WARNING] [12:19:12+0000] 	/usr/local/go/src/testing/testing.go:789 +0x2de
[WARNING] [12:19:12+0000] goroutine 202 [chan send, 29 minutes]:
[WARNING] [12:19:12+0000] testing.tRunner.func1(0xc4201bf590)
[WARNING] [12:19:12+0000] 	/usr/local/go/src/testing/testing.go:741 +0x19b
[WARNING] [12:19:12+0000] testing.tRunner(0xc4201bf590, 0xc42029f980)
[WARNING] [12:19:12+0000] 	/usr/local/go/src/testing/testing.go:748 +0xda
[WARNING] [12:19:12+0000] created by testing.(*T).Run
[WARNING] [12:19:12+0000] 	/usr/local/go/src/testing/testing.go:789 +0x2de
[WARNING] [12:19:12+0000] goroutine 203 [chan send, 29 minutes]:
[WARNING] [12:19:12+0000] testing.tRunner.func1(0xc4201bf680)
[WARNING] [12:19:12+0000] 	/usr/local/go/src/testing/testing.go:741 +0x19b
[WARNING] [12:19:12+0000] testing.tRunner(0xc4201bf680, 0xc42029fa00)
[WARNING] [12:19:12+0000] 	/usr/local/go/src/testing/testing.go:748 +0xda
[WARNING] [12:19:12+0000] created by testing.(*T).Run
[WARNING] [12:19:12+0000] 	/usr/local/go/src/testing/testing.go:789 +0x2de
[WARNING] [12:19:12+0000] goroutine 204 [chan send, 29 minutes]:
[WARNING] [12:19:12+0000] testing.tRunner.func1(0xc4201bf770)
[WARNING] [12:19:12+0000] 	/usr/local/go/src/testing/testing.go:741 +0x19b
[WARNING] [12:19:12+0000] testing.tRunner(0xc4201bf770, 0xc42029fa80)
[WARNING] [12:19:12+0000] 	/usr/local/go/src/testing/testing.go:748 +0xda
[WARNING] [12:19:12+0000] created by testing.(*T).Run
[WARNING] [12:19:12+0000] 	/usr/local/go/src/testing/testing.go:789 +0x2de
[WARNING] [12:19:12+0000] goroutine 205 [chan send, 29 minutes]:
[WARNING] [12:19:12+0000] testing.tRunner.func1(0xc4201bf860)
[WARNING] [12:19:12+0000] 	/usr/local/go/src/testing/testing.go:741 +0x19b
[WARNING] [12:19:12+0000] testing.tRunner(0xc4201bf860, 0xc42029fb00)
[WARNING] [12:19:12+0000] 	/usr/local/go/src/testing/testing.go:748 +0xda
[WARNING] [12:19:12+0000] created by testing.(*T).Run
[WARNING] [12:19:12+0000] 	/usr/local/go/src/testing/testing.go:789 +0x2de
[WARNING] [12:19:12+0000] goroutine 206 [chan send, 30 minutes]:
[WARNING] [12:19:12+0000] testing.tRunner.func1(0xc4201bf950)
[WARNING] [12:19:12+0000] 	/usr/local/go/src/testing/testing.go:741 +0x19b
[WARNING] [12:19:12+0000] testing.tRunner(0xc4201bf950, 0xc42029fb80)
[WARNING] [12:19:12+0000] 	/usr/local/go/src/testing/testing.go:748 +0xda
[WARNING] [12:19:12+0000] created by testing.(*T).Run
[WARNING] [12:19:12+0000] 	/usr/local/go/src/testing/testing.go:789 +0x2de
[WARNING] [12:19:12+0000] goroutine 207 [chan send, 30 minutes]:
[WARNING] [12:19:12+0000] testing.tRunner.func1(0xc4201bfa40)
[WARNING] [12:19:12+0000] 	/usr/local/go/src/testing/testing.go:741 +0x19b
[WARNING] [12:19:12+0000] testing.tRunner(0xc4201bfa40, 0xc42029fc00)
[WARNING] [12:19:12+0000] 	/usr/local/go/src/testing/testing.go:748 +0xda
[WARNING] [12:19:12+0000] created by testing.(*T).Run
[WARNING] [12:19:12+0000] 	/usr/local/go/src/testing/testing.go:789 +0x2de
[WARNING] [12:19:12+0000] goroutine 208 [chan send, 30 minutes]:
[WARNING] [12:19:12+0000] testing.tRunner.func1(0xc4201bfb30)
[WARNING] [12:19:12+0000] 	/usr/local/go/src/testing/testing.go:741 +0x19b
[WARNING] [12:19:12+0000] testing.tRunner(0xc4201bfb30, 0xc42029fc80)
[WARNING] [12:19:12+0000] 	/usr/local/go/src/testing/testing.go:748 +0xda
[WARNING] [12:19:12+0000] created by testing.(*T).Run
[WARNING] [12:19:12+0000] 	/usr/local/go/src/testing/testing.go:789 +0x2de
[WARNING] [12:19:12+0000] goroutine 209 [chan send, 30 minutes]:
[WARNING] [12:19:12+0000] testing.tRunner.func1(0xc4201bfc20)
[WARNING] [12:19:12+0000] 	/usr/local/go/src/testing/testing.go:741 +0x19b
[WARNING] [12:19:12+0000] testing.tRunner(0xc4201bfc20, 0xc42029fd00)
[WARNING] [12:19:12+0000] 	/usr/local/go/src/testing/testing.go:748 +0xda
[WARNING] [12:19:12+0000] created by testing.(*T).Run
[WARNING] [12:19:12+0000] 	/usr/local/go/src/testing/testing.go:789 +0x2de
[WARNING] [12:19:12+0000] goroutine 210 [chan send, 30 minutes]:
[WARNING] [12:19:12+0000] testing.tRunner.func1(0xc4201bfd10)
[WARNING] [12:19:12+0000] 	/usr/local/go/src/testing/testing.go:741 +0x19b
[WARNING] [12:19:12+0000] testing.tRunner(0xc4201bfd10, 0xc42029fd80)
[WARNING] [12:19:12+0000] 	/usr/local/go/src/testing/testing.go:748 +0xda
[WARNING] [12:19:12+0000] created by testing.(*T).Run
[WARNING] [12:19:12+0000] 	/usr/local/go/src/testing/testing.go:789 +0x2de
[WARNING] [12:19:12+0000] goroutine 211 [chan send, 30 minutes]:
[WARNING] [12:19:12+0000] testing.tRunner.func1(0xc4201bfe00)
[WARNING] [12:19:12+0000] 	/usr/local/go/src/testing/testing.go:741 +0x19b
[WARNING] [12:19:12+0000] testing.tRunner(0xc4201bfe00, 0xc42029fe00)
[WARNING] [12:19:12+0000] 	/usr/local/go/src/testing/testing.go:748 +0xda
[WARNING] [12:19:12+0000] created by testing.(*T).Run
[WARNING] [12:19:12+0000] 	/usr/local/go/src/testing/testing.go:789 +0x2de
[WARNING] [12:19:12+0000] goroutine 212 [chan send, 30 minutes]:
[WARNING] [12:19:12+0000] testing.tRunner.func1(0xc4201bfef0)
[WARNING] [12:19:12+0000] 	/usr/local/go/src/testing/testing.go:741 +0x19b
[WARNING] [12:19:12+0000] testing.tRunner(0xc4201bfef0, 0xc42029fe80)
[WARNING] [12:19:12+0000] 	/usr/local/go/src/testing/testing.go:748 +0xda
[WARNING] [12:19:12+0000] created by testing.(*T).Run
[WARNING] [12:19:12+0000] 	/usr/local/go/src/testing/testing.go:789 +0x2de
[WARNING] [12:19:12+0000] goroutine 407 [IO wait]:
[WARNING] [12:19:12+0000] internal/poll.runtime_pollWait(0x7fc21e01bc70, 0x72, 0x1)
[WARNING] [12:19:12+0000] 	/usr/local/go/src/runtime/netpoll.go:173 +0x57
[WARNING] [12:19:12+0000] internal/poll.(*pollDesc).wait(0xc420078bf8, 0x72, 0xffffffffffffff01, 0x6a6b20, 0x6a51d0)
[WARNING] [12:19:12+0000] 	/usr/local/go/src/internal/poll/fd_poll_runtime.go:85 +0xae
[WARNING] [12:19:12+0000] internal/poll.(*pollDesc).waitRead(0xc420078bf8, 0xc420edce01, 0xfe8, 0xfe8)
[WARNING] [12:19:12+0000] 	/usr/local/go/src/internal/poll/fd_poll_runtime.go:90 +0x3d
[WARNING] [12:19:12+0000] internal/poll.(*FD).Read(0xc420078be0, 0xc420edce18, 0xfe8, 0xfe8, 0x0, 0x0, 0x0)
[WARNING] [12:19:12+0000] 	/usr/local/go/src/internal/poll/fd_unix.go:125 +0x18a
[WARNING] [12:19:12+0000] os.(*File).read(0xc42000c160, 0xc420edce18, 0xfe8, 0xfe8, 0xf5, 0x0, 0x0)
[WARNING] [12:19:12+0000] 	/usr/local/go/src/os/file_unix.go:216 +0x4e
[WARNING] [12:19:12+0000] os.(*File).Read(0xc42000c160, 0xc420edce18, 0xfe8, 0xfe8, 0xf5, 0x0, 0x0)
[WARNING] [12:19:12+0000] 	/usr/local/go/src/os/file.go:103 +0x6d
[WARNING] [12:19:12+0000] bytes.(*Buffer).ReadFrom(0xc4200983f0, 0x6a65e0, 0xc42000c160, 0x7fc21de17028, 0xc4200983f0, 0xc42044e901)
[WARNING] [12:19:12+0000] 	/usr/local/go/src/bytes/buffer.go:209 +0x177
[WARNING] [12:19:12+0000] io.copyBuffer(0x6a63e0, 0xc4200983f0, 0x6a65e0, 0xc42000c160, 0x0, 0x0, 0x0, 0xff, 0xc420353740, 0x45c136)
[WARNING] [12:19:12+0000] 	/usr/local/go/src/io/io.go:386 +0x2bb
[WARNING] [12:19:12+0000] io.Copy(0x6a63e0, 0xc4200983f0, 0x6a65e0, 0xc42000c160, 0x6db09f500000008, 0x5b02b1e7, 0xc420353798)
[WARNING] [12:19:12+0000] 	/usr/local/go/src/io/io.go:362 +0x68
[WARNING] [12:19:12+0000] os/exec.(*Cmd).writerDescriptor.func1(0x4ddc00, 0xc4200b8f00)
[WARNING] [12:19:12+0000] 	/usr/local/go/src/os/exec/exec.go:264 +0x4d
[WARNING] [12:19:12+0000] os/exec.(*Cmd).Start.func1(0xc4202e2840, 0xc42000a460)
[WARNING] [12:19:12+0000] 	/usr/local/go/src/os/exec/exec.go:380 +0x27
[WARNING] [12:19:12+0000] created by os/exec.(*Cmd).Start
[WARNING] [12:19:12+0000] 	/usr/local/go/src/os/exec/exec.go:379 +0x646
[WARNING] [12:19:12+0000] goroutine 405 [IO wait]:
[WARNING] [12:19:12+0000] internal/poll.runtime_pollWait(0x7fc21e01bdf0, 0x72, 0x1)
[WARNING] [12:19:12+0000] 	/usr/local/go/src/runtime/netpoll.go:173 +0x57
[WARNING] [12:19:12+0000] internal/poll.(*pollDesc).wait(0xc420078798, 0x72, 0xffffffffffffff01, 0x6a6b20, 0x6a51d0)
[WARNING] [12:19:12+0000] 	/usr/local/go/src/internal/poll/fd_poll_runtime.go:85 +0xae
[WARNING] [12:19:12+0000] internal/poll.(*pollDesc).waitRead(0xc420078798, 0xc4aca04401, 0x3d934, 0x3d934)
[WARNING] [12:19:12+0000] 	/usr/local/go/src/internal/poll/fd_poll_runtime.go:90 +0x3d
[WARNING] [12:19:12+0000] internal/poll.(*FD).Read(0xc420078780, 0xc4aca044cc, 0x3d934, 0x3d934, 0x0, 0x0, 0x0)
[WARNING] [12:19:12+0000] 	/usr/local/go/src/internal/poll/fd_unix.go:125 +0x18a
[WARNING] [12:19:12+0000] os.(*File).read(0xc42000c0d0, 0xc4aca044cc, 0x3d934, 0x3d934, 0x177, 0x0, 0x0)
[WARNING] [12:19:12+0000] 	/usr/local/go/src/os/file_unix.go:216 +0x4e
[WARNING] [12:19:12+0000] os.(*File).Read(0xc42000c0d0, 0xc4aca044cc, 0x3d934, 0x3d934, 0x177, 0x0, 0x0)
[WARNING] [12:19:12+0000] 	/usr/local/go/src/os/file.go:103 +0x6d
[WARNING] [12:19:12+0000] bytes.(*Buffer).ReadFrom(0xc420098230, 0x6a65e0, 0xc42000c0d0, 0x7fc21de17028, 0xc420098230, 0xc42044e901)
[WARNING] [12:19:12+0000] 	/usr/local/go/src/bytes/buffer.go:209 +0x177
[WARNING] [12:19:12+0000] io.copyBuffer(0x6a63e0, 0xc420098230, 0x6a65e0, 0xc42000c0d0, 0x0, 0x0, 0x0, 0xff, 0xc420353f40, 0x45c136)
[WARNING] [12:19:12+0000] 	/usr/local/go/src/io/io.go:386 +0x2bb
[WARNING] [12:19:12+0000] io.Copy(0x6a63e0, 0xc420098230, 0x6a65e0, 0xc42000c0d0, 0x6dbfd8d00000008, 0x5b02b1e7, 0xc420353f98)
[WARNING] [12:19:12+0000] 	/usr/local/go/src/io/io.go:362 +0x68
[WARNING] [12:19:12+0000] os/exec.(*Cmd).writerDescriptor.func1(0x4ddc00, 0xc4200b90e0)
[WARNING] [12:19:12+0000] 	/usr/local/go/src/os/exec/exec.go:264 +0x4d
[WARNING] [12:19:12+0000] os/exec.(*Cmd).Start.func1(0xc4202e2580, 0xc42000a2e0)
[WARNING] [12:19:12+0000] 	/usr/local/go/src/os/exec/exec.go:380 +0x27
[WARNING] [12:19:12+0000] created by os/exec.(*Cmd).Start
[WARNING] [12:19:12+0000] 	/usr/local/go/src/os/exec/exec.go:379 +0x646 
[INFO] [12:19:13+0000] jUnit XML report placed at _output/scripts/test-integration/artifacts/gotest_report_4klFb.xml
Of 0 tests executed in 0.000s, 0 succeeded, 0 failed, and 0 were skipped.
[WARNING] [12:19:13+0000] While the jUnit report found no failed tests, the `go test` process failed.
[WARNING] [12:19:13+0000] This usually means that the unit test suite failed to compile.
[ERROR] [12:19:13+0000] hack/test-go.sh exited with code 1 after 00h 31m 23s
[ERROR] [12:19:13+0000] PID 1239: hack/test-integration.sh:18: `COVERAGE_SPEC=" " DETECT_RACES=false TMPDIR="${BASETMPDIR}" TIMEOUT=45m GOTEST_FLAGS="${gotest_flags}" "${OS_ROOT}/hack/test-go.sh" "test/integration/runner"` exited with status 1.
[INFO] [12:19:13+0000] 		Stack Trace: 
[INFO] [12:19:13+0000] 		  1: hack/test-integration.sh:18: `COVERAGE_SPEC=" " DETECT_RACES=false TMPDIR="${BASETMPDIR}" TIMEOUT=45m GOTEST_FLAGS="${gotest_flags}" "${OS_ROOT}/hack/test-go.sh" "test/integration/runner"`
[INFO] [12:19:13+0000]   Exiting with code 1.
make: *** [test-integration] Error 1
[WARNING] [12:19:14+0000] Copying _output/local/releases from the container failed!
[WARNING] [12:19:14+0000] Error response from daemon: lstat /var/lib/docker/overlay2/dad7bcd5e421c931f7b9dcd92b3499f3510b7ebf973ed3718d0190be8744034d/merged/go/src/github.com/openshift/origin/_output/local/releases: no such file or directory
[ERROR] [12:19:14+0000] PID 10819: hack/lib/build/environment.sh:172: `return "${exitcode}"` exited with status 2.
[INFO] [12:19:14+0000] 		Stack Trace: 
[INFO] [12:19:14+0000] 		  1: hack/lib/build/environment.sh:172: `return "${exitcode}"`
[INFO] [12:19:14+0000] 		  2: hack/lib/build/environment.sh:281: os::build::environment::withsource
[INFO] [12:19:14+0000] 		  3: hack/env:42: os::build::environment::run
[INFO] [12:19:14+0000]   Exiting with code 2.
++ export status=FAILURE
++ status=FAILURE
+ set +o xtrace
########## FINISHED STAGE: FAILURE: RUN INTEGRATION TESTS [00h 43m 22s] ##########
Build step 'Execute shell' marked build as failure
[PostBuildScript] - Executing post build scripts.
[workspace] $ /bin/bash /tmp/jenkins3529338490883972210.sh
########## STARTING STAGE: DOWNLOAD ARTIFACTS FROM THE REMOTE HOST ##########
+ [[ -s /var/lib/jenkins/jobs/test_pull_request_origin_integration/workspace/activate ]]
+ source /var/lib/jenkins/jobs/test_pull_request_origin_integration/workspace/activate
++ export VIRTUAL_ENV=/var/lib/jenkins/origin-ci-tool/7a5c5e83c372ad2e6b3b64b3efa16fe2cb37ef83
++ VIRTUAL_ENV=/var/lib/jenkins/origin-ci-tool/7a5c5e83c372ad2e6b3b64b3efa16fe2cb37ef83
++ export PATH=/var/lib/jenkins/origin-ci-tool/7a5c5e83c372ad2e6b3b64b3efa16fe2cb37ef83/bin:/sbin:/usr/sbin:/bin:/usr/bin
++ PATH=/var/lib/jenkins/origin-ci-tool/7a5c5e83c372ad2e6b3b64b3efa16fe2cb37ef83/bin:/sbin:/usr/sbin:/bin:/usr/bin
++ unset PYTHON_HOME
++ export OCT_CONFIG_HOME=/var/lib/jenkins/jobs/test_pull_request_origin_integration/workspace/.config
++ OCT_CONFIG_HOME=/var/lib/jenkins/jobs/test_pull_request_origin_integration/workspace/.config
+ trap 'exit 0' EXIT
++ pwd
+ ARTIFACT_DIR=/var/lib/jenkins/jobs/test_pull_request_origin_integration/workspace/artifacts/gathered
+ rm -rf /var/lib/jenkins/jobs/test_pull_request_origin_integration/workspace/artifacts/gathered
+ mkdir -p /var/lib/jenkins/jobs/test_pull_request_origin_integration/workspace/artifacts/gathered
+ ssh -F /var/lib/jenkins/jobs/test_pull_request_origin_integration/workspace/.config/origin-ci-tool/inventory/.ssh_config openshiftdevel sudo stat /data/src/github.com/openshift/origin/_output/scripts
  File: ‘/data/src/github.com/openshift/origin/_output/scripts’
  Size: 61        	Blocks: 0          IO Block: 4096   directory
Device: ca02h/51714d	Inode: 92483226    Links: 5
Access: (2755/drwxr-sr-x)  Uid: ( 1001/  origin)   Gid: ( 1003/origin-git)
Context: unconfined_u:object_r:container_file_t:s0
Access: 1970-01-01 00:00:00.000000000 +0000
Modify: 2018-05-21 11:37:28.000000000 +0000
Change: 2018-05-21 12:19:14.588415929 +0000
 Birth: -
+ ssh -F /var/lib/jenkins/jobs/test_pull_request_origin_integration/workspace/.config/origin-ci-tool/inventory/.ssh_config openshiftdevel sudo chmod -R o+rX /data/src/github.com/openshift/origin/_output/scripts
+ scp -r -F /var/lib/jenkins/jobs/test_pull_request_origin_integration/workspace/.config/origin-ci-tool/inventory/.ssh_config openshiftdevel:/data/src/github.com/openshift/origin/_output/scripts /var/lib/jenkins/jobs/test_pull_request_origin_integration/workspace/artifacts/gathered
+ tree /var/lib/jenkins/jobs/test_pull_request_origin_integration/workspace/artifacts/gathered
/var/lib/jenkins/jobs/test_pull_request_origin_integration/workspace/artifacts/gathered
└── scripts
    ├── shell
    │   ├── artifacts
    │   ├── logs
    │   │   ├── f94cfb3a2d71f43199abb6125b18463f50e895959656f212276053751c04474f.json
    │   │   └── scripts.log
    │   └── openshift.local.home
    ├── test-integration
    │   ├── artifacts
    │   │   ├── gotest_report_4klFb
    │   │   └── gotest_report_4klFb.xml
    │   ├── logs
    │   │   ├── raw_test_output.log
    │   │   ├── scripts.log
    │   │   └── test-go-err.log
    │   └── openshift.local.home
    └── test-tools
        ├── artifacts
        ├── logs
        │   ├── raw_test_output.log
        │   └── scripts.log
        └── openshift.local.home

13 directories, 9 files
+ exit 0
[workspace] $ /bin/bash /tmp/jenkins4898569531493912857.sh
########## STARTING STAGE: GENERATE ARTIFACTS FROM THE REMOTE HOST ##########
+ [[ -s /var/lib/jenkins/jobs/test_pull_request_origin_integration/workspace/activate ]]
+ source /var/lib/jenkins/jobs/test_pull_request_origin_integration/workspace/activate
++ export VIRTUAL_ENV=/var/lib/jenkins/origin-ci-tool/7a5c5e83c372ad2e6b3b64b3efa16fe2cb37ef83
++ VIRTUAL_ENV=/var/lib/jenkins/origin-ci-tool/7a5c5e83c372ad2e6b3b64b3efa16fe2cb37ef83
++ export PATH=/var/lib/jenkins/origin-ci-tool/7a5c5e83c372ad2e6b3b64b3efa16fe2cb37ef83/bin:/sbin:/usr/sbin:/bin:/usr/bin
++ PATH=/var/lib/jenkins/origin-ci-tool/7a5c5e83c372ad2e6b3b64b3efa16fe2cb37ef83/bin:/sbin:/usr/sbin:/bin:/usr/bin
++ unset PYTHON_HOME
++ export OCT_CONFIG_HOME=/var/lib/jenkins/jobs/test_pull_request_origin_integration/workspace/.config
++ OCT_CONFIG_HOME=/var/lib/jenkins/jobs/test_pull_request_origin_integration/workspace/.config
+ trap 'exit 0' EXIT
++ pwd
+ ARTIFACT_DIR=/var/lib/jenkins/jobs/test_pull_request_origin_integration/workspace/artifacts/generated
+ rm -rf /var/lib/jenkins/jobs/test_pull_request_origin_integration/workspace/artifacts/generated
+ mkdir /var/lib/jenkins/jobs/test_pull_request_origin_integration/workspace/artifacts/generated
+ ssh -F /var/lib/jenkins/jobs/test_pull_request_origin_integration/workspace/.config/origin-ci-tool/inventory/.ssh_config openshiftdevel 'sudo docker version && sudo docker info && sudo docker images && sudo docker ps -a 2>&1'
  WARNING: You're not using the default seccomp profile
+ ssh -F /var/lib/jenkins/jobs/test_pull_request_origin_integration/workspace/.config/origin-ci-tool/inventory/.ssh_config openshiftdevel 'sudo cat /etc/sysconfig/docker /etc/sysconfig/docker-network /etc/sysconfig/docker-storage /etc/sysconfig/docker-storage-setup /etc/systemd/system/docker.service 2>&1'
+ true
+ ssh -F /var/lib/jenkins/jobs/test_pull_request_origin_integration/workspace/.config/origin-ci-tool/inventory/.ssh_config openshiftdevel 'sudo find /var/lib/docker/containers -name *.log | sudo xargs tail -vn +1 2>&1'
+ ssh -F /var/lib/jenkins/jobs/test_pull_request_origin_integration/workspace/.config/origin-ci-tool/inventory/.ssh_config openshiftdevel 'oc get --raw /metrics --server=https://$( uname --nodename ):10250 --config=/etc/origin/master/admin.kubeconfig 2>&1'
+ true
+ ssh -F /var/lib/jenkins/jobs/test_pull_request_origin_integration/workspace/.config/origin-ci-tool/inventory/.ssh_config openshiftdevel 'sudo ausearch -m AVC -m SELINUX_ERR -m USER_AVC 2>&1'
+ true
+ ssh -F /var/lib/jenkins/jobs/test_pull_request_origin_integration/workspace/.config/origin-ci-tool/inventory/.ssh_config openshiftdevel 'oc get --raw /metrics --config=/etc/origin/master/admin.kubeconfig 2>&1'
+ true
+ ssh -F /var/lib/jenkins/jobs/test_pull_request_origin_integration/workspace/.config/origin-ci-tool/inventory/.ssh_config openshiftdevel 'sudo df -T -h && sudo pvs && sudo vgs && sudo lvs && sudo findmnt --all 2>&1'
+ ssh -F /var/lib/jenkins/jobs/test_pull_request_origin_integration/workspace/.config/origin-ci-tool/inventory/.ssh_config openshiftdevel 'sudo yum list installed 2>&1'
+ ssh -F /var/lib/jenkins/jobs/test_pull_request_origin_integration/workspace/.config/origin-ci-tool/inventory/.ssh_config openshiftdevel 'sudo journalctl --dmesg --no-pager --all --lines=all 2>&1'
+ ssh -F /var/lib/jenkins/jobs/test_pull_request_origin_integration/workspace/.config/origin-ci-tool/inventory/.ssh_config openshiftdevel 'sudo journalctl _PID=1 --no-pager --all --lines=all 2>&1'
+ tree /var/lib/jenkins/jobs/test_pull_request_origin_integration/workspace/artifacts/generated
/var/lib/jenkins/jobs/test_pull_request_origin_integration/workspace/artifacts/generated
├── avc_denials.log
├── containers.log
├── dmesg.log
├── docker.config
├── docker.info
├── filesystem.info
├── installed_packages.log
├── master-metrics.log
├── node-metrics.log
└── pid1.journal

0 directories, 10 files
+ exit 0
[workspace] $ /bin/bash /tmp/jenkins8518181005826224544.sh
########## STARTING STAGE: FETCH SYSTEMD JOURNALS FROM THE REMOTE HOST ##########
+ [[ -s /var/lib/jenkins/jobs/test_pull_request_origin_integration/workspace/activate ]]
+ source /var/lib/jenkins/jobs/test_pull_request_origin_integration/workspace/activate
++ export VIRTUAL_ENV=/var/lib/jenkins/origin-ci-tool/7a5c5e83c372ad2e6b3b64b3efa16fe2cb37ef83
++ VIRTUAL_ENV=/var/lib/jenkins/origin-ci-tool/7a5c5e83c372ad2e6b3b64b3efa16fe2cb37ef83
++ export PATH=/var/lib/jenkins/origin-ci-tool/7a5c5e83c372ad2e6b3b64b3efa16fe2cb37ef83/bin:/sbin:/usr/sbin:/bin:/usr/bin
++ PATH=/var/lib/jenkins/origin-ci-tool/7a5c5e83c372ad2e6b3b64b3efa16fe2cb37ef83/bin:/sbin:/usr/sbin:/bin:/usr/bin
++ unset PYTHON_HOME
++ export OCT_CONFIG_HOME=/var/lib/jenkins/jobs/test_pull_request_origin_integration/workspace/.config
++ OCT_CONFIG_HOME=/var/lib/jenkins/jobs/test_pull_request_origin_integration/workspace/.config
+ trap 'exit 0' EXIT
++ pwd
+ ARTIFACT_DIR=/var/lib/jenkins/jobs/test_pull_request_origin_integration/workspace/artifacts/journals
+ rm -rf /var/lib/jenkins/jobs/test_pull_request_origin_integration/workspace/artifacts/journals
+ mkdir /var/lib/jenkins/jobs/test_pull_request_origin_integration/workspace/artifacts/journals
+ ssh -F /var/lib/jenkins/jobs/test_pull_request_origin_integration/workspace/.config/origin-ci-tool/inventory/.ssh_config openshiftdevel sudo journalctl --unit docker.service --no-pager --all --lines=all
+ ssh -F /var/lib/jenkins/jobs/test_pull_request_origin_integration/workspace/.config/origin-ci-tool/inventory/.ssh_config openshiftdevel sudo journalctl --unit dnsmasq.service --no-pager --all --lines=all
+ ssh -F /var/lib/jenkins/jobs/test_pull_request_origin_integration/workspace/.config/origin-ci-tool/inventory/.ssh_config openshiftdevel sudo journalctl --unit systemd-journald.service --no-pager --all --lines=all
+ tree /var/lib/jenkins/jobs/test_pull_request_origin_integration/workspace/artifacts/journals
/var/lib/jenkins/jobs/test_pull_request_origin_integration/workspace/artifacts/journals
├── dnsmasq.service
├── docker.service
└── systemd-journald.service

0 directories, 3 files
+ exit 0
[workspace] $ /bin/bash /tmp/jenkins7387607614233258024.sh
########## STARTING STAGE: ASSEMBLE GCS OUTPUT ##########
+ [[ -s /var/lib/jenkins/jobs/test_pull_request_origin_integration/workspace/activate ]]
+ source /var/lib/jenkins/jobs/test_pull_request_origin_integration/workspace/activate
++ export VIRTUAL_ENV=/var/lib/jenkins/origin-ci-tool/7a5c5e83c372ad2e6b3b64b3efa16fe2cb37ef83
++ VIRTUAL_ENV=/var/lib/jenkins/origin-ci-tool/7a5c5e83c372ad2e6b3b64b3efa16fe2cb37ef83
++ export PATH=/var/lib/jenkins/origin-ci-tool/7a5c5e83c372ad2e6b3b64b3efa16fe2cb37ef83/bin:/sbin:/usr/sbin:/bin:/usr/bin
++ PATH=/var/lib/jenkins/origin-ci-tool/7a5c5e83c372ad2e6b3b64b3efa16fe2cb37ef83/bin:/sbin:/usr/sbin:/bin:/usr/bin
++ unset PYTHON_HOME
++ export OCT_CONFIG_HOME=/var/lib/jenkins/jobs/test_pull_request_origin_integration/workspace/.config
++ OCT_CONFIG_HOME=/var/lib/jenkins/jobs/test_pull_request_origin_integration/workspace/.config
+ trap 'exit 0' EXIT
+ mkdir -p gcs/artifacts gcs/artifacts/generated gcs/artifacts/journals gcs/artifacts/gathered
++ python -c 'import json; import urllib; print json.load(urllib.urlopen('\''https://ci.openshift.redhat.com/jenkins/job/test_pull_request_origin_integration/17978/api/json'\''))['\''result'\'']'
+ result=FAILURE
+ cat
++ date +%s
+ cat /var/lib/jenkins/jobs/test_pull_request_origin_integration/builds/17978/log
+ cp artifacts/generated/avc_denials.log artifacts/generated/containers.log artifacts/generated/dmesg.log artifacts/generated/docker.config artifacts/generated/docker.info artifacts/generated/filesystem.info artifacts/generated/installed_packages.log artifacts/generated/master-metrics.log artifacts/generated/node-metrics.log artifacts/generated/pid1.journal gcs/artifacts/generated/
+ cp artifacts/journals/dnsmasq.service artifacts/journals/docker.service artifacts/journals/systemd-journald.service gcs/artifacts/journals/
+ cp -r artifacts/gathered/scripts gcs/artifacts/
++ pwd
+ scp -F /var/lib/jenkins/jobs/test_pull_request_origin_integration/workspace/.config/origin-ci-tool/inventory/.ssh_config -r /var/lib/jenkins/jobs/test_pull_request_origin_integration/workspace/gcs openshiftdevel:/data
+ scp -F /var/lib/jenkins/jobs/test_pull_request_origin_integration/workspace/.config/origin-ci-tool/inventory/.ssh_config /var/lib/jenkins/.config/gcloud/gcs-publisher-credentials.json openshiftdevel:/data/credentials.json
+ exit 0
[workspace] $ /bin/bash /tmp/jenkins2586986278360988715.sh
########## STARTING STAGE: PUSH THE ARTIFACTS AND METADATA ##########
+ [[ -s /var/lib/jenkins/jobs/test_pull_request_origin_integration/workspace/activate ]]
+ source /var/lib/jenkins/jobs/test_pull_request_origin_integration/workspace/activate
++ export VIRTUAL_ENV=/var/lib/jenkins/origin-ci-tool/7a5c5e83c372ad2e6b3b64b3efa16fe2cb37ef83
++ VIRTUAL_ENV=/var/lib/jenkins/origin-ci-tool/7a5c5e83c372ad2e6b3b64b3efa16fe2cb37ef83
++ export PATH=/var/lib/jenkins/origin-ci-tool/7a5c5e83c372ad2e6b3b64b3efa16fe2cb37ef83/bin:/sbin:/usr/sbin:/bin:/usr/bin
++ PATH=/var/lib/jenkins/origin-ci-tool/7a5c5e83c372ad2e6b3b64b3efa16fe2cb37ef83/bin:/sbin:/usr/sbin:/bin:/usr/bin
++ unset PYTHON_HOME
++ export OCT_CONFIG_HOME=/var/lib/jenkins/jobs/test_pull_request_origin_integration/workspace/.config
++ OCT_CONFIG_HOME=/var/lib/jenkins/jobs/test_pull_request_origin_integration/workspace/.config
++ mktemp
+ script=/tmp/tmp.gPiCsqP7gm
+ cat
+ chmod +x /tmp/tmp.gPiCsqP7gm
+ scp -F /var/lib/jenkins/jobs/test_pull_request_origin_integration/workspace/.config/origin-ci-tool/inventory/.ssh_config /tmp/tmp.gPiCsqP7gm openshiftdevel:/tmp/tmp.gPiCsqP7gm
+ ssh -F /var/lib/jenkins/jobs/test_pull_request_origin_integration/workspace/.config/origin-ci-tool/inventory/.ssh_config -t openshiftdevel 'bash -l -c "timeout 300 /tmp/tmp.gPiCsqP7gm"'
+ cd /home/origin
+ trap 'exit 0' EXIT
+ [[ -n {"type":"presubmit","job":"test_pull_request_origin_integration","buildid":"82ef755a-5cea-11e8-ae4a-0a58ac100556","refs":{"org":"openshift","repo":"origin","base_ref":"master","base_sha":"23a04201b84307588e1d527b09c82714d9cbf788","pulls":[{"number":19759,"author":"wozniakjan","sha":"935562873929fb33e5d8f747603d50c74a205d5e"}]}} ]]
++ jq --compact-output .buildid
Using BUILD_NUMBER
+ [[ "82ef755a-5cea-11e8-ae4a-0a58ac100556" =~ ^"[0-9]+"$ ]]
+ echo 'Using BUILD_NUMBER'
++ jq --compact-output '.buildid |= "17978"'
+ JOB_SPEC='{"type":"presubmit","job":"test_pull_request_origin_integration","buildid":"17978","refs":{"org":"openshift","repo":"origin","base_ref":"master","base_sha":"23a04201b84307588e1d527b09c82714d9cbf788","pulls":[{"number":19759,"author":"wozniakjan","sha":"935562873929fb33e5d8f747603d50c74a205d5e"}]}}'
+ docker run -e 'JOB_SPEC={"type":"presubmit","job":"test_pull_request_origin_integration","buildid":"17978","refs":{"org":"openshift","repo":"origin","base_ref":"master","base_sha":"23a04201b84307588e1d527b09c82714d9cbf788","pulls":[{"number":19759,"author":"wozniakjan","sha":"935562873929fb33e5d8f747603d50c74a205d5e"}]}}' -v /data:/data:z registry.svc.ci.openshift.org/ci/gcsupload:latest --dry-run=false --gcs-path=gs://origin-ci-test --gcs-credentials-file=/data/credentials.json --path-strategy=single --default-org=openshift --default-repo=origin /data/gcs/artifacts /data/gcs/build-log.txt /data/gcs/finished.json
Unable to find image 'registry.svc.ci.openshift.org/ci/gcsupload:latest' locally
Trying to pull repository registry.svc.ci.openshift.org/ci/gcsupload ... 
latest: Pulling from registry.svc.ci.openshift.org/ci/gcsupload
6d987f6f4279: Already exists
4cccebe844ee: Already exists
cafcba51f636: Pulling fs layer
cafcba51f636: Verifying Checksum
cafcba51f636: Download complete
cafcba51f636: Pull complete
Digest: sha256:c452798b56e3f4649c557c3ff7273126042065e3be152689a1ffb880638e617d
Status: Downloaded newer image for registry.svc.ci.openshift.org/ci/gcsupload:latest
{"component":"gcsupload","level":"info","msg":"Gathering artifacts from artifact directory: /data/gcs/artifacts","time":"2018-05-21T12:20:04Z"}
{"component":"gcsupload","level":"info","msg":"Found /data/gcs/artifacts/generated/avc_denials.log in artifact directory. Uploading as artifacts/generated/avc_denials.log\n","time":"2018-05-21T12:20:04Z"}
{"component":"gcsupload","level":"info","msg":"Found /data/gcs/artifacts/generated/containers.log in artifact directory. Uploading as artifacts/generated/containers.log\n","time":"2018-05-21T12:20:04Z"}
{"component":"gcsupload","level":"info","msg":"Found /data/gcs/artifacts/generated/dmesg.log in artifact directory. Uploading as artifacts/generated/dmesg.log\n","time":"2018-05-21T12:20:04Z"}
{"component":"gcsupload","level":"info","msg":"Found /data/gcs/artifacts/generated/docker.config in artifact directory. Uploading as artifacts/generated/docker.config\n","time":"2018-05-21T12:20:04Z"}
{"component":"gcsupload","level":"info","msg":"Found /data/gcs/artifacts/generated/docker.info in artifact directory. Uploading as artifacts/generated/docker.info\n","time":"2018-05-21T12:20:04Z"}
{"component":"gcsupload","level":"info","msg":"Found /data/gcs/artifacts/generated/filesystem.info in artifact directory. Uploading as artifacts/generated/filesystem.info\n","time":"2018-05-21T12:20:04Z"}
{"component":"gcsupload","level":"info","msg":"Found /data/gcs/artifacts/generated/installed_packages.log in artifact directory. Uploading as artifacts/generated/installed_packages.log\n","time":"2018-05-21T12:20:04Z"}
{"component":"gcsupload","level":"info","msg":"Found /data/gcs/artifacts/generated/master-metrics.log in artifact directory. Uploading as artifacts/generated/master-metrics.log\n","time":"2018-05-21T12:20:04Z"}
{"component":"gcsupload","level":"info","msg":"Found /data/gcs/artifacts/generated/node-metrics.log in artifact directory. Uploading as artifacts/generated/node-metrics.log\n","time":"2018-05-21T12:20:04Z"}
{"component":"gcsupload","level":"info","msg":"Found /data/gcs/artifacts/generated/pid1.journal in artifact directory. Uploading as artifacts/generated/pid1.journal\n","time":"2018-05-21T12:20:04Z"}
{"component":"gcsupload","level":"info","msg":"Found /data/gcs/artifacts/journals/dnsmasq.service in artifact directory. Uploading as artifacts/journals/dnsmasq.service\n","time":"2018-05-21T12:20:04Z"}
{"component":"gcsupload","level":"info","msg":"Found /data/gcs/artifacts/journals/docker.service in artifact directory. Uploading as artifacts/journals/docker.service\n","time":"2018-05-21T12:20:04Z"}
{"component":"gcsupload","level":"info","msg":"Found /data/gcs/artifacts/journals/systemd-journald.service in artifact directory. Uploading as artifacts/journals/systemd-journald.service\n","time":"2018-05-21T12:20:04Z"}
{"component":"gcsupload","level":"info","msg":"Found /data/gcs/artifacts/scripts/shell/logs/f94cfb3a2d71f43199abb6125b18463f50e895959656f212276053751c04474f.json in artifact directory. Uploading as artifacts/scripts/shell/logs/f94cfb3a2d71f43199abb6125b18463f50e895959656f212276053751c04474f.json\n","time":"2018-05-21T12:20:04Z"}
{"component":"gcsupload","level":"info","msg":"Found /data/gcs/artifacts/scripts/shell/logs/scripts.log in artifact directory. Uploading as artifacts/scripts/shell/logs/scripts.log\n","time":"2018-05-21T12:20:04Z"}
{"component":"gcsupload","level":"info","msg":"Found /data/gcs/artifacts/scripts/test-integration/artifacts/gotest_report_4klFb in artifact directory. Uploading as artifacts/scripts/test-integration/artifacts/gotest_report_4klFb\n","time":"2018-05-21T12:20:04Z"}
{"component":"gcsupload","level":"info","msg":"Found /data/gcs/artifacts/scripts/test-integration/artifacts/gotest_report_4klFb.xml in artifact directory. Uploading as artifacts/scripts/test-integration/artifacts/gotest_report_4klFb.xml\n","time":"2018-05-21T12:20:04Z"}
{"component":"gcsupload","level":"info","msg":"Found /data/gcs/artifacts/scripts/test-integration/logs/raw_test_output.log in artifact directory. Uploading as artifacts/scripts/test-integration/logs/raw_test_output.log\n","time":"2018-05-21T12:20:04Z"}
{"component":"gcsupload","level":"info","msg":"Found /data/gcs/artifacts/scripts/test-integration/logs/scripts.log in artifact directory. Uploading as artifacts/scripts/test-integration/logs/scripts.log\n","time":"2018-05-21T12:20:04Z"}
{"component":"gcsupload","level":"info","msg":"Found /data/gcs/artifacts/scripts/test-integration/logs/test-go-err.log in artifact directory. Uploading as artifacts/scripts/test-integration/logs/test-go-err.log\n","time":"2018-05-21T12:20:04Z"}
{"component":"gcsupload","level":"info","msg":"Found /data/gcs/artifacts/scripts/test-tools/logs/raw_test_output.log in artifact directory. Uploading as artifacts/scripts/test-tools/logs/raw_test_output.log\n","time":"2018-05-21T12:20:04Z"}
{"component":"gcsupload","level":"info","msg":"Found /data/gcs/artifacts/scripts/test-tools/logs/scripts.log in artifact directory. Uploading as artifacts/scripts/test-tools/logs/scripts.log\n","time":"2018-05-21T12:20:04Z"}
{"component":"gcsupload","dest":"pr-logs/pull/19759/test_pull_request_origin_integration/17978/artifacts/scripts/test-integration/logs/test-go-err.log","level":"info","msg":"Queued for upload","time":"2018-05-21T12:20:04Z"}
{"component":"gcsupload","dest":"pr-logs/pull/19759/test_pull_request_origin_integration/17978/artifacts/generated/docker.config","level":"info","msg":"Queued for upload","time":"2018-05-21T12:20:04Z"}
{"component":"gcsupload","dest":"pr-logs/pull/19759/test_pull_request_origin_integration/17978/artifacts/scripts/test-tools/logs/scripts.log","level":"info","msg":"Queued for upload","time":"2018-05-21T12:20:04Z"}
{"component":"gcsupload","dest":"pr-logs/directory/test_pull_request_origin_integration/latest-build.txt","level":"info","msg":"Queued for upload","time":"2018-05-21T12:20:04Z"}
{"component":"gcsupload","dest":"pr-logs/pull/19759/test_pull_request_origin_integration/17978/artifacts/scripts/shell/logs/f94cfb3a2d71f43199abb6125b18463f50e895959656f212276053751c04474f.json","level":"info","msg":"Queued for upload","time":"2018-05-21T12:20:04Z"}
{"component":"gcsupload","dest":"pr-logs/directory/test_pull_request_origin_integration/17978.txt","level":"info","msg":"Queued for upload","time":"2018-05-21T12:20:04Z"}
{"component":"gcsupload","dest":"pr-logs/pull/19759/test_pull_request_origin_integration/17978/artifacts/generated/avc_denials.log","level":"info","msg":"Queued for upload","time":"2018-05-21T12:20:04Z"}
{"component":"gcsupload","dest":"pr-logs/pull/19759/test_pull_request_origin_integration/17978/artifacts/generated/filesystem.info","level":"info","msg":"Queued for upload","time":"2018-05-21T12:20:04Z"}
{"component":"gcsupload","dest":"pr-logs/pull/19759/test_pull_request_origin_integration/17978/finished.json","level":"info","msg":"Queued for upload","time":"2018-05-21T12:20:04Z"}
{"component":"gcsupload","dest":"pr-logs/pull/19759/test_pull_request_origin_integration/latest-build.txt","level":"info","msg":"Queued for upload","time":"2018-05-21T12:20:04Z"}
{"component":"gcsupload","dest":"pr-logs/pull/19759/test_pull_request_origin_integration/17978/artifacts/journals/docker.service","level":"info","msg":"Queued for upload","time":"2018-05-21T12:20:04Z"}
{"component":"gcsupload","dest":"pr-logs/pull/19759/test_pull_request_origin_integration/17978/artifacts/journals/systemd-journald.service","level":"info","msg":"Queued for upload","time":"2018-05-21T12:20:04Z"}
{"component":"gcsupload","dest":"pr-logs/pull/19759/test_pull_request_origin_integration/17978/artifacts/scripts/shell/logs/scripts.log","level":"info","msg":"Queued for upload","time":"2018-05-21T12:20:04Z"}
{"component":"gcsupload","dest":"pr-logs/pull/19759/test_pull_request_origin_integration/17978/artifacts/scripts/test-tools/logs/raw_test_output.log","level":"info","msg":"Queued for upload","time":"2018-05-21T12:20:04Z"}
{"component":"gcsupload","dest":"pr-logs/pull/19759/test_pull_request_origin_integration/17978/artifacts/generated/installed_packages.log","level":"info","msg":"Queued for upload","time":"2018-05-21T12:20:04Z"}
{"component":"gcsupload","dest":"pr-logs/pull/19759/test_pull_request_origin_integration/17978/artifacts/generated/master-metrics.log","level":"info","msg":"Queued for upload","time":"2018-05-21T12:20:04Z"}
{"component":"gcsupload","dest":"pr-logs/pull/19759/test_pull_request_origin_integration/17978/artifacts/generated/node-metrics.log","level":"info","msg":"Queued for upload","time":"2018-05-21T12:20:04Z"}
{"component":"gcsupload","dest":"pr-logs/pull/19759/test_pull_request_origin_integration/17978/artifacts/journals/dnsmasq.service","level":"info","msg":"Queued for upload","time":"2018-05-21T12:20:04Z"}
{"component":"gcsupload","dest":"pr-logs/pull/19759/test_pull_request_origin_integration/17978/artifacts/scripts/test-integration/logs/raw_test_output.log","level":"info","msg":"Queued for upload","time":"2018-05-21T12:20:04Z"}
{"component":"gcsupload","dest":"pr-logs/pull/19759/test_pull_request_origin_integration/17978/artifacts/generated/dmesg.log","level":"info","msg":"Queued for upload","time":"2018-05-21T12:20:04Z"}
{"component":"gcsupload","dest":"pr-logs/pull/19759/test_pull_request_origin_integration/17978/artifacts/generated/docker.info","level":"info","msg":"Queued for upload","time":"2018-05-21T12:20:04Z"}
{"component":"gcsupload","dest":"pr-logs/pull/19759/test_pull_request_origin_integration/17978/artifacts/scripts/test-integration/artifacts/gotest_report_4klFb.xml","level":"info","msg":"Queued for upload","time":"2018-05-21T12:20:04Z"}
{"component":"gcsupload","dest":"pr-logs/pull/19759/test_pull_request_origin_integration/17978/artifacts/generated/containers.log","level":"info","msg":"Queued for upload","time":"2018-05-21T12:20:04Z"}
{"component":"gcsupload","dest":"pr-logs/pull/19759/test_pull_request_origin_integration/17978/artifacts/generated/pid1.journal","level":"info","msg":"Queued for upload","time":"2018-05-21T12:20:04Z"}
{"component":"gcsupload","dest":"pr-logs/pull/19759/test_pull_request_origin_integration/17978/artifacts/scripts/test-integration/logs/scripts.log","level":"info","msg":"Queued for upload","time":"2018-05-21T12:20:04Z"}
{"component":"gcsupload","dest":"pr-logs/pull/19759/test_pull_request_origin_integration/17978/build-log.txt","level":"info","msg":"Queued for upload","time":"2018-05-21T12:20:04Z"}
{"component":"gcsupload","dest":"pr-logs/pull/19759/test_pull_request_origin_integration/17978/artifacts/scripts/test-integration/artifacts/gotest_report_4klFb","level":"info","msg":"Queued for upload","time":"2018-05-21T12:20:04Z"}
{"component":"gcsupload","dest":"pr-logs/pull/19759/test_pull_request_origin_integration/17978/artifacts/journals/dnsmasq.service","level":"info","msg":"Finished upload","time":"2018-05-21T12:20:05Z"}
{"component":"gcsupload","dest":"pr-logs/pull/19759/test_pull_request_origin_integration/17978/artifacts/scripts/shell/logs/f94cfb3a2d71f43199abb6125b18463f50e895959656f212276053751c04474f.json","level":"info","msg":"Finished upload","time":"2018-05-21T12:20:05Z"}
{"component":"gcsupload","dest":"pr-logs/pull/19759/test_pull_request_origin_integration/17978/artifacts/generated/dmesg.log","level":"info","msg":"Finished upload","time":"2018-05-21T12:20:05Z"}
{"component":"gcsupload","dest":"pr-logs/pull/19759/test_pull_request_origin_integration/17978/artifacts/generated/avc_denials.log","level":"info","msg":"Finished upload","time":"2018-05-21T12:20:05Z"}
{"component":"gcsupload","dest":"pr-logs/pull/19759/test_pull_request_origin_integration/17978/artifacts/scripts/test-tools/logs/raw_test_output.log","level":"info","msg":"Finished upload","time":"2018-05-21T12:20:05Z"}
{"component":"gcsupload","dest":"pr-logs/pull/19759/test_pull_request_origin_integration/17978/artifacts/scripts/test-integration/artifacts/gotest_report_4klFb","level":"info","msg":"Finished upload","time":"2018-05-21T12:20:05Z"}
{"component":"gcsupload","dest":"pr-logs/pull/19759/test_pull_request_origin_integration/17978/artifacts/scripts/test-integration/logs/scripts.log","level":"info","msg":"Finished upload","time":"2018-05-21T12:20:05Z"}
{"component":"gcsupload","dest":"pr-logs/pull/19759/test_pull_request_origin_integration/17978/artifacts/generated/containers.log","level":"info","msg":"Finished upload","time":"2018-05-21T12:20:05Z"}
{"component":"gcsupload","dest":"pr-logs/pull/19759/test_pull_request_origin_integration/17978/artifacts/scripts/test-integration/artifacts/gotest_report_4klFb.xml","level":"info","msg":"Finished upload","time":"2018-05-21T12:20:05Z"}
{"component":"gcsupload","dest":"pr-logs/pull/19759/test_pull_request_origin_integration/17978/artifacts/scripts/shell/logs/scripts.log","level":"info","msg":"Finished upload","time":"2018-05-21T12:20:05Z"}
{"component":"gcsupload","dest":"pr-logs/directory/test_pull_request_origin_integration/17978.txt","level":"info","msg":"Finished upload","time":"2018-05-21T12:20:05Z"}
{"component":"gcsupload","dest":"pr-logs/pull/19759/test_pull_request_origin_integration/17978/artifacts/generated/installed_packages.log","level":"info","msg":"Finished upload","time":"2018-05-21T12:20:05Z"}
{"component":"gcsupload","dest":"pr-logs/pull/19759/test_pull_request_origin_integration/17978/artifacts/generated/docker.config","level":"info","msg":"Finished upload","time":"2018-05-21T12:20:05Z"}
{"component":"gcsupload","dest":"pr-logs/pull/19759/test_pull_request_origin_integration/17978/artifacts/scripts/test-integration/logs/test-go-err.log","level":"info","msg":"Finished upload","time":"2018-05-21T12:20:05Z"}
{"component":"gcsupload","dest":"pr-logs/pull/19759/test_pull_request_origin_integration/17978/artifacts/scripts/test-tools/logs/scripts.log","level":"info","msg":"Finished upload","time":"2018-05-21T12:20:05Z"}
{"component":"gcsupload","dest":"pr-logs/pull/19759/test_pull_request_origin_integration/17978/artifacts/generated/docker.info","level":"info","msg":"Finished upload","time":"2018-05-21T12:20:05Z"}
{"component":"gcsupload","dest":"pr-logs/pull/19759/test_pull_request_origin_integration/17978/artifacts/scripts/test-integration/logs/raw_test_output.log","level":"info","msg":"Finished upload","time":"2018-05-21T12:20:05Z"}
{"component":"gcsupload","dest":"pr-logs/pull/19759/test_pull_request_origin_integration/17978/artifacts/generated/master-metrics.log","level":"info","msg":"Finished upload","time":"2018-05-21T12:20:05Z"}
{"component":"gcsupload","dest":"pr-logs/directory/test_pull_request_origin_integration/latest-build.txt","level":"info","msg":"Finished upload","time":"2018-05-21T12:20:05Z"}
{"component":"gcsupload","dest":"pr-logs/pull/19759/test_pull_request_origin_integration/17978/artifacts/generated/pid1.journal","level":"info","msg":"Finished upload","time":"2018-05-21T12:20:05Z"}
{"component":"gcsupload","dest":"pr-logs/pull/19759/test_pull_request_origin_integration/17978/artifacts/journals/docker.service","level":"info","msg":"Finished upload","time":"2018-05-21T12:20:05Z"}
{"component":"gcsupload","dest":"pr-logs/pull/19759/test_pull_request_origin_integration/17978/artifacts/generated/filesystem.info","level":"info","msg":"Finished upload","time":"2018-05-21T12:20:05Z"}
{"component":"gcsupload","dest":"pr-logs/pull/19759/test_pull_request_origin_integration/17978/build-log.txt","level":"info","msg":"Finished upload","time":"2018-05-21T12:20:05Z"}
{"component":"gcsupload","dest":"pr-logs/pull/19759/test_pull_request_origin_integration/17978/artifacts/generated/node-metrics.log","level":"info","msg":"Finished upload","time":"2018-05-21T12:20:05Z"}
{"component":"gcsupload","dest":"pr-logs/pull/19759/test_pull_request_origin_integration/17978/artifacts/journals/systemd-journald.service","level":"info","msg":"Finished upload","time":"2018-05-21T12:20:05Z"}
{"component":"gcsupload","dest":"pr-logs/pull/19759/test_pull_request_origin_integration/17978/finished.json","level":"info","msg":"Finished upload","time":"2018-05-21T12:20:05Z"}
{"component":"gcsupload","dest":"pr-logs/pull/19759/test_pull_request_origin_integration/latest-build.txt","level":"info","msg":"Finished upload","time":"2018-05-21T12:20:05Z"}
{"component":"gcsupload","level":"info","msg":"Finished upload to GCS","time":"2018-05-21T12:20:05Z"}
+ exit 0
+ set +o xtrace
########## FINISHED STAGE: SUCCESS: PUSH THE ARTIFACTS AND METADATA [00h 00m 06s] ##########
[workspace] $ /bin/bash /tmp/jenkins6840961844781786237.sh
########## STARTING STAGE: DEPROVISION CLOUD RESOURCES ##########
+ [[ -s /var/lib/jenkins/jobs/test_pull_request_origin_integration/workspace/activate ]]
+ source /var/lib/jenkins/jobs/test_pull_request_origin_integration/workspace/activate
++ export VIRTUAL_ENV=/var/lib/jenkins/origin-ci-tool/7a5c5e83c372ad2e6b3b64b3efa16fe2cb37ef83
++ VIRTUAL_ENV=/var/lib/jenkins/origin-ci-tool/7a5c5e83c372ad2e6b3b64b3efa16fe2cb37ef83
++ export PATH=/var/lib/jenkins/origin-ci-tool/7a5c5e83c372ad2e6b3b64b3efa16fe2cb37ef83/bin:/sbin:/usr/sbin:/bin:/usr/bin
++ PATH=/var/lib/jenkins/origin-ci-tool/7a5c5e83c372ad2e6b3b64b3efa16fe2cb37ef83/bin:/sbin:/usr/sbin:/bin:/usr/bin
++ unset PYTHON_HOME
++ export OCT_CONFIG_HOME=/var/lib/jenkins/jobs/test_pull_request_origin_integration/workspace/.config
++ OCT_CONFIG_HOME=/var/lib/jenkins/jobs/test_pull_request_origin_integration/workspace/.config
+ oct deprovision

PLAYBOOK: main.yml *************************************************************
4 plays in /var/lib/jenkins/origin-ci-tool/7a5c5e83c372ad2e6b3b64b3efa16fe2cb37ef83/lib/python2.7/site-packages/oct/ansible/oct/playbooks/deprovision/main.yml

PLAY [ensure we have the parameters necessary to deprovision virtual hosts] ****

TASK [ensure all required variables are set] ***********************************
task path: /var/lib/jenkins/origin-ci-tool/7a5c5e83c372ad2e6b3b64b3efa16fe2cb37ef83/lib/python2.7/site-packages/oct/ansible/oct/playbooks/deprovision/main.yml:9
skipping: [localhost] => (item=origin_ci_inventory_dir)  => {
    "changed": false, 
    "generated_timestamp": "2018-05-21 08:20:06.602454", 
    "item": "origin_ci_inventory_dir", 
    "skip_reason": "Conditional check failed", 
    "skipped": true
}
skipping: [localhost] => (item=origin_ci_aws_region)  => {
    "changed": false, 
    "generated_timestamp": "2018-05-21 08:20:06.605978", 
    "item": "origin_ci_aws_region", 
    "skip_reason": "Conditional check failed", 
    "skipped": true
}

PLAY [deprovision virtual hosts in EC2] ****************************************

TASK [Gathering Facts] *********************************************************
ok: [localhost]

TASK [deprovision a virtual EC2 host] ******************************************
task path: /var/lib/jenkins/origin-ci-tool/7a5c5e83c372ad2e6b3b64b3efa16fe2cb37ef83/lib/python2.7/site-packages/oct/ansible/oct/playbooks/deprovision/main.yml:28
included: /var/lib/jenkins/origin-ci-tool/7a5c5e83c372ad2e6b3b64b3efa16fe2cb37ef83/lib/python2.7/site-packages/oct/ansible/oct/playbooks/deprovision/roles/aws-down/tasks/main.yml for localhost

TASK [update the SSH configuration to remove AWS EC2 specifics] ****************
task path: /var/lib/jenkins/origin-ci-tool/7a5c5e83c372ad2e6b3b64b3efa16fe2cb37ef83/lib/python2.7/site-packages/oct/ansible/oct/playbooks/deprovision/roles/aws-down/tasks/main.yml:2
ok: [localhost] => {
    "changed": false, 
    "generated_timestamp": "2018-05-21 08:20:07.415736", 
    "msg": ""
}

TASK [rename EC2 instance for termination reaper] ******************************
task path: /var/lib/jenkins/origin-ci-tool/7a5c5e83c372ad2e6b3b64b3efa16fe2cb37ef83/lib/python2.7/site-packages/oct/ansible/oct/playbooks/deprovision/roles/aws-down/tasks/main.yml:8
changed: [localhost] => {
    "changed": true, 
    "generated_timestamp": "2018-05-21 08:20:07.997823", 
    "msg": "Tags {'Name': 'oct-terminate'} created for resource i-08a62b12108ddbee4."
}

TASK [tear down the EC2 instance] **********************************************
task path: /var/lib/jenkins/origin-ci-tool/7a5c5e83c372ad2e6b3b64b3efa16fe2cb37ef83/lib/python2.7/site-packages/oct/ansible/oct/playbooks/deprovision/roles/aws-down/tasks/main.yml:15
changed: [localhost] => {
    "changed": true, 
    "generated_timestamp": "2018-05-21 08:20:08.946359", 
    "instance_ids": [
        "i-08a62b12108ddbee4"
    ], 
    "instances": [
        {
            "ami_launch_index": "0", 
            "architecture": "x86_64", 
            "block_device_mapping": {
                "/dev/sda1": {
                    "delete_on_termination": true, 
                    "status": "attached", 
                    "volume_id": "vol-08f36c34bfc2effc7"
                }, 
                "/dev/sdb": {
                    "delete_on_termination": true, 
                    "status": "attached", 
                    "volume_id": "vol-0605b6f152e538e30"
                }
            }, 
            "dns_name": "ec2-52-86-2-179.compute-1.amazonaws.com", 
            "ebs_optimized": false, 
            "groups": {
                "sg-7e73221a": "default"
            }, 
            "hypervisor": "xen", 
            "id": "i-08a62b12108ddbee4", 
            "image_id": "ami-0f07d2d9a03af96ec", 
            "instance_type": "m4.xlarge", 
            "kernel": null, 
            "key_name": "libra", 
            "launch_time": "2018-05-21T11:32:21.000Z", 
            "placement": "us-east-1d", 
            "private_dns_name": "ip-172-18-13-25.ec2.internal", 
            "private_ip": "172.18.13.25", 
            "public_dns_name": "ec2-52-86-2-179.compute-1.amazonaws.com", 
            "public_ip": "52.86.2.179", 
            "ramdisk": null, 
            "region": "us-east-1", 
            "root_device_name": "/dev/sda1", 
            "root_device_type": "ebs", 
            "state": "running", 
            "state_code": 16, 
            "tags": {
                "Name": "oct-terminate", 
                "openshift_etcd": "", 
                "openshift_master": "", 
                "openshift_node": ""
            }, 
            "tenancy": "default", 
            "virtualization_type": "hvm"
        }
    ], 
    "tagged_instances": []
}

TASK [remove the serialized host variables] ************************************
task path: /var/lib/jenkins/origin-ci-tool/7a5c5e83c372ad2e6b3b64b3efa16fe2cb37ef83/lib/python2.7/site-packages/oct/ansible/oct/playbooks/deprovision/roles/aws-down/tasks/main.yml:22
changed: [localhost] => {
    "changed": true, 
    "generated_timestamp": "2018-05-21 08:20:09.202619", 
    "path": "/var/lib/jenkins/jobs/test_pull_request_origin_integration/workspace/.config/origin-ci-tool/inventory/host_vars/172.18.13.25.yml", 
    "state": "absent"
}

PLAY [deprovision virtual hosts locally manged by Vagrant] *********************

TASK [Gathering Facts] *********************************************************
ok: [localhost]

PLAY [clean up local configuration for deprovisioned instances] ****************

TASK [remove inventory configuration directory] ********************************
task path: /var/lib/jenkins/origin-ci-tool/7a5c5e83c372ad2e6b3b64b3efa16fe2cb37ef83/lib/python2.7/site-packages/oct/ansible/oct/playbooks/deprovision/main.yml:61
changed: [localhost] => {
    "changed": true, 
    "generated_timestamp": "2018-05-21 08:20:09.678277", 
    "path": "/var/lib/jenkins/jobs/test_pull_request_origin_integration/workspace/.config/origin-ci-tool/inventory", 
    "state": "absent"
}

PLAY RECAP *********************************************************************
localhost                  : ok=8    changed=4    unreachable=0    failed=0   

+ set +o xtrace
########## FINISHED STAGE: SUCCESS: DEPROVISION CLOUD RESOURCES [00h 00m 04s] ##########
Archiving artifacts
[BFA] Scanning build for known causes...
[BFA] Found failure cause(s):
[BFA] Job Stage Failed
[BFA] Done. 0s
[WS-CLEANUP] Deleting project workspace...[WS-CLEANUP] done
Finished: FAILURE