Console Output

Skipping 6,165 KB.. Full Log
    		I0523 13:08:15.433250    1194 overrides.go:35] Initialized build overrides plugin with config: overrides.BuildOverridesConfig{TypeMeta:v1.TypeMeta{Kind:"", APIVersion:""}, ForcePull:false, ImageLabels:[]build.ImageLabel(nil), NodeSelector:map[string]string(nil), Annotations:map[string]string(nil), Tolerations:[]core.Toleration(nil)}
    		I0523 13:08:15.434527    1194 wrap.go:42] GET /api/v1/namespaces/openshift-infra/serviceaccounts/build-controller: (1.068358ms) 404 [[integration.test/v1.10.0+b81c8f8 (linux/amd64) kubernetes/b81c8f8] 127.0.0.1:46028]
    		I0523 13:08:15.436043    1194 wrap.go:42] GET /api/v1/namespaces/openshift-infra: (1.098479ms) 200 [[integration.test/v1.10.0+b81c8f8 (linux/amd64) kubernetes/b81c8f8] 127.0.0.1:46028]
    		I0523 13:08:15.439488    1194 wrap.go:42] POST /api/v1/namespaces/openshift-infra/serviceaccounts: (2.982432ms) 201 [[integration.test/v1.10.0+b81c8f8 (linux/amd64) kubernetes/b81c8f8] 127.0.0.1:46028]
    		I0523 13:08:15.440811    1194 wrap.go:42] GET /api/v1/namespaces/openshift-infra/serviceaccounts/build-controller: (1.056253ms) 200 [[integration.test/v1.10.0+b81c8f8 (linux/amd64) kubernetes/b81c8f8/tokens-controller] 127.0.0.1:46028]
    		I0523 13:08:15.442866    1194 wrap.go:42] GET /api/v1/namespaces/openshift-infra/secrets?fieldSelector=type%3Dkubernetes.io%2Fservice-account-token&limit=500: (2.804518ms) 200 [[integration.test/v1.10.0+b81c8f8 (linux/amd64) kubernetes/b81c8f8] 127.0.0.1:46028]
    		INFO: 2018/05/23 13:08:15 balancerWrapper: handle subconn state change: 0xc432bf49b0, READY
    		INFO: 2018/05/23 13:08:15 ccBalancerWrapper: updating state and picker called by balancer: READY, 0xc434764780
    		
    --- PASS: TestIntegration/TestAuditConfigV1Beta1File (33.23s)
    	runner_test.go:187: 
    		
    		=== OUTPUT
    		3T13:08:18.947352Z","stageTimestamp":"2018-05-23T13:08:18.947352Z"}
    		I0523 13:08:18.947626    1204 backend.go:85] {"kind":"Event","apiVersion":"audit.k8s.io/v1beta1","metadata":{"creationTimestamp":"2018-05-23T13:08:18Z"},"level":"Metadata","timestamp":"2018-05-23T13:08:18Z","auditID":"0662df7e-5f0d-4609-ab22-d6aaa7616b78","stage":"ResponseComplete","requestURI":"/apis/authentication.k8s.io/v1?timeout=32s","verb":"get","user":{"username":"system:openshift-master","groups":["system:masters","system:authenticated"]},"sourceIPs":["127.0.0.1"],"responseStatus":{"metadata":{},"code":200},"requestReceivedTimestamp":"2018-05-23T13:08:18.947352Z","stageTimestamp":"2018-05-23T13:08:18.947557Z"}
    		I0523 13:08:18.947661    1204 wrap.go:42] GET /apis/authentication.k8s.io/v1?timeout=32s: (537.531µs) 200 [[integration.test/v1.10.0+b81c8f8 (linux/amd64) kubernetes/b81c8f8] 127.0.0.1:40690]
    		I0523 13:08:18.948108    1204 backend.go:85] {"kind":"Event","apiVersion":"audit.k8s.io/v1beta1","metadata":{"creationTimestamp":"2018-05-23T13:08:18Z"},"level":"Metadata","timestamp":"2018-05-23T13:08:18Z","auditID":"73761a22-0b08-41a4-b689-7f45bd5291d0","stage":"RequestReceived","requestURI":"/apis/apps/v1/statefulsets?resourceVersion=371\u0026timeoutSeconds=316\u0026watch=true","verb":"watch","user":{"username":"system:openshift-master","groups":["system:masters","system:authenticated"]},"sourceIPs":["127.0.0.1"],"objectRef":{"resource":"statefulsets","apiGroup":"apps","apiVersion":"v1"},"requestReceivedTimestamp":"2018-05-23T13:08:18.948020Z","stageTimestamp":"2018-05-23T13:08:18.948020Z"}
    		I0523 13:08:18.948325    1204 get.go:238] Starting watch for /apis/apps/v1/statefulsets, rv=371 labels= fields= timeout=5m16s
    		I0523 13:08:18.948456    1204 backend.go:85] {"kind":"Event","apiVersion":"audit.k8s.io/v1beta1","metadata":{"creationTimestamp":"2018-05-23T13:08:18Z"},"level":"Metadata","timestamp":"2018-05-23T13:08:18Z","auditID":"73761a22-0b08-41a4-b689-7f45bd5291d0","stage":"ResponseStarted","requestURI":"/apis/apps/v1/statefulsets?resourceVersion=371\u0026timeoutSeconds=316\u0026watch=true","verb":"watch","user":{"username":"system:openshift-master","groups":["system:masters","system:authenticated"]},"sourceIPs":["127.0.0.1"],"objectRef":{"resource":"statefulsets","apiGroup":"apps","apiVersion":"v1"},"responseStatus":{"metadata":{},"code":200},"requestReceivedTimestamp":"2018-05-23T13:08:18.948020Z","stageTimestamp":"2018-05-23T13:08:18.948383Z"}
    		I0523 13:08:18.948925    1204 backend.go:85] {"kind":"Event","apiVersion":"audit.k8s.io/v1beta1","metadata":{"creationTimestamp":"2018-05-23T13:08:18Z"},"level":"Metadata","timestamp":"2018-05-23T13:08:18Z","auditID":"fa6d3ab3-19a5-4e67-bf55-d0ac02371e75","stage":"RequestReceived","requestURI":"/api/v1/namespaces/openshift-web-console/configmaps/webconsole-config","verb":"get","user":{"username":"system:openshift-master","groups":["system:masters","system:authenticated"]},"sourceIPs":["127.0.0.1"],"objectRef":{"resource":"configmaps","namespace":"openshift-web-console","name":"webconsole-config","apiVersion":"v1"},"requestReceivedTimestamp":"2018-05-23T13:08:18.948807Z","stageTimestamp":"2018-05-23T13:08:18.948807Z"}
    		I0523 13:08:18.949546    1204 backend.go:85] {"kind":"Event","apiVersion":"audit.k8s.io/v1beta1","metadata":{"creationTimestamp":"2018-05-23T13:08:18Z"},"level":"Metadata","timestamp":"2018-05-23T13:08:18Z","auditID":"d2f0e1f3-e972-4d4b-be96-a529d90639b7","stage":"RequestReceived","requestURI":"/api/v1/namespaces/openshift-web-console/configmaps/webconsole-config","verb":"get","user":{"username":"system:openshift-master","groups":["system:masters","system:authenticated"]},"sourceIPs":["127.0.0.1"],"objectRef":{"resource":"configmaps","namespace":"openshift-web-console","name":"webconsole-config","apiVersion":"v1"},"requestReceivedTimestamp":"2018-05-23T13:08:18.949422Z","stageTimestamp":"2018-05-23T13:08:18.949422Z"}
    		I0523 13:08:18.950021    1204 wrap.go:42] GET /api/v1/namespaces/openshift-web-console/configmaps/webconsole-config: (15.346843ms) 404 [[integration.test/v1.10.0+b81c8f8 (linux/amd64) kubernetes/b81c8f8] 127.0.0.1:40690]
    		I0523 13:08:18.950160    1204 backend.go:85] {"kind":"Event","apiVersion":"audit.k8s.io/v1beta1","metadata":{"creationTimestamp":"2018-05-23T13:08:18Z"},"level":"Metadata","timestamp":"2018-05-23T13:08:18Z","auditID":"abfa4f64-931d-4d4c-ba30-f7e7b255b195","stage":"RequestReceived","requestURI":"/api/v1/namespaces/openshift-web-console/configmaps/webconsole-config","verb":"get","user":{"username":"system:openshift-master","groups":["system:masters","system:authenticated"]},"sourceIPs":["127.0.0.1"],"objectRef":{"resource":"configmaps","namespace":"openshift-web-console","name":"webconsole-config","apiVersion":"v1"},"requestReceivedTimestamp":"2018-05-23T13:08:18.950038Z","stageTimestamp":"2018-05-23T13:08:18.950038Z"}
    		I0523 13:08:18.950738    1204 backend.go:85] {"kind":"Event","apiVersion":"audit.k8s.io/v1beta1","metadata":{"creationTimestamp":"2018-05-23T13:08:18Z"},"level":"Metadata","timestamp":"2018-05-23T13:08:18Z","auditID":"d1c5c7b1-5837-40e1-b8af-2f3648d84b92","stage":"RequestReceived","requestURI":"/api/v1/namespaces/kube-system/configmaps/openshift-master-controllers","verb":"get","user":{"username":"system:openshift-master","groups":["system:masters","system:authenticated"]},"sourceIPs":["127.0.0.1"],"objectRef":{"resource":"configmaps","namespace":"kube-system","name":"openshift-master-controllers","apiVersion":"v1"},"requestReceivedTimestamp":"2018-05-23T13:08:18.950617Z","stageTimestamp":"2018-05-23T13:08:18.950617Z"}
    		I0523 13:08:18.950852    1204 reflector.go:202] Starting reflector *v1.ReplicaSet (10m0s) from github.com/openshift/origin/vendor/k8s.io/client-go/informers/factory.go:87
    		I0523 13:08:18.950869    1204 reflector.go:240] Listing and watching *v1.ReplicaSet from github.com/openshift/origin/vendor/k8s.io/client-go/informers/factory.go:87
    		I0523 13:08:18.951154    1204 reflector.go:202] Starting reflector *v1.PersistentVolumeClaim (10m0s) from github.com/openshift/origin/vendor/k8s.io/client-go/informers/factory.go:87
    		I0523 13:08:18.951168    1204 reflector.go:240] Listing and watching *v1.PersistentVolumeClaim from github.com/openshift/origin/vendor/k8s.io/client-go/informers/factory.go:87
    		I0523 13:08:18.951338    1204 backend.go:85] {"kind":"Event","apiVersion":"audit.k8s.io/v1beta1","metadata":{"creationTimestamp":"2018-05-23T13:08:18Z"},"level":"Metadata","timestamp":"2018-05-23T13:08:18Z","auditID":"fcded810-d920-4e4b-8d95-08b294cb2d1d","stage":"RequestReceived","requestURI":"/apis/rbac.authorization.k8s.io/v1/roles?limit=500\u0026resourceVersion=0","verb":"list","user":{"username":"system:openshift-master","groups":["system:masters","system:authenticated"]},"sourceIPs":["127.0.0.1"],"objectRef":{"resource":"roles","apiGroup":"rbac.authorization.k8s.io","apiVersion":"v1"},"requestReceivedTimestamp":"2018-05-23T13:08:18.951217Z","stageTimestamp":"2018-05-23T13:08:18.951217Z"}
    		I0523 13:08:18.951403    1204 reflector.go:202] Starting reflector *v1.Secret (2m0s) from github.com/openshift/origin/vendor/k8s.io/client-go/informers/factory.go:87
    		I0523 13:08:18.951418    1204 reflector.go:240] Listing and watching *v1.Secret from github.com/openshift/origin/vendor/k8s.io/client-go/informers/factory.go:87
    		I0523 13:08:18.951684    1204 reflector.go:202] Starting reflector *apps.DeploymentConfig (10m0s) from github.com/openshift/origin/pkg/apps/generated/informers/internalversion/factory.go:58
    		I0523 13:08:18.951698    1204 reflector.go:240] Listing and watching *apps.DeploymentConfig from github.com/openshift/origin/pkg/apps/generated/informers/internalversion/factory.go:58
    		I0523 13:08:18.951934    1204 reflector.go:202] Starting reflector *v1.Job (10m0s) from github.com/openshift/origin/vendor/k8s.io/client-go/informers/factory.go:87
    		I0523 13:08:18.951947    1204 reflector.go:240] Listing and watching *v1.Job from github.com/openshift/origin/vendor/k8s.io/client-go/informers/factory.go:87
    		I0523 13:08:18.952369    1204 backend.go:85] {"kind":"Event","apiVersion":"audit.k8s.io/v1beta1","metadata":{"creationTimestamp":"2018-05-23T13:08:18Z"},"level":"Metadata","timestamp":"2018-05-23T13:08:18Z","auditID":"ae116f7d-8b4c-4893-8143-4521215f4240","stage":"RequestReceived","requestURI":"/apis/events.k8s.io/v1beta1/events?limit=500\u0026resourceVersion=0","verb":"list","user":{"username":"system:openshift-master","groups":["system:masters","system:authenticated"]},"sourceIPs":["127.0.0.1"],"objectRef":{"resource":"events","apiGroup":"events.k8s.io","apiVersion":"v1beta1"},"requestReceivedTimestamp":"2018-05-23T13:08:18.952243Z","stageTimestamp":"2018-05-23T13:08:18.952243Z"}
    		I0523 13:08:18.952993    1204 backend.go:85] {"kind":"Event","apiVersion":"audit.k8s.io/v1beta1","metadata":{"creationTimestamp":"2018-05-23T13:08:18Z"},"level":"Metadata","timestamp":"2018-05-23T13:08:18Z","auditID":"6075c120-e645-4353-8741-a9854cbca201","stage":"RequestReceived","requestURI":"/apis/policy/v1beta1/poddisruptionbudgets?limit=500\u0026resourceVersion=0","verb":"list","user":{"username":"system:openshift-master","groups":["system:masters","system:authenticated"]},"sourceIPs":["127.0.0.1"],"objectRef":{"resource":"poddisruptionbudgets","apiGroup":"policy","apiVersion":"v1beta1"},"requestReceivedTimestamp":"2018-05-23T13:08:18.952842Z","stageTimestamp":"2018-05-23T13:08:18.952842Z"}
    		I0523 13:08:18.953620    1204 backend.go:85] {"kind":"Event","apiVersion":"audit.k8s.io/v1beta1","metadata":{"creationTimestamp":"2018-05-23T13:08:18Z"},"level":"Metadata","timestamp":"2018-05-23T13:08:18Z","auditID":"6825f70b-7d9d-4471-9ddf-6cda1499654a","stage":"RequestReceived","requestURI":"/apis/apps/v1/replicasets?limit=500\u0026resourceVersion=0","verb":"list","user":{"username":"system:openshift-master","groups":["system:masters","system:authenticated"]},"sourceIPs":["127.0.0.1"],"objectRef":{"resource":"replicasets","apiGroup":"apps","apiVersion":"v1"},"requestReceivedTimestamp":"2018-05-23T13:08:18.953493Z","stageTimestamp":"2018-05-23T13:08:18.953493Z"}
    		I0523 13:08:18.953845    1204 reflector.go:202] Starting reflector *build.BuildConfig (10m0s) from github.com/openshift/origin/pkg/build/generated/informers/internalversion/factory.go:58
    		I0523 13:08:18.953862    1204 reflector.go:240] Listing and watching *build.BuildConfig from github.com/openshift/origin/pkg/build/generated/informers/internalversion/factory.go:58
    		I0523 13:08:18.954438    1204 backend.go:85] {"kind":"Event","apiVersion":"audit.k8s.io/v1beta1","metadata":{"creationTimestamp":"2018-05-23T13:08:18Z"},"level":"Metadata","timestamp":"2018-05-23T13:08:18Z","auditID":"9c37649d-5db2-44f6-8797-85247ea6ff6d","stage":"RequestReceived","requestURI":"/api/v1/persistentvolumeclaims?limit=500\u0026resourceVersion=0","verb":"list","user":{"username":"system:openshift-master","groups":["system:masters","system:authenticated"]},"sourceIPs":["127.0.0.1"],"objectRef":{"resource":"persistentvolumeclaims","apiVersion":"v1"},"requestReceivedTimestamp":"2018-05-23T13:08:18.954292Z","stageTimestamp":"2018-05-23T13:08:18.954292Z"}
    		I0523 13:08:18.955098    1204 backend.go:85] {"kind":"Event","apiVersion":"audit.k8s.io/v1beta1","metadata":{"creationTimestamp":"2018-05-23T13:08:18Z"},"level":"Metadata","timestamp":"2018-05-23T13:08:18Z","auditID":"512cec9c-f95b-4831-a942-943006c05af8","stage":"RequestReceived","requestURI":"/api/v1/secrets?limit=500\u0026resourceVersion=0","verb":"list","user":{"username":"system:openshift-master","groups":["system:masters","system:authenticated"]},"sourceIPs":["127.0.0.1"],"objectRef":{"resource":"secrets","apiVersion":"v1"},"requestReceivedTimestamp":"2018-05-23T13:08:18.954952Z","stageTimestamp":"2018-05-23T13:08:18.954952Z"}
    		I0523 13:08:18.957115    1204 backend.go:85] {"kind":"Event","apiVersion":"audit.k8s.io/v1beta1","metadata":{"creationTimestamp":"2018-05-23T13:08:18Z"},"level":"Metadata","timestamp":"2018-05-23T13:08:18Z","auditID":"80eed88a-7fc4-4c50-8095-9f91b7185903","stage":"RequestReceived","requestURI":"/apis/apps.openshift.io/v1/deploymentconfigs?limit=500\u0026resourceVersion=0","verb":"list","user":{"username":"system:openshift-master","groups":["system:masters","system:authenticated"]},"sourceIPs":["127.0.0.1"],"objectRef":{"resource":"deploymentconfigs","apiGroup":"apps.openshift.io","apiVersion":"v1"},"requestReceivedTimestamp":"2018-05-23T13:08:18.956984Z","stageTimestamp":"2018-05-23T13:08:18.956984Z"}
    		I0523 13:08:18.957674    1204 backend.go:85] {"kind":"Event","apiVersion":"audit.k8s.io/v1beta1","metadata":{"creationTimestamp":"2018-05-23T13:08:18Z"},"level":"Metadata","timestamp":"2018-05-23T13:08:18Z","auditID":"a09e10a7-ab42-41be-a685-d6b42164e333","stage":"ResponseComplete","requestURI":"/api/v1/namespaces/default/services/kubernetes","verb":"get","user":{"username":"system:apiserver","uid":"22bdaaba-d056-48a0-9db3-1a7d75f63665","groups":["system:masters"]},"sourceIPs":["127.0.0.1"],"objectRef":{"resource":"services","namespace":"default","name":"kubernetes","apiVersion":"v1"},"responseStatus":{"metadata":{},"code":200},"requestReceivedTimestamp":"2018-05-23T13:08:18.940943Z","stageTimestamp":"2018-05-23T13:08:18.957596Z"}
    		I0523 13:08:18.957700    1204 wrap.go:42] GET /api/v1/namespaces/default/services/kubernetes: (16.817318ms) 200 [[integration.test/v1.10.0+b81c8f8 (linux/amd64) kubernetes/b81c8f8] 127.0.0.1:40664]
    		I0523 13:08:18.957801    1204 backend.go:85] {"kind":"Event","apiVersion":"audit.k8s.io/v1beta1","metadata":{"creationTimestamp":"2018-05-23T13:08:18Z"},"level":"Metadata","timestamp":"2018-05-23T13:08:18Z","auditID":"761c0028-0cf3-4ea7-924a-99faee201ab0","stage":"RequestReceived","requestURI":"/apis/batch/v1/jobs?limit=500\u0026resourceVersion=0","verb":"list","user":{"username":"system:openshift-master","groups":["system:masters","system:authenticated"]},"sourceIPs":["127.0.0.1"],"objectRef":{"resource":"jobs","apiGroup":"batch","apiVersion":"v1"},"requestReceivedTimestamp":"2018-05-23T13:08:18.957678Z","stageTimestamp":"2018-05-23T13:08:18.957678Z"}
    		I0523 13:08:18.958436    1204 backend.go:85] {"kind":"Event","apiVersion":"audit.k8s.io/v1beta1","metadata":{"creationTimestamp":"2018-05-23T13:08:18Z"},"level":"Metadata","timestamp":"2018-05-23T13:08:18Z","auditID":"7d40d56b-f770-4e65-bf7f-6b5442fe7b96","stage":"RequestReceived","requestURI":"/api/v1/resourcequotas?resourceVersion=371\u0026timeoutSeconds=490\u0026watch=true","verb":"watch","user":{"username":"system:openshift-master","groups":["system:masters","system:authenticated"]},"sourceIPs":["127.0.0.1"],"objectRef":{"resource":"resourcequotas","apiVersion":"v1"},"requestReceivedTimestamp":"2018-05-23T13:08:18.958346Z","stageTimestamp":"2018-05-23T13:08:18.958346Z"}
    		I0523 13:08:18.958662    1204 get.go:238] Starting watch for /api/v1/resourcequotas, rv=371 labels= fields= timeout=8m10s
    		I0523 13:08:18.958787    1204 backend.go:85] {"kind":"Event","apiVersion":"audit.k8s.io/v1beta1","metadata":{"creationTimestamp":"2018-05-23T13:08:18Z"},"level":"Metadata","timestamp":"2018-05-23T13:08:18Z","auditID":"7d40d56b-f770-4e65-bf7f-6b5442fe7b96","stage":"ResponseStarted","requestURI":"/api/v1/resourcequotas?resourceVersion=371\u0026timeoutSeconds=490\u0026watch=true","verb":"watch","user":{"username":"system:openshift-master","groups":["system:masters","system:authenticated"]},"sourceIPs":["127.0.0.1"],"objectRef":{"resource":"resourcequotas","apiVersion":"v1"},"responseStatus":{"metadata":{},"code":200},"requestReceivedTimestamp":"2018-05-23T13:08:18.958346Z","stageTimestamp":"2018-05-23T13:08:18.958712Z"}
    		I0523 13:08:18.959257    1204 backend.go:85] {"kind":"Event","apiVersion":"audit.k8s.io/v1beta1","metadata":{"creationTimestamp":"2018-05-23T13:08:18Z"},"level":"Metadata","timestamp":"2018-05-23T13:08:18Z","auditID":"a653bc38-3b67-44ca-8c94-f3c3615e7724","stage":"RequestReceived","requestURI":"/apis/apps/v1beta1/statefulsets?resourceVersion=371\u0026timeoutSeconds=357\u0026watch=true","verb":"watch","user":{"username":"system:openshift-master","groups":["system:masters","system:authenticated"]},"sourceIPs":["127.0.0.1"],"objectRef":{"resource":"statefulsets","apiGroup":"apps","apiVersion":"v1beta1"},"requestReceivedTimestamp":"2018-05-23T13:08:18.959168Z","stageTimestamp":"2018-05-23T13:08:18.959168Z"}
    		I0523 13:08:18.959473    1204 get.go:238] Starting watch for /apis/apps/v1beta1/statefulsets, rv=371 labels= fields= timeout=5m57s
    		I0523 13:08:18.959601    1204 backend.go:85] {"kind":"Event","apiVersion":"audit.k8s.io/v1beta1","metadata":{"creationTimestamp":"2018-05-23T13:08:18Z"},"level":"Metadata","timestamp":"2018-05-23T13:08:18Z","auditID":"a653bc38-3b67-44ca-8c94-f3c3615e7724","stage":"ResponseStarted","requestURI":"/apis/apps/v1beta1/statefulsets?resourceVersion=371\u0026timeoutSeconds=357\u0026watch=true","verb":"watch","user":{"username":"system:openshift-master","groups":["system:masters","system:authenticated"]},"sourceIPs":["127.0.0.1"],"objectRef":{"resource":"statefulsets","apiGroup":"apps","apiVersion":"v1beta1"},"responseStatus":{"metadata":{},"code":200},"requestReceivedTimestamp":"2018-05-23T13:08:18.959168Z","stageTimestamp":"2018-05-23T13:08:18.959520Z"}
    		I0523 13:08:18.960073    1204 backend.go:85] {"kind":"Event","apiVersion":"audit.k8s.io/v1beta1","metadata":{"creationTimestamp":"2018-05-23T13:08:18Z"},"level":"Metadata","timestamp":"2018-05-23T13:08:18Z","auditID":"692458bd-91e8-4836-8ade-4e1ab85ee8ee","stage":"RequestReceived","requestURI":"/apis/template.openshift.io/v1/templateinstances?resourceVersion=371\u0026timeoutSeconds=415\u0026watch=true","verb":"watch","user":{"username":"system:openshift-master","groups":["system:masters","system:authenticated"]},"sourceIPs":["127.0.0.1"],"objectRef":{"resource":"templateinstances","apiGroup":"template.openshift.io","apiVersion":"v1"},"requestReceivedTimestamp":"2018-05-23T13:08:18.959984Z","stageTimestamp":"2018-05-23T13:08:18.959984Z"}
    		I0523 13:08:18.960308    1204 get.go:238] Starting watch for /apis/template.openshift.io/v1/templateinstances, rv=371 labels= fields= timeout=6m55s
    		I0523 13:08:18.960435    1204 backend.go:85] {"kind":"Event","apiVersion":"audit.k8s.io/v1beta1","metadata":{"creationTimestamp":"2018-05-23T13:08:18Z"},"level":"Metadata","timestamp":"2018-05-23T13:08:18Z","auditID":"692458bd-91e8-4836-8ade-4e1ab85ee8ee","stage":"ResponseStarted","requestURI":"/apis/template.openshift.io/v1/templateinstances?resourceVersion=371\u0026timeoutSeconds=415\u0026watch=true","verb":"watch","user":{"username":"system:openshift-master","groups":["system:masters","system:authenticated"]},"sourceIPs":["127.0.0.1"],"objectRef":{"resource":"templateinstances","apiGroup":"template.openshift.io","apiVersion":"v1"},"responseStatus":{"metadata":{},"code":200},"requestReceivedTimestamp":"2018-05-23T13:08:18.959984Z","stageTimestamp":"2018-05-23T13:08:18.960362Z"}
    		INFO: 2018/05/23 13:08:18 balancerWrapper: handle subconn state change: 0xc42fa37ce0, READY
    		INFO: 2018/05/23 13:08:18 ccBalancerWrapper: updating state and picker called by balancer: READY, 0xc43ad71d40
    		I0523 13:08:18.960881    1204 backend.go:85] {"kind":"Event","apiVersion":"audit.k8s.io/v1beta1","metadata":{"creationTimestamp":"2018-05-23T13:08:18Z"},"level":"Metadata","timestamp":"2018-05-23T13:08:18Z","auditID":"e48e19ba-9e19-4515-a2e9-7f7552fb92fb","stage":"RequestReceived","requestURI":"/apis/extensions/v1beta1/ingresses?resourceVersion=371\u0026timeoutSeconds=559\u0026watch=true","verb":"watch","user":{"username":"system:openshift-master","groups":["system:masters","system:authenticated"]},"sourceIPs":["127.0.0.1"],"objectRef":{"resource":"ingresses","apiGroup":"extensions","apiVersion":"v1beta1"},"requestReceivedTimestamp":"2018-05-23T13:08:18.960793Z","stageTimestamp":"2018-05-23T13:08:18.960793Z"}
    		I0523 13:08:18.961122    1204 get.go:238] Starting watch for /apis/extensions/v1beta1/ingresses, rv=371 labels= fields= timeout=9m19s
    		
    --- PASS: TestIntegration/TestAuditConfigV1Alpha1File (35.55s)
    	runner_test.go:187: 
    		
    		=== OUTPUT
    		questReceivedTimestamp":"2018-05-23T13:08:23.626588Z","stageTimestamp":"2018-05-23T13:08:23.626588Z"}
    		I0523 13:08:23.627631    1214 backend.go:85] {"kind":"Event","apiVersion":"audit.k8s.io/v1beta1","metadata":{"creationTimestamp":"2018-05-23T13:08:23Z"},"level":"Metadata","timestamp":"2018-05-23T13:08:23Z","auditID":"9a510fa6-93e4-4928-8b8a-dd85bb7b655e","stage":"ResponseComplete","requestURI":"/api/v1/namespaces/openshift-infra","verb":"get","user":{"username":"system:openshift-master","groups":["system:masters","system:authenticated"]},"sourceIPs":["127.0.0.1"],"objectRef":{"resource":"namespaces","namespace":"openshift-infra","name":"openshift-infra","apiVersion":"v1"},"responseStatus":{"metadata":{},"code":200},"requestReceivedTimestamp":"2018-05-23T13:08:23.626588Z","stageTimestamp":"2018-05-23T13:08:23.627554Z"}
    		I0523 13:08:23.627657    1214 wrap.go:42] GET /api/v1/namespaces/openshift-infra: (1.304933ms) 200 [[integration.test/v1.10.0+b81c8f8 (linux/amd64) kubernetes/b81c8f8] 127.0.0.1:54180]
    		I0523 13:08:23.628512    1214 backend.go:85] {"kind":"Event","apiVersion":"audit.k8s.io/v1beta1","metadata":{"creationTimestamp":"2018-05-23T13:08:23Z"},"level":"Metadata","timestamp":"2018-05-23T13:08:23Z","auditID":"dc9e9005-f6d8-4830-9e3e-0cd2ec2cea37","stage":"RequestReceived","requestURI":"/api/v1/namespaces/openshift-infra/serviceaccounts","verb":"create","user":{"username":"system:openshift-master","groups":["system:masters","system:authenticated"]},"sourceIPs":["127.0.0.1"],"objectRef":{"resource":"serviceaccounts","namespace":"openshift-infra","apiVersion":"v1"},"requestReceivedTimestamp":"2018-05-23T13:08:23.628391Z","stageTimestamp":"2018-05-23T13:08:23.628391Z"}
    		I0523 13:08:23.631463    1214 backend.go:85] {"kind":"Event","apiVersion":"audit.k8s.io/v1beta1","metadata":{"creationTimestamp":"2018-05-23T13:08:23Z"},"level":"Metadata","timestamp":"2018-05-23T13:08:23Z","auditID":"e66794c8-1973-4062-87fe-f2699b904497","stage":"RequestReceived","requestURI":"/api/v1/namespaces/default/pods?timeout=5m0s\u0026watch=true","verb":"watch","user":{"username":"system:admin","groups":["system:masters","system:cluster-admins","system:authenticated"]},"sourceIPs":["127.0.0.1"],"objectRef":{"resource":"pods","namespace":"default","apiVersion":"v1"},"requestReceivedTimestamp":"2018-05-23T13:08:23.631365Z","stageTimestamp":"2018-05-23T13:08:23.631365Z"}
    		I0523 13:08:23.631643    1214 get.go:238] Starting watch for /api/v1/namespaces/default/pods, rv= labels= fields= timeout=1h11m22.615339778s
    		I0523 13:08:23.631877    1214 backend.go:85] {"kind":"Event","apiVersion":"audit.k8s.io/v1beta1","metadata":{"creationTimestamp":"2018-05-23T13:08:23Z"},"level":"Metadata","timestamp":"2018-05-23T13:08:23Z","auditID":"e66794c8-1973-4062-87fe-f2699b904497","stage":"ResponseStarted","requestURI":"/api/v1/namespaces/default/pods?timeout=5m0s\u0026watch=true","verb":"watch","user":{"username":"system:admin","groups":["system:masters","system:cluster-admins","system:authenticated"]},"sourceIPs":["127.0.0.1"],"objectRef":{"resource":"pods","namespace":"default","apiVersion":"v1"},"responseStatus":{"metadata":{},"code":200},"requestReceivedTimestamp":"2018-05-23T13:08:23.631365Z","stageTimestamp":"2018-05-23T13:08:23.631723Z"}
    		INFO: 2018/05/23 13:08:23 ccBalancerWrapper: updating state and picker called by balancer: IDLE, 0xc43a41e8a0
    		INFO: 2018/05/23 13:08:23 dialing to target with scheme: ""
    		INFO: 2018/05/23 13:08:23 could not get resolver for scheme: ""
    		INFO: 2018/05/23 13:08:23 balancerWrapper: is pickfirst: false
    		INFO: 2018/05/23 13:08:23 balancerWrapper: got update addr from Notify: [{127.0.0.1:14708 <nil>}]
    		INFO: 2018/05/23 13:08:23 ccBalancerWrapper: new subconn: [{127.0.0.1:14708 0  <nil>}]
    		INFO: 2018/05/23 13:08:23 balancerWrapper: handle subconn state change: 0xc42a820c80, CONNECTING
    		INFO: 2018/05/23 13:08:23 ccBalancerWrapper: updating state and picker called by balancer: CONNECTING, 0xc43a41e8a0
    		I0523 13:08:23.644871    1214 backend.go:85] {"kind":"Event","apiVersion":"audit.k8s.io/v1beta1","metadata":{"creationTimestamp":"2018-05-23T13:08:23Z"},"level":"Metadata","timestamp":"2018-05-23T13:08:23Z","auditID":"c830fc58-2dc4-4a0f-a8b1-c7eea3dff169","stage":"RequestReceived","requestURI":"/api/v1/namespaces/openshift-web-console/configmaps/webconsole-config","verb":"get","user":{"username":"system:openshift-master","groups":["system:masters","system:authenticated"]},"sourceIPs":["127.0.0.1"],"objectRef":{"resource":"configmaps","namespace":"openshift-web-console","name":"webconsole-config","apiVersion":"v1"},"requestReceivedTimestamp":"2018-05-23T13:08:23.644694Z","stageTimestamp":"2018-05-23T13:08:23.644694Z"}
    		I0523 13:08:23.645594    1214 backend.go:85] {"kind":"Event","apiVersion":"audit.k8s.io/v1beta1","metadata":{"creationTimestamp":"2018-05-23T13:08:23Z"},"level":"Metadata","timestamp":"2018-05-23T13:08:23Z","auditID":"55fea84b-150e-403b-b1db-95f7015e464f","stage":"RequestReceived","requestURI":"/api/v1/namespaces/openshift-web-console/configmaps/webconsole-config","verb":"get","user":{"username":"system:openshift-master","groups":["system:masters","system:authenticated"]},"sourceIPs":["127.0.0.1"],"objectRef":{"resource":"configmaps","namespace":"openshift-web-console","name":"webconsole-config","apiVersion":"v1"},"requestReceivedTimestamp":"2018-05-23T13:08:23.645472Z","stageTimestamp":"2018-05-23T13:08:23.645472Z"}
    		I0523 13:08:23.646199    1214 backend.go:85] {"kind":"Event","apiVersion":"audit.k8s.io/v1beta1","metadata":{"creationTimestamp":"2018-05-23T13:08:23Z"},"level":"Metadata","timestamp":"2018-05-23T13:08:23Z","auditID":"d1d15004-7725-4750-ab31-ffd0eda270d3","stage":"RequestReceived","requestURI":"/api/v1/namespaces/openshift-web-console/configmaps/webconsole-config","verb":"get","user":{"username":"system:openshift-master","groups":["system:masters","system:authenticated"]},"sourceIPs":["127.0.0.1"],"objectRef":{"resource":"configmaps","namespace":"openshift-web-console","name":"webconsole-config","apiVersion":"v1"},"requestReceivedTimestamp":"2018-05-23T13:08:23.646081Z","stageTimestamp":"2018-05-23T13:08:23.646081Z"}
    		I0523 13:08:23.646772    1214 backend.go:85] {"kind":"Event","apiVersion":"audit.k8s.io/v1beta1","metadata":{"creationTimestamp":"2018-05-23T13:08:23Z"},"level":"Metadata","timestamp":"2018-05-23T13:08:23Z","auditID":"b762c80d-cb67-44f8-bb3c-852d5485a764","stage":"RequestReceived","requestURI":"/api/v1/namespaces/openshift-web-console/configmaps/webconsole-config","verb":"get","user":{"username":"system:openshift-master","groups":["system:masters","system:authenticated"]},"sourceIPs":["127.0.0.1"],"objectRef":{"resource":"configmaps","namespace":"openshift-web-console","name":"webconsole-config","apiVersion":"v1"},"requestReceivedTimestamp":"2018-05-23T13:08:23.646651Z","stageTimestamp":"2018-05-23T13:08:23.646651Z"}
    		I0523 13:08:23.647362    1214 backend.go:85] {"kind":"Event","apiVersion":"audit.k8s.io/v1beta1","metadata":{"creationTimestamp":"2018-05-23T13:08:23Z"},"level":"Metadata","timestamp":"2018-05-23T13:08:23Z","auditID":"9e774d2e-7cef-44ba-8758-c0b2f21c107b","stage":"RequestReceived","requestURI":"/api/v1/namespaces/openshift-web-console/configmaps/webconsole-config","verb":"get","user":{"username":"system:openshift-master","groups":["system:masters","system:authenticated"]},"sourceIPs":["127.0.0.1"],"objectRef":{"resource":"configmaps","namespace":"openshift-web-console","name":"webconsole-config","apiVersion":"v1"},"requestReceivedTimestamp":"2018-05-23T13:08:23.647244Z","stageTimestamp":"2018-05-23T13:08:23.647244Z"}
    		I0523 13:08:23.647933    1214 backend.go:85] {"kind":"Event","apiVersion":"audit.k8s.io/v1beta1","metadata":{"creationTimestamp":"2018-05-23T13:08:23Z"},"level":"Metadata","timestamp":"2018-05-23T13:08:23Z","auditID":"11d1cb35-02f9-4eb8-8855-6e690f5997f8","stage":"RequestReceived","requestURI":"/api/v1/namespaces/openshift-web-console/configmaps/webconsole-config","verb":"get","user":{"username":"system:openshift-master","groups":["system:masters","system:authenticated"]},"sourceIPs":["127.0.0.1"],"objectRef":{"resource":"configmaps","namespace":"openshift-web-console","name":"webconsole-config","apiVersion":"v1"},"requestReceivedTimestamp":"2018-05-23T13:08:23.647816Z","stageTimestamp":"2018-05-23T13:08:23.647816Z"}
    		I0523 13:08:23.648532    1214 backend.go:85] {"kind":"Event","apiVersion":"audit.k8s.io/v1beta1","metadata":{"creationTimestamp":"2018-05-23T13:08:23Z"},"level":"Metadata","timestamp":"2018-05-23T13:08:23Z","auditID":"218146bd-ade7-4628-8a35-95f17bf99eb1","stage":"RequestReceived","requestURI":"/api/v1/namespaces/openshift-web-console/configmaps/webconsole-config","verb":"get","user":{"username":"system:openshift-master","groups":["system:masters","system:authenticated"]},"sourceIPs":["127.0.0.1"],"objectRef":{"resource":"configmaps","namespace":"openshift-web-console","name":"webconsole-config","apiVersion":"v1"},"requestReceivedTimestamp":"2018-05-23T13:08:23.648414Z","stageTimestamp":"2018-05-23T13:08:23.648414Z"}
    		I0523 13:08:23.649220    1214 backend.go:85] {"kind":"Event","apiVersion":"audit.k8s.io/v1beta1","metadata":{"creationTimestamp":"2018-05-23T13:08:23Z"},"level":"Metadata","timestamp":"2018-05-23T13:08:23Z","auditID":"dc9e9005-f6d8-4830-9e3e-0cd2ec2cea37","stage":"ResponseComplete","requestURI":"/api/v1/namespaces/openshift-infra/serviceaccounts","verb":"create","user":{"username":"system:openshift-master","groups":["system:masters","system:authenticated"]},"sourceIPs":["127.0.0.1"],"objectRef":{"resource":"serviceaccounts","namespace":"openshift-infra","name":"ingress-to-route-controller","apiVersion":"v1"},"responseStatus":{"metadata":{},"code":201},"requestReceivedTimestamp":"2018-05-23T13:08:23.628391Z","stageTimestamp":"2018-05-23T13:08:23.649134Z"}
    		I0523 13:08:23.649250    1214 wrap.go:42] POST /api/v1/namespaces/openshift-infra/serviceaccounts: (21.102889ms) 201 [[integration.test/v1.10.0+b81c8f8 (linux/amd64) kubernetes/b81c8f8] 127.0.0.1:54180]
    		I0523 13:08:23.652303    1214 backend.go:85] {"kind":"Event","apiVersion":"audit.k8s.io/v1beta1","metadata":{"creationTimestamp":"2018-05-23T13:08:23Z"},"level":"Metadata","timestamp":"2018-05-23T13:08:23Z","auditID":"b762c80d-cb67-44f8-bb3c-852d5485a764","stage":"ResponseComplete","requestURI":"/api/v1/namespaces/openshift-web-console/configmaps/webconsole-config","verb":"get","user":{"username":"system:openshift-master","groups":["system:masters","system:authenticated"]},"sourceIPs":["127.0.0.1"],"objectRef":{"resource":"configmaps","namespace":"openshift-web-console","name":"webconsole-config","apiVersion":"v1"},"responseStatus":{"kind":"Status","apiVersion":"v1","metadata":{},"status":"Failure","message":"configmaps \"webconsole-config\" not found","reason":"NotFound","details":{"name":"webconsole-config","kind":"configmaps"},"code":404},"requestReceivedTimestamp":"2018-05-23T13:08:23.646651Z","stageTimestamp":"2018-05-23T13:08:23.652218Z"}
    		I0523 13:08:23.652330    1214 wrap.go:42] GET /api/v1/namespaces/openshift-web-console/configmaps/webconsole-config: (5.919632ms) 404 [[integration.test/v1.10.0+b81c8f8 (linux/amd64) kubernetes/b81c8f8] 127.0.0.1:54180]
    		I0523 13:08:23.652562    1214 backend.go:85] {"kind":"Event","apiVersion":"audit.k8s.io/v1beta1","metadata":{"creationTimestamp":"2018-05-23T13:08:23Z"},"level":"Metadata","timestamp":"2018-05-23T13:08:23Z","auditID":"218146bd-ade7-4628-8a35-95f17bf99eb1","stage":"ResponseComplete","requestURI":"/api/v1/namespaces/openshift-web-console/configmaps/webconsole-config","verb":"get","user":{"username":"system:openshift-master","groups":["system:masters","system:authenticated"]},"sourceIPs":["127.0.0.1"],"objectRef":{"resource":"configmaps","namespace":"openshift-web-console","name":"webconsole-config","apiVersion":"v1"},"responseStatus":{"kind":"Status","apiVersion":"v1","metadata":{},"status":"Failure","message":"configmaps \"webconsole-config\" not found","reason":"NotFound","details":{"name":"webconsole-config","kind":"configmaps"},"code":404},"requestReceivedTimestamp":"2018-05-23T13:08:23.648414Z","stageTimestamp":"2018-05-23T13:08:23.652489Z"}
    		I0523 13:08:23.652590    1214 wrap.go:42] GET /api/v1/namespaces/openshift-web-console/configmaps/webconsole-config: (4.422684ms) 404 [[integration.test/v1.10.0+b81c8f8 (linux/amd64) kubernetes/b81c8f8] 127.0.0.1:54180]
    		I0523 13:08:23.652816    1214 backend.go:85] {"kind":"Event","apiVersion":"audit.k8s.io/v1beta1","metadata":{"creationTimestamp":"2018-05-23T13:08:23Z"},"level":"Metadata","timestamp":"2018-05-23T13:08:23Z","auditID":"c830fc58-2dc4-4a0f-a8b1-c7eea3dff169","stage":"ResponseComplete","requestURI":"/api/v1/namespaces/openshift-web-console/configmaps/webconsole-config","verb":"get","user":{"username":"system:openshift-master","groups":["system:masters","system:authenticated"]},"sourceIPs":["127.0.0.1"],"objectRef":{"resource":"configmaps","namespace":"openshift-web-console","name":"webconsole-config","apiVersion":"v1"},"responseStatus":{"kind":"Status","apiVersion":"v1","metadata":{},"status":"Failure","message":"configmaps \"webconsole-config\" not found","reason":"NotFound","details":{"name":"webconsole-config","kind":"configmaps"},"code":404},"requestReceivedTimestamp":"2018-05-23T13:08:23.644694Z","stageTimestamp":"2018-05-23T13:08:23.652739Z"}
    		I0523 13:08:23.652842    1214 wrap.go:42] GET /api/v1/namespaces/openshift-web-console/configmaps/webconsole-config: (8.440988ms) 404 [[integration.test/v1.10.0+b81c8f8 (linux/amd64) kubernetes/b81c8f8] 127.0.0.1:54180]
    		I0523 13:08:23.653099    1214 backend.go:85] {"kind":"Event","apiVersion":"audit.k8s.io/v1beta1","metadata":{"creationTimestamp":"2018-05-23T13:08:23Z"},"level":"Metadata","timestamp":"2018-05-23T13:08:23Z","auditID":"d1d15004-7725-4750-ab31-ffd0eda270d3","stage":"ResponseComplete","requestURI":"/api/v1/namespaces/openshift-web-console/configmaps/webconsole-config","verb":"get","user":{"username":"system:openshift-master","groups":["system:masters","system:authenticated"]},"sourceIPs":["127.0.0.1"],"objectRef":{"resource":"configmaps","namespace":"openshift-web-console","name":"webconsole-config","apiVersion":"v1"},"responseStatus":{"kind":"Status","apiVersion":"v1","metadata":{},"status":"Failure","message":"configmaps \"webconsole-config\" not found","reason":"NotFound","details":{"name":"webconsole-config","kind":"configmaps"},"code":404},"requestReceivedTimestamp":"2018-05-23T13:08:23.646081Z","stageTimestamp":"2018-05-23T13:08:23.653025Z"}
    		I0523 13:08:23.653142    1214 wrap.go:42] GET /api/v1/namespaces/openshift-web-console/configmaps/webconsole-config: (7.315593ms) 404 [[integration.test/v1.10.0+b81c8f8 (linux/amd64) kubernetes/b81c8f8] 127.0.0.1:54180]
    		I0523 13:08:23.653354    1214 backend.go:85] {"kind":"Event","apiVersion":"audit.k8s.io/v1beta1","metadata":{"creationTimestamp":"2018-05-23T13:08:23Z"},"level":"Metadata","timestamp":"2018-05-23T13:08:23Z","auditID":"55fea84b-150e-403b-b1db-95f7015e464f","stage":"ResponseComplete","requestURI":"/api/v1/namespaces/openshift-web-console/configmaps/webconsole-config","verb":"get","user":{"username":"system:openshift-master","groups":["system:masters","system:authenticated"]},"sourceIPs":["127.0.0.1"],"objectRef":{"resource":"configmaps","namespace":"openshift-web-console","name":"webconsole-config","apiVersion":"v1"},"responseStatus":{"kind":"Status","apiVersion":"v1","metadata":{},"status":"Failure","message":"configmaps \"webconsole-config\" not found","reason":"NotFound","details":{"name":"webconsole-config","kind":"configmaps"},"code":404},"requestReceivedTimestamp":"2018-05-23T13:08:23.645472Z","stageTimestamp":"2018-05-23T13:08:23.653278Z"}
    		I0523 13:08:23.653379    1214 wrap.go:42] GET /api/v1/namespaces/openshift-web-console/configmaps/webconsole-config: (8.158121ms) 404 [[integration.test/v1.10.0+b81c8f8 (linux/amd64) kubernetes/b81c8f8] 127.0.0.1:54180]
    		I0523 13:08:23.653582    1214 backend.go:85] {"kind":"Event","apiVersion":"audit.k8s.io/v1beta1","metadata":{"creationTimestamp":"2018-05-23T13:08:23Z"},"level":"Metadata","timestamp":"2018-05-23T13:08:23Z","auditID":"11d1cb35-02f9-4eb8-8855-6e690f5997f8","stage":"ResponseComplete","requestURI":"/api/v1/namespaces/openshift-web-console/configmaps/webconsole-config","verb":"get","user":{"username":"system:openshift-master","groups":["system:masters","system:authenticated"]},"sourceIPs":["127.0.0.1"],"objectRef":{"resource":"configmaps","namespace":"openshift-web-console","name":"webconsole-config","apiVersion":"v1"},"responseStatus":{"kind":"Status","apiVersion":"v1","metadata":{},"status":"Failure","message":"configmaps \"webconsole-config\" not found","reason":"NotFound","details":{"name":"webconsole-config","kind":"configmaps"},"code":404},"requestReceivedTimestamp":"2018-05-23T13:08:23.647816Z","stageTimestamp":"2018-05-23T13:08:23.653510Z"}
    		I0523 13:08:23.653605    1214 wrap.go:42] GET /api/v1/namespaces/openshift-web-console/configmaps/webconsole-config: (6.032709ms) 404 [[integration.test/v1.10.0+b81c8f8 (linux/amd64) kubernetes/b81c8f8] 127.0.0.1:54180]
    		I0523 13:08:23.653808    1214 backend.go:85] {"kind":"Event","apiVersion":"audit.k8s.io/v1beta1","metadata":{"creationTimestamp":"2018-05-23T13:08:23Z"},"level":"Metadata","timestamp":"2018-05-23T13:08:23Z","auditID":"9e774d2e-7cef-44ba-8758-c0b2f21c107b","stage":"ResponseComplete","requestURI":"/api/v1/namespaces/openshift-web-console/configmaps/webconsole-config","verb":"get","user":{"username":"system:openshift-master","groups":["system:masters","system:authenticated"]},"sourceIPs":["127.0.0.1"],"objectRef":{"resource":"configmaps","namespace":"openshift-web-console","name":"webconsole-config","apiVersion":"v1"},"responseStatus":{"kind":"Status","apiVersion":"v1","metadata":{},"status":"Failure","message":"configmaps \"webconsole-config\" not found","reason":"NotFound","details":{"name":"webconsole-config","kind":"configmaps"},"code":404},"requestReceivedTimestamp":"2018-05-23T13:08:23.647244Z","stageTimestamp":"2018-05-23T13:08:23.653734Z"}
    		I0523 13:08:23.653834    1214 wrap.go:42] GET /api/v1/namespaces/openshift-web-console/configmaps/webconsole-config: (6.838083ms) 404 [[integration.test/v1.10.0+b81c8f8 (linux/amd64) kubernetes/b81c8f8] 127.0.0.1:54180]
    		I0523 13:08:23.654541    1214 backend.go:85] {"kind":"Event","apiVersion":"audit.k8s.io/v1beta1","metadata":{"creationTimestamp":"2018-05-23T13:08:23Z"},"level":"Metadata","timestamp":"2018-05-23T13:08:23Z","auditID":"bcefd85b-b303-41c2-92ca-702568219f23","stage":"RequestReceived","requestURI":"/api/v1/namespaces/openshift-infra/serviceaccounts/ingress-to-route-controller","verb":"get","user":{"username":"system:openshift-master","groups":["system:masters","system:authenticated"]},"sourceIPs":["127.0.0.1"],"objectRef":{"resource":"serviceaccounts","namespace":"openshift-infra","name":"ingress-to-route-controller","apiVersion":"v1"},"requestReceivedTimestamp":"2018-05-23T13:08:23.654414Z","stageTimestamp":"2018-05-23T13:08:23.654414Z"}
    		I0523 13:08:23.655163    1214 backend.go:85] {"kind":"Event","apiVersion":"audit.k8s.io/v1beta1","metadata":{"creationTimestamp":"2018-05-23T13:08:23Z"},"level":"Metadata","timestamp":"2018-05-23T13:08:23Z","auditID":"6059796d-37c9-40b7-b7a5-9dcc9789e3a8","stage":"RequestReceived","requestURI":"/api/v1/namespaces/openshift-infra/secrets?fieldSelector=type%3Dkubernetes.io%2Fservice-account-token\u0026limit=500","verb":"list","user":{"username":"system:openshift-master","groups":["system:masters","system:authenticated"]},"sourceIPs":["127.0.0.1"],"objectRef":{"resource":"secrets","namespace":"openshift-infra","apiVersion":"v1"},"requestReceivedTimestamp":"2018-05-23T13:08:23.655046Z","stageTimestamp":"2018-05-23T13:08:23.655046Z"}
    		INFO: 2018/05/23 13:08:23 balancerWrapper: handle subconn state change: 0xc42a820c80, READY
    		INFO: 2018/05/23 13:08:23 ccBalancerWrapper: updating state and picker called by balancer: READY, 0xc43a41e8a0
    		
    --- PASS: TestIntegration/TestAllowedSCCViaRBAC (40.54s)
    	runner_test.go:187: 
    		
    		=== OUTPUT
    		292] got preallocated value for level: s0:c8,c2 for selinux options in namespace project1
    		I0523 13:08:44.020216    1228 matcher.go:279] got preallocated values for min: 1000060000, max: 1000069999 for uid range in namespace project1
    		I0523 13:08:44.020225    1228 matcher.go:292] got preallocated value for level: s0:c8,c2 for selinux options in namespace project1
    		I0523 13:08:44.020233    1228 matcher.go:322] got preallocated value for groups: 1000060000/10000 in namespace project1
    		I0523 13:08:44.020250    1228 matcher.go:292] got preallocated value for level: s0:c8,c2 for selinux options in namespace project1
    		I0523 13:08:44.020260    1228 matcher.go:292] got preallocated value for level: s0:c8,c2 for selinux options in namespace project1
    		I0523 13:08:44.020273    1228 matcher.go:279] got preallocated values for min: 1000060000, max: 1000069999 for uid range in namespace project1
    		I0523 13:08:44.020280    1228 matcher.go:292] got preallocated value for level: s0:c8,c2 for selinux options in namespace project1
    		I0523 13:08:44.020287    1228 matcher.go:322] got preallocated value for groups: 1000060000/10000 in namespace project1
    		I0523 13:08:44.020299    1228 matcher.go:342] got preallocated value for groups: 1000060000/10000 in namespace project1
    		I0523 13:08:44.020318    1228 matcher.go:279] got preallocated values for min: 1000060000, max: 1000069999 for uid range in namespace project1
    		I0523 13:08:44.020327    1228 matcher.go:292] got preallocated value for level: s0:c8,c2 for selinux options in namespace project1
    		I0523 13:08:44.020334    1228 matcher.go:322] got preallocated value for groups: 1000060000/10000 in namespace project1
    		I0523 13:08:44.020353    1228 admission.go:217] validating pod test3 (generate: ) against providers anyuid,restricted,nonroot,hostmount-anyuid,hostnetwork,hostaccess,privileged
    		I0523 13:08:44.020547    1228 admission.go:170] pod test3 (generate: ) validated against provider hostaccess
    		I0523 13:08:44.032884    1228 wrap.go:42] POST /api/v1/namespaces/project1/pods?timeout=5m0s: (16.21278ms) 201 [[integration.test/v1.10.0+b81c8f8 (linux/amd64) kubernetes/b81c8f8] 127.0.0.1:51858]
    		I0523 13:08:44.033758    1228 factory.go:1147] About to try and schedule pod test3
    		I0523 13:08:44.033772    1228 scheduler.go:439] Attempting to schedule pod: project1/test3
    		I0523 13:08:44.033791    1228 scheduler.go:191] Failed to schedule pod: project1/test3
    		I0523 13:08:44.033846    1228 factory.go:1262] Unable to schedule project1 test3: no nodes are registered to the cluster; waiting
    		I0523 13:08:44.033883    1228 factory.go:1375] Updating pod condition for project1/test3 to (PodScheduled==False)
    		I0523 13:08:44.034184    1228 pvc_protection_controller.go:276] Got event on pod project1/test3
    		I0523 13:08:44.034204    1228 admission.go:97] getting security context constraints for pod test4 (generate: ) in namespace project2 with user info &{user1 669c70b2-5e8a-11e8-bd29-0242ac110002 [system:authenticated:oauth system:authenticated] map[scopes.authorization.openshift.io:[]]}
    		I0523 13:08:44.034227    1228 disruption.go:328] addPod called on pod "test3"
    		I0523 13:08:44.034240    1228 disruption.go:403] No PodDisruptionBudgets found for pod test3, PodDisruptionBudget controller will avoid syncing.
    		I0523 13:08:44.034247    1228 disruption.go:331] No matching pdb for pod "test3"
    		I0523 13:08:44.034273    1228 taint_manager.go:345] Noticed pod update: types.NamespacedName{Namespace:"project1", Name:"test3"}
    		I0523 13:08:44.034347    1228 backoff_utils.go:79] Backing off 1s
    		I0523 13:08:44.034988    1228 admission.go:108] getting security context constraints for pod test4 (generate: ) with service account info &{system:serviceaccount:project2:default  [system:serviceaccounts system:serviceaccounts:project2] map[]}
    		I0523 13:08:44.040301    1228 wrap.go:42] GET /api/v1/namespaces/project2: (4.203598ms) 200 [[integration.test/v1.10.0+b81c8f8 (linux/amd64) kubernetes/b81c8f8] 127.0.0.1:51574]
    		I0523 13:08:44.040385    1228 wrap.go:42] PUT /api/v1/namespaces/project1/pods/test3/status: (5.651059ms) 200 [[integration.test/v1.10.0+b81c8f8 (linux/amd64) kubernetes/b81c8f8/scheduler] 127.0.0.1:51574]
    		I0523 13:08:44.041156    1228 matcher.go:279] got preallocated values for min: 1000070000, max: 1000079999 for uid range in namespace project2
    		I0523 13:08:44.041170    1228 matcher.go:292] got preallocated value for level: s0:c8,c7 for selinux options in namespace project2
    		I0523 13:08:44.041179    1228 matcher.go:322] got preallocated value for groups: 1000070000/10000 in namespace project2
    		I0523 13:08:44.041197    1228 admission.go:217] validating pod test4 (generate: ) against providers restricted
    		I0523 13:08:44.041257    1228 admission.go:179] unable to validate pod test4 (generate: ) against any security context constraint: [provider restricted: .spec.securityContext.hostPID: Invalid value: true: Host PID is not allowed to be used spec.containers[0].securityContext.hostPID: Invalid value: true: Host PID is not allowed to be used]
    		I0523 13:08:44.041377    1228 wrap.go:42] POST /api/v1/namespaces/project2/pods?timeout=5m0s: (7.707557ms) 403 [[integration.test/v1.10.0+b81c8f8 (linux/amd64) kubernetes/b81c8f8] 127.0.0.1:51858]
    		I0523 13:08:44.041440    1228 disruption.go:340] updatePod called on pod "test3"
    		I0523 13:08:44.041455    1228 disruption.go:403] No PodDisruptionBudgets found for pod test3, PodDisruptionBudget controller will avoid syncing.
    		I0523 13:08:44.041463    1228 disruption.go:343] No matching pdb for pod "test3"
    		I0523 13:08:44.041473    1228 pvc_protection_controller.go:276] Got event on pod project1/test3
    		I0523 13:08:44.042504    1228 admission.go:97] getting security context constraints for pod test5 (generate: ) in namespace project1 with user info &{user2 66a68be2-5e8a-11e8-bd29-0242ac110002 [system:authenticated:oauth system:authenticated] map[scopes.authorization.openshift.io:[]]}
    		I0523 13:08:44.042741    1228 admission.go:108] getting security context constraints for pod test5 (generate: ) with service account info &{system:serviceaccount:project1:default  [system:serviceaccounts system:serviceaccounts:project1] map[]}
    		I0523 13:08:44.044912    1228 factory.go:1147] About to try and schedule pod test3
    		I0523 13:08:44.044925    1228 scheduler.go:439] Attempting to schedule pod: project1/test3
    		I0523 13:08:44.044942    1228 scheduler.go:191] Failed to schedule pod: project1/test3
    		I0523 13:08:44.044980    1228 factory.go:1262] Unable to schedule project1 test3: no nodes are registered to the cluster; waiting
    		I0523 13:08:44.045014    1228 factory.go:1375] Updating pod condition for project1/test3 to (PodScheduled==False)
    		W0523 13:08:44.045054    1228 factory.go:1304] Request for pod project1/test3 already in flight, abandoning
    		I0523 13:08:44.045663    1228 wrap.go:42] GET /api/v1/namespaces/project1: (1.912587ms) 200 [[integration.test/v1.10.0+b81c8f8 (linux/amd64) kubernetes/b81c8f8] 127.0.0.1:51574]
    		I0523 13:08:44.045992    1228 wrap.go:42] POST /api/v1/namespaces/project1/events: (10.212685ms) 201 [[integration.test/v1.10.0+b81c8f8 (linux/amd64) kubernetes/b81c8f8/leader-election] 127.0.0.1:51574]
    		I0523 13:08:44.046194    1228 matcher.go:292] got preallocated value for level: s0:c8,c2 for selinux options in namespace project1
    		I0523 13:08:44.046220    1228 matcher.go:279] got preallocated values for min: 1000060000, max: 1000069999 for uid range in namespace project1
    		I0523 13:08:44.046229    1228 matcher.go:292] got preallocated value for level: s0:c8,c2 for selinux options in namespace project1
    		I0523 13:08:44.046237    1228 matcher.go:322] got preallocated value for groups: 1000060000/10000 in namespace project1
    		I0523 13:08:44.046253    1228 matcher.go:292] got preallocated value for level: s0:c8,c2 for selinux options in namespace project1
    		I0523 13:08:44.046263    1228 matcher.go:292] got preallocated value for level: s0:c8,c2 for selinux options in namespace project1
    		I0523 13:08:44.046277    1228 matcher.go:279] got preallocated values for min: 1000060000, max: 1000069999 for uid range in namespace project1
    		I0523 13:08:44.046285    1228 matcher.go:292] got preallocated value for level: s0:c8,c2 for selinux options in namespace project1
    		I0523 13:08:44.046292    1228 matcher.go:322] got preallocated value for groups: 1000060000/10000 in namespace project1
    		I0523 13:08:44.046305    1228 matcher.go:342] got preallocated value for groups: 1000060000/10000 in namespace project1
    		I0523 13:08:44.046325    1228 matcher.go:279] got preallocated values for min: 1000060000, max: 1000069999 for uid range in namespace project1
    		I0523 13:08:44.046333    1228 matcher.go:292] got preallocated value for level: s0:c8,c2 for selinux options in namespace project1
    		I0523 13:08:44.046340    1228 matcher.go:322] got preallocated value for groups: 1000060000/10000 in namespace project1
    		I0523 13:08:44.046357    1228 admission.go:217] validating pod test5 (generate: ) against providers anyuid,restricted,nonroot,hostmount-anyuid,hostnetwork,hostaccess,privileged
    		I0523 13:08:44.046538    1228 admission.go:170] pod test5 (generate: ) validated against provider hostaccess
    		I0523 13:08:44.050586    1228 wrap.go:42] POST /api/v1/namespaces/project1/pods?timeout=5m0s: (8.636384ms) 201 [[integration.test/v1.10.0+b81c8f8 (linux/amd64) kubernetes/b81c8f8] 127.0.0.1:51858]
    		I0523 13:08:44.051730    1228 pvc_protection_controller.go:276] Got event on pod project1/test5
    		I0523 13:08:44.051758    1228 disruption.go:328] addPod called on pod "test5"
    		I0523 13:08:44.051769    1228 disruption.go:403] No PodDisruptionBudgets found for pod test5, PodDisruptionBudget controller will avoid syncing.
    		I0523 13:08:44.051777    1228 disruption.go:331] No matching pdb for pod "test5"
    		I0523 13:08:44.051800    1228 taint_manager.go:345] Noticed pod update: types.NamespacedName{Namespace:"project1", Name:"test5"}
    		I0523 13:08:44.052476    1228 admission.go:97] getting security context constraints for pod test6 (generate: ) in namespace project2 with user info &{user2 66a68be2-5e8a-11e8-bd29-0242ac110002 [system:authenticated:oauth system:authenticated] map[scopes.authorization.openshift.io:[]]}
    		I0523 13:08:44.052737    1228 admission.go:108] getting security context constraints for pod test6 (generate: ) with service account info &{system:serviceaccount:project2:default  [system:serviceaccounts system:serviceaccounts:project2] map[]}
    		I0523 13:08:44.053979    1228 factory.go:1147] About to try and schedule pod test5
    		I0523 13:08:44.053992    1228 scheduler.go:439] Attempting to schedule pod: project1/test5
    		I0523 13:08:44.054007    1228 scheduler.go:191] Failed to schedule pod: project1/test5
    		I0523 13:08:44.054024    1228 factory.go:1262] Unable to schedule project1 test5: no nodes are registered to the cluster; waiting
    		I0523 13:08:44.054050    1228 factory.go:1375] Updating pod condition for project1/test5 to (PodScheduled==False)
    		I0523 13:08:44.054230    1228 backoff_utils.go:79] Backing off 1s
    		I0523 13:08:44.069052    1228 wrap.go:42] GET /api/v1/namespaces/project2: (12.868647ms) 200 [[integration.test/v1.10.0+b81c8f8 (linux/amd64) kubernetes/b81c8f8] 127.0.0.1:51574]
    		I0523 13:08:44.069078    1228 wrap.go:42] PUT /api/v1/namespaces/project1/pods/test5/status: (12.453804ms) 200 [[integration.test/v1.10.0+b81c8f8 (linux/amd64) kubernetes/b81c8f8/scheduler] 127.0.0.1:51574]
    		I0523 13:08:44.069899    1228 matcher.go:292] got preallocated value for level: s0:c8,c7 for selinux options in namespace project2
    		I0523 13:08:44.069933    1228 matcher.go:279] got preallocated values for min: 1000070000, max: 1000079999 for uid range in namespace project2
    		I0523 13:08:44.069944    1228 matcher.go:292] got preallocated value for level: s0:c8,c7 for selinux options in namespace project2
    		I0523 13:08:44.069952    1228 matcher.go:322] got preallocated value for groups: 1000070000/10000 in namespace project2
    		I0523 13:08:44.069992    1228 matcher.go:292] got preallocated value for level: s0:c8,c7 for selinux options in namespace project2
    		I0523 13:08:44.070005    1228 matcher.go:292] got preallocated value for level: s0:c8,c7 for selinux options in namespace project2
    		I0523 13:08:44.070021    1228 matcher.go:279] got preallocated values for min: 1000070000, max: 1000079999 for uid range in namespace project2
    		I0523 13:08:44.070030    1228 matcher.go:292] got preallocated value for level: s0:c8,c7 for selinux options in namespace project2
    		I0523 13:08:44.070037    1228 matcher.go:322] got preallocated value for groups: 1000070000/10000 in namespace project2
    		I0523 13:08:44.070050    1228 matcher.go:342] got preallocated value for groups: 1000070000/10000 in namespace project2
    		I0523 13:08:44.070071    1228 matcher.go:279] got preallocated values for min: 1000070000, max: 1000079999 for uid range in namespace project2
    		I0523 13:08:44.070079    1228 matcher.go:292] got preallocated value for level: s0:c8,c7 for selinux options in namespace project2
    		I0523 13:08:44.070087    1228 matcher.go:322] got preallocated value for groups: 1000070000/10000 in namespace project2
    		I0523 13:08:44.070107    1228 admission.go:217] validating pod test6 (generate: ) against providers anyuid,restricted,nonroot,hostmount-anyuid,hostnetwork,hostaccess,privileged
    		I0523 13:08:44.070308    1228 admission.go:170] pod test6 (generate: ) validated against provider hostaccess
    		I0523 13:08:44.070688    1228 pvc_protection_controller.go:276] Got event on pod project1/test5
    		I0523 13:08:44.070725    1228 disruption.go:340] updatePod called on pod "test5"
    		I0523 13:08:44.070737    1228 disruption.go:403] No PodDisruptionBudgets found for pod test5, PodDisruptionBudget controller will avoid syncing.
    		I0523 13:08:44.070745    1228 disruption.go:343] No matching pdb for pod "test5"
    		I0523 13:08:44.072897    1228 factory.go:1147] About to try and schedule pod test5
    		I0523 13:08:44.072910    1228 scheduler.go:439] Attempting to schedule pod: project1/test5
    		I0523 13:08:44.072926    1228 scheduler.go:191] Failed to schedule pod: project1/test5
    		I0523 13:08:44.072947    1228 factory.go:1262] Unable to schedule project1 test5: no nodes are registered to the cluster; waiting
    		I0523 13:08:44.072997    1228 factory.go:1375] Updating pod condition for project1/test5 to (PodScheduled==False)
    		W0523 13:08:44.073031    1228 factory.go:1304] Request for pod project1/test5 already in flight, abandoning
    		I0523 13:08:44.076823    1228 wrap.go:42] POST /api/v1/namespaces/project2/pods?timeout=5m0s: (24.883857ms) 201 [[integration.test/v1.10.0+b81c8f8 (linux/amd64) kubernetes/b81c8f8] 127.0.0.1:51858]
    		I0523 13:08:44.077706    1228 wrap.go:42] PATCH /api/v1/namespaces/project1/events/test3.1531480274507608: (30.490614ms) 200 [[integration.test/v1.10.0+b81c8f8 (linux/amd64) kubernetes/b81c8f8/leader-election] 127.0.0.1:51574]
    		I0523 13:08:44.079319    1228 factory.go:1147] About to try and schedule pod test6
    		I0523 13:08:44.079332    1228 scheduler.go:439] Attempting to schedule pod: project2/test6
    		I0523 13:08:44.079347    1228 scheduler.go:191] Failed to schedule pod: project2/test6
    		I0523 13:08:44.079362    1228 factory.go:1262] Unable to schedule project2 test6: no nodes are registered to the cluster; waiting
    		I0523 13:08:44.079388    1228 factory.go:1375] Updating pod condition for project2/test6 to (PodScheduled==False)
    		I0523 13:08:44.079641    1228 backoff_utils.go:79] Backing off 1s
    		I0523 13:08:44.079698    1228 pvc_protection_controller.go:276] Got event on pod project2/test6
    		I0523 13:08:44.079722    1228 disruption.go:328] addPod called on pod "test6"
    		I0523 13:08:44.079731    1228 disruption.go:403] No PodDisruptionBudgets found for pod test6, PodDisruptionBudget controller will avoid syncing.
    		I0523 13:08:44.079738    1228 disruption.go:331] No matching pdb for pod "test6"
    		I0523 13:08:44.079758    1228 taint_manager.go:345] Noticed pod update: types.NamespacedName{Namespace:"project2", Name:"test6"}
    		I0523 13:08:44.082739    1228 controller.go:537] quota admission added evaluator for: {security.openshift.io podsecuritypolicyselfsubjectreviews}
    		I0523 13:08:44.099203    1228 wrap.go:42] GET /api/v1/namespaces/project1: (15.555864ms) 200 [[integration.test/v1.10.0+b81c8f8 (linux/amd64) kubernetes/b81c8f8] 127.0.0.1:51574]
    		I0523 13:08:44.099203    1228 wrap.go:42] PUT /api/v1/namespaces/project2/pods/test6/status: (18.371217ms) 200 [[integration.test/v1.10.0+b81c8f8 (linux/amd64) kubernetes/b81c8f8/scheduler] 127.0.0.1:51574]
    		I0523 13:08:44.099785    1228 matcher.go:292] got preallocated value for level: s0:c8,c2 for selinux options in namespace project1
    		I0523 13:08:44.099973    1228 pvc_protection_controller.go:276] Got event on pod project2/test6
    		I0523 13:08:44.100026    1228 disruption.go:340] updatePod called on pod "test6"
    		I0523 13:08:44.100039    1228 disruption.go:403] No PodDisruptionBudgets found for pod test6, PodDisruptionBudget controller will avoid syncing.
    		I0523 13:08:44.100047    1228 disruption.go:343] No matching pdb for pod "test6"
    		I0523 13:08:44.100129    1228 wrap.go:42] POST /apis/security.openshift.io/v1/namespaces/project1/podsecuritypolicyselfsubjectreviews?timeout=5m0s: (18.247118ms) 201 [[integration.test/v1.10.0+b81c8f8 (linux/amd64) kubernetes/b81c8f8] 127.0.0.1:51858]
    		I0523 13:08:44.100790    1228 factory.go:1147] About to try and schedule pod test6
    		I0523 13:08:44.100813    1228 scheduler.go:439] Attempting to schedule pod: project2/test6
    		I0523 13:08:44.100831    1228 scheduler.go:191] Failed to schedule pod: project2/test6
    		I0523 13:08:44.100861    1228 factory.go:1262] Unable to schedule project2 test6: no nodes are registered to the cluster; waiting
    		I0523 13:08:44.100901    1228 factory.go:1375] Updating pod condition for project2/test6 to (PodScheduled==False)
    		W0523 13:08:44.100950    1228 factory.go:1304] Request for pod project2/test6 already in flight, abandoning
    		I0523 13:08:44.102066    1228 wrap.go:42] POST /api/v1/namespaces/project1/events: (22.112068ms) 201 [[integration.test/v1.10.0+b81c8f8 (linux/amd64) kubernetes/b81c8f8/leader-election] 127.0.0.1:51574]
    		I0523 13:08:44.103793    1228 wrap.go:42] GET /api/v1/namespaces/project2: (1.181801ms) 200 [[integration.test/v1.10.0+b81c8f8 (linux/amd64) kubernetes/b81c8f8] 127.0.0.1:51574]
    		I0523 13:08:44.104035    1228 matcher.go:292] got preallocated value for level: s0:c8,c7 for selinux options in namespace project2
    		I0523 13:08:44.104230    1228 wrap.go:42] POST /apis/security.openshift.io/v1/namespaces/project2/podsecuritypolicyselfsubjectreviews?timeout=5m0s: (2.934313ms) 201 [[integration.test/v1.10.0+b81c8f8 (linux/amd64) kubernetes/b81c8f8] 127.0.0.1:51858]
    		INFO: 2018/05/23 13:08:44 ccBalancerWrapper: updating state and picker called by balancer: IDLE, 0xc430e787e0
    		INFO: 2018/05/23 13:08:44 dialing to target with scheme: ""
    		INFO: 2018/05/23 13:08:44 could not get resolver for scheme: ""
    		INFO: 2018/05/23 13:08:44 balancerWrapper: is pickfirst: false
    		INFO: 2018/05/23 13:08:44 balancerWrapper: got update addr from Notify: [{127.0.0.1:17284 <nil>}]
    		INFO: 2018/05/23 13:08:44 ccBalancerWrapper: new subconn: [{127.0.0.1:17284 0  <nil>}]
    		INFO: 2018/05/23 13:08:44 balancerWrapper: handle subconn state change: 0xc432f7bc60, CONNECTING
    		INFO: 2018/05/23 13:08:44 ccBalancerWrapper: updating state and picker called by balancer: CONNECTING, 0xc430e787e0
    		I0523 13:08:44.123068    1228 wrap.go:42] PATCH /api/v1/namespaces/project1/events/test5.153148027584387d: (20.0992ms) 200 [[integration.test/v1.10.0+b81c8f8 (linux/amd64) kubernetes/b81c8f8/leader-election] 127.0.0.1:51574]
    		I0523 13:08:44.127687    1228 wrap.go:42] POST /api/v1/namespaces/project2/events: (3.838262ms) 201 [[integration.test/v1.10.0+b81c8f8 (linux/amd64) kubernetes/b81c8f8/leader-election] 127.0.0.1:51574]
    		INFO: 2018/05/23 13:08:44 balancerWrapper: handle subconn state change: 0xc432f7bc60, READY
    		INFO: 2018/05/23 13:08:44 ccBalancerWrapper: updating state and picker called by balancer: READY, 0xc430e787e0
    		INFO: 2018/05/23 13:08:44 balancerWrapper: got update addr from Notify: [{127.0.0.1:17284 <nil>}]
    		
    --- PASS: TestIntegration/TestAggregator (29.41s)
    	runner_test.go:187: 
    		
    		=== OUTPUT
    		ller-token-wg6hn: (3.69308ms) 200 [[integration.test/v1.10.0+b81c8f8 (linux/amd64) kubernetes/b81c8f8/tokens-controller] 127.0.0.1:43088]
    		I0523 13:08:48.155764    1250 wrap.go:42] POST /api/v1/namespaces/openshift-infra/secrets: (2.412704ms) 201 [[integration.test/v1.10.0+b81c8f8 (linux/amd64) kubernetes/b81c8f8/system:serviceaccount:openshift-infra:serviceaccount-pull-secrets-controller] 127.0.0.1:43214]
    		I0523 13:08:48.156745    1250 wrap.go:42] GET /api/v1/namespaces/openshift-infra/secrets/deploymentconfig-controller-token-zm298: (849.857µs) 200 [[integration.test/v1.10.0+b81c8f8 (linux/amd64) kubernetes/b81c8f8/tokens-controller] 127.0.0.1:43088]
    		I0523 13:08:48.164450    1250 wrap.go:42] PUT /api/v1/namespaces/openshift-infra/secrets/deploymentconfig-controller-token-zm298: (2.48975ms) 200 [[integration.test/v1.10.0+b81c8f8 (linux/amd64) kubernetes/b81c8f8/tokens-controller] 127.0.0.1:43088]
    		I0523 13:08:48.166271    1250 wrap.go:42] POST /apis/rbac.authorization.k8s.io/v1/namespaces/openshift-node/rolebindings: (25.639243ms) 201 [[integration.test/v1.10.0+b81c8f8 (linux/amd64) kubernetes/b81c8f8/system:serviceaccount:openshift-infra:default-rolebindings-controller] 127.0.0.1:43214]
    		I0523 13:08:48.185320    1250 request.go:485] Throttling request took 77.951569ms, request: POST:https://127.0.0.1:27205/api/v1/namespaces/openshift-infra/secrets
    		I0523 13:08:48.187089    1250 wrap.go:42] POST /api/v1/namespaces/openshift-infra/secrets: (1.554186ms) 201 [[integration.test/v1.10.0+b81c8f8 (linux/amd64) kubernetes/b81c8f8/system:serviceaccount:openshift-infra:serviceaccount-pull-secrets-controller] 127.0.0.1:43214]
    		I0523 13:08:48.188499    1250 wrap.go:42] GET /api/v1/namespaces/openshift-infra/secrets/horizontal-pod-autoscaler-token-sj54n: (1.269489ms) 200 [[integration.test/v1.10.0+b81c8f8 (linux/amd64) kubernetes/b81c8f8/tokens-controller] 127.0.0.1:43088]
    		I0523 13:08:48.194610    1250 wrap.go:42] PUT /api/v1/namespaces/openshift-infra/secrets/horizontal-pod-autoscaler-token-sj54n: (2.171116ms) 200 [[integration.test/v1.10.0+b81c8f8 (linux/amd64) kubernetes/b81c8f8/tokens-controller] 127.0.0.1:43088]
    		I0523 13:08:48.217474    1250 request.go:485] Throttling request took 107.960665ms, request: POST:https://127.0.0.1:27205/api/v1/namespaces/openshift-infra/secrets
    		I0523 13:08:48.219206    1250 wrap.go:42] POST /api/v1/namespaces/openshift-infra/secrets: (1.487533ms) 201 [[integration.test/v1.10.0+b81c8f8 (linux/amd64) kubernetes/b81c8f8/system:serviceaccount:openshift-infra:serviceaccount-pull-secrets-controller] 127.0.0.1:43214]
    		I0523 13:08:48.220229    1250 wrap.go:42] GET /api/v1/namespaces/openshift-infra/secrets/image-import-controller-token-tw4tx: (921.847µs) 200 [[integration.test/v1.10.0+b81c8f8 (linux/amd64) kubernetes/b81c8f8/tokens-controller] 127.0.0.1:43088]
    		I0523 13:08:48.226423    1250 wrap.go:42] PUT /api/v1/namespaces/openshift-infra/secrets/image-import-controller-token-tw4tx: (2.262244ms) 200 [[integration.test/v1.10.0+b81c8f8 (linux/amd64) kubernetes/b81c8f8/tokens-controller] 127.0.0.1:43088]
    		I0523 13:08:48.249835    1250 request.go:485] Throttling request took 136.806874ms, request: POST:https://127.0.0.1:27205/api/v1/namespaces/openshift-infra/secrets
    		I0523 13:08:48.252078    1250 wrap.go:42] POST /api/v1/namespaces/openshift-infra/secrets: (2.011073ms) 201 [[integration.test/v1.10.0+b81c8f8 (linux/amd64) kubernetes/b81c8f8/system:serviceaccount:openshift-infra:serviceaccount-pull-secrets-controller] 127.0.0.1:43214]
    		I0523 13:08:48.253165    1250 wrap.go:42] GET /api/v1/namespaces/openshift-infra/secrets/image-trigger-controller-token-5q2dv: (941.912µs) 200 [[integration.test/v1.10.0+b81c8f8 (linux/amd64) kubernetes/b81c8f8/tokens-controller] 127.0.0.1:43088]
    		I0523 13:08:48.259546    1250 wrap.go:42] PUT /api/v1/namespaces/openshift-infra/secrets/image-trigger-controller-token-5q2dv: (2.394126ms) 200 [[integration.test/v1.10.0+b81c8f8 (linux/amd64) kubernetes/b81c8f8/tokens-controller] 127.0.0.1:43088]
    		I0523 13:08:48.273680    1250 wrap.go:42] GET /api/v1/namespaces/openshift-web-console/configmaps/webconsole-config: (903.281µs) 404 [[integration.test/v1.10.0+b81c8f8 (linux/amd64) kubernetes/b81c8f8] 127.0.0.1:43088]
    		I0523 13:08:48.277594    1250 wrap.go:42] GET /api/v1/namespaces/openshift-web-console/configmaps/webconsole-config: (855.859µs) 404 [[integration.test/v1.10.0+b81c8f8 (linux/amd64) kubernetes/b81c8f8] 127.0.0.1:43088]
    		I0523 13:08:48.281990    1250 request.go:485] Throttling request took 157.207392ms, request: PUT:https://127.0.0.1:27205/api/v1/namespaces/openshift-infra/serviceaccounts/ingress-to-route-controller
    		I0523 13:08:48.284189    1250 wrap.go:42] PUT /api/v1/namespaces/openshift-infra/serviceaccounts/ingress-to-route-controller: (1.967567ms) 200 [[integration.test/v1.10.0+b81c8f8 (linux/amd64) kubernetes/b81c8f8/system:serviceaccount:openshift-infra:serviceaccount-pull-secrets-controller] 127.0.0.1:43214]
    		I0523 13:08:48.284364    1250 create_dockercfg_secrets.go:441] Creating token secret "ingress-to-route-controller-token-hlwh2" for service account openshift-infra/ingress-to-route-controller
    		I0523 13:08:48.314210    1250 request.go:485] Throttling request took 158.138072ms, request: PUT:https://127.0.0.1:27205/api/v1/namespaces/openshift-infra/serviceaccounts/namespace-security-allocation-controller
    		I0523 13:08:48.316562    1250 wrap.go:42] PUT /api/v1/namespaces/openshift-infra/serviceaccounts/namespace-security-allocation-controller: (2.070394ms) 200 [[integration.test/v1.10.0+b81c8f8 (linux/amd64) kubernetes/b81c8f8/system:serviceaccount:openshift-infra:serviceaccount-pull-secrets-controller] 127.0.0.1:43214]
    		I0523 13:08:48.316889    1250 create_dockercfg_secrets.go:441] Creating token secret "namespace-security-allocation-controller-token-pmq49" for service account openshift-infra/namespace-security-allocation-controller
    		I0523 13:08:48.324090    1250 wrap.go:42] GET /api?timeout=32s: (292.019µs) 200 [[integration.test/v1.10.0+b81c8f8 (linux/amd64) kubernetes/b81c8f8] 127.0.0.1:43088]
    		I0523 13:08:48.324740    1250 wrap.go:42] GET /apis?timeout=32s: (327.352µs) 200 [[integration.test/v1.10.0+b81c8f8 (linux/amd64) kubernetes/b81c8f8] 127.0.0.1:43088]
    		I0523 13:08:48.325550    1250 wrap.go:42] GET /api/v1?timeout=32s: (392.908µs) 200 [[integration.test/v1.10.0+b81c8f8 (linux/amd64) kubernetes/b81c8f8] 127.0.0.1:43088]
    		I0523 13:08:48.326214    1250 wrap.go:42] GET /apis/apiregistration.k8s.io/v1?timeout=32s: (248.988µs) 200 [[integration.test/v1.10.0+b81c8f8 (linux/amd64) kubernetes/b81c8f8] 127.0.0.1:43088]
    		I0523 13:08:48.326822    1250 wrap.go:42] GET /apis/apiregistration.k8s.io/v1beta1?timeout=32s: (270.494µs) 200 [[integration.test/v1.10.0+b81c8f8 (linux/amd64) kubernetes/b81c8f8] 127.0.0.1:43088]
    		I0523 13:08:48.327510    1250 wrap.go:42] GET /apis/extensions/v1beta1?timeout=32s: (317.39µs) 200 [[integration.test/v1.10.0+b81c8f8 (linux/amd64) kubernetes/b81c8f8] 127.0.0.1:43088]
    		I0523 13:08:48.328172    1250 wrap.go:42] GET /apis/apps/v1?timeout=32s: (310.678µs) 200 [[integration.test/v1.10.0+b81c8f8 (linux/amd64) kubernetes/b81c8f8] 127.0.0.1:43088]
    		I0523 13:08:48.328792    1250 wrap.go:42] GET /apis/apps/v1beta2?timeout=32s: (268.248µs) 200 [[integration.test/v1.10.0+b81c8f8 (linux/amd64) kubernetes/b81c8f8] 127.0.0.1:43088]
    		I0523 13:08:48.329427    1250 wrap.go:42] GET /apis/apps/v1beta1?timeout=32s: (242.15µs) 200 [[integration.test/v1.10.0+b81c8f8 (linux/amd64) kubernetes/b81c8f8] 127.0.0.1:43088]
    		I0523 13:08:48.330068    1250 wrap.go:42] GET /apis/events.k8s.io/v1beta1?timeout=32s: (277.501µs) 200 [[integration.test/v1.10.0+b81c8f8 (linux/amd64) kubernetes/b81c8f8] 127.0.0.1:43088]
    		I0523 13:08:48.331459    1250 wrap.go:42] GET /apis/authentication.k8s.io/v1?timeout=32s: (274.291µs) 200 [[integration.test/v1.10.0+b81c8f8 (linux/amd64) kubernetes/b81c8f8] 127.0.0.1:43088]
    		I0523 13:08:48.332734    1250 wrap.go:42] GET /apis/authentication.k8s.io/v1beta1?timeout=32s: (266.947µs) 200 [[integration.test/v1.10.0+b81c8f8 (linux/amd64) kubernetes/b81c8f8] 127.0.0.1:43088]
    		I0523 13:08:48.333528    1250 wrap.go:42] GET /apis/authorization.k8s.io/v1?timeout=32s: (313.496µs) 200 [[integration.test/v1.10.0+b81c8f8 (linux/amd64) kubernetes/b81c8f8] 127.0.0.1:43088]
    		I0523 13:08:48.334300    1250 wrap.go:42] GET /apis/authorization.k8s.io/v1beta1?timeout=32s: (333.285µs) 200 [[integration.test/v1.10.0+b81c8f8 (linux/amd64) kubernetes/b81c8f8] 127.0.0.1:43088]
    		I0523 13:08:48.334362    1250 wrap.go:42] GET /api/v1/namespaces/openshift-web-console/configmaps/webconsole-config: (1.218495ms) 404 [[integration.test/v1.10.0+b81c8f8 (linux/amd64) kubernetes/b81c8f8] 127.0.0.1:43088]
    		I0523 13:08:48.335019    1250 wrap.go:42] GET /apis/autoscaling/v1?timeout=32s: (262.448µs) 200 [[integration.test/v1.10.0+b81c8f8 (linux/amd64) kubernetes/b81c8f8] 127.0.0.1:43088]
    		I0523 13:08:48.335564    1250 wrap.go:42] GET /apis/rbac.authorization.k8s.io/v1/clusterroles/admin?timeout=5m0s: (1.612095ms) 200 [[integration.test/v1.10.0+b81c8f8 (linux/amd64) kubernetes/b81c8f8] 127.0.0.1:43216]
    		I0523 13:08:48.335666    1250 wrap.go:42] GET /apis/autoscaling/v2beta1?timeout=32s: (248.847µs) 200 [[integration.test/v1.10.0+b81c8f8 (linux/amd64) kubernetes/b81c8f8] 127.0.0.1:43088]
    		I0523 13:08:48.336012    1250 wrap.go:42] GET /api/v1/namespaces/openshift-web-console/configmaps/webconsole-config: (1.128937ms) 404 [[integration.test/v1.10.0+b81c8f8 (linux/amd64) kubernetes/b81c8f8] 127.0.0.1:43088]
    		I0523 13:08:48.336246    1250 wrap.go:42] GET /apis/batch/v1?timeout=32s: (249.766µs) 200 [[integration.test/v1.10.0+b81c8f8 (linux/amd64) kubernetes/b81c8f8] 127.0.0.1:43088]
    		I0523 13:08:48.336947    1250 wrap.go:42] GET /apis/batch/v1beta1?timeout=32s: (334.068µs) 200 [[integration.test/v1.10.0+b81c8f8 (linux/amd64) kubernetes/b81c8f8] 127.0.0.1:43088]
    		I0523 13:08:48.337553    1250 wrap.go:42] GET /apis/batch/v2alpha1?timeout=32s: (222.065µs) 200 [[integration.test/v1.10.0+b81c8f8 (linux/amd64) kubernetes/b81c8f8] 127.0.0.1:43088]
    		I0523 13:08:48.337704    1250 wrap.go:42] GET /apis/rbac.authorization.k8s.io/v1/clusterroles/edit?timeout=5m0s: (1.258915ms) 200 [[integration.test/v1.10.0+b81c8f8 (linux/amd64) kubernetes/b81c8f8] 127.0.0.1:43216]
    		I0523 13:08:48.338111    1250 wrap.go:42] GET /apis/certificates.k8s.io/v1beta1?timeout=32s: (239.414µs) 200 [[integration.test/v1.10.0+b81c8f8 (linux/amd64) kubernetes/b81c8f8] 127.0.0.1:43088]
    		I0523 13:08:48.338753    1250 wrap.go:42] GET /apis/networking.k8s.io/v1?timeout=32s: (315.13µs) 200 [[integration.test/v1.10.0+b81c8f8 (linux/amd64) kubernetes/b81c8f8] 127.0.0.1:43088]
    		I0523 13:08:48.339388    1250 wrap.go:42] GET /apis/rbac.authorization.k8s.io/v1/clusterroles/view?timeout=5m0s: (1.155754ms) 200 [[integration.test/v1.10.0+b81c8f8 (linux/amd64) kubernetes/b81c8f8] 127.0.0.1:43216]
    		I0523 13:08:48.339399    1250 wrap.go:42] GET /apis/policy/v1beta1?timeout=32s: (263.348µs) 200 [[integration.test/v1.10.0+b81c8f8 (linux/amd64) kubernetes/b81c8f8] 127.0.0.1:43088]
    		I0523 13:08:48.340510    1250 wrap.go:42] GET /api/v1/namespaces/openshift-web-console/configmaps/webconsole-config: (1.057006ms) 404 [[integration.test/v1.10.0+b81c8f8 (linux/amd64) kubernetes/b81c8f8] 127.0.0.1:43088]
    		I0523 13:08:48.340570    1250 wrap.go:42] GET /apis/authorization.openshift.io/v1?timeout=32s: (307.752µs) 200 [[integration.test/v1.10.0+b81c8f8 (linux/amd64) kubernetes/b81c8f8] 127.0.0.1:43088]
    		I0523 13:08:48.341280    1250 wrap.go:42] GET /apis/rbac.authorization.k8s.io/v1?timeout=32s: (296.833µs) 200 [[integration.test/v1.10.0+b81c8f8 (linux/amd64) kubernetes/b81c8f8] 127.0.0.1:43088]
    		I0523 13:08:48.341908    1250 wrap.go:42] GET /apis/rbac.authorization.k8s.io/v1beta1?timeout=32s: (252.853µs) 200 [[integration.test/v1.10.0+b81c8f8 (linux/amd64) kubernetes/b81c8f8] 127.0.0.1:43088]
    		I0523 13:08:48.342553    1250 wrap.go:42] GET /apis/storage.k8s.io/v1?timeout=32s: (245.631µs) 200 [[integration.test/v1.10.0+b81c8f8 (linux/amd64) kubernetes/b81c8f8] 127.0.0.1:43088]
    		I0523 13:08:48.343422    1250 wrap.go:42] GET /apis/storage.k8s.io/v1beta1?timeout=32s: (329.731µs) 200 [[integration.test/v1.10.0+b81c8f8 (linux/amd64) kubernetes/b81c8f8] 127.0.0.1:43088]
    		I0523 13:08:48.343618    1250 wrap.go:42] GET /api/v1/namespaces/default?timeout=5m0s: (1.292553ms) 200 [[integration.test/v1.10.0+b81c8f8 (linux/amd64) kubernetes/b81c8f8] 127.0.0.1:43216]
    		I0523 13:08:48.343714    1250 wrap.go:42] GET /api/v1/namespaces/openshift-web-console/configmaps/webconsole-config: (807.933µs) 404 [[integration.test/v1.10.0+b81c8f8 (linux/amd64) kubernetes/b81c8f8] 127.0.0.1:43088]
    		I0523 13:08:48.344446    1250 wrap.go:42] GET /apis/admissionregistration.k8s.io/v1beta1?timeout=32s: (225.576µs) 200 [[integration.test/v1.10.0+b81c8f8 (linux/amd64) kubernetes/b81c8f8] 127.0.0.1:43088]
    		I0523 13:08:48.344574    1250 wrap.go:42] GET /api/v1/namespaces/openshift-web-console/configmaps/webconsole-config: (1.017902ms) 404 [[integration.test/v1.10.0+b81c8f8 (linux/amd64) kubernetes/b81c8f8] 127.0.0.1:43088]
    		I0523 13:08:48.345108    1250 wrap.go:42] GET /apis/apiextensions.k8s.io/v1beta1?timeout=32s: (342.202µs) 200 [[integration.test/v1.10.0+b81c8f8 (linux/amd64) kubernetes/b81c8f8] 127.0.0.1:43088]
    		I0523 13:08:48.345825    1250 wrap.go:42] GET /api/v1/namespaces/default: (948.242µs) 200 [[integration.test/v1.10.0+b81c8f8 (linux/amd64) kubernetes/b81c8f8] 127.0.0.1:43088]
    		I0523 13:08:48.345869    1250 wrap.go:42] GET /apis/apps.openshift.io/v1?timeout=32s: (378.222µs) 200 [[integration.test/v1.10.0+b81c8f8 (linux/amd64) kubernetes/b81c8f8] 127.0.0.1:43088]
    		I0523 13:08:48.346544    1250 wrap.go:42] GET /apis/project.openshift.io/v1/projects/default?timeout=5m0s: (2.234615ms) 200 [[integration.test/v1.10.0+b81c8f8 (linux/amd64) kubernetes/b81c8f8] 127.0.0.1:43216]
    		I0523 13:08:48.346612    1250 wrap.go:42] GET /apis/build.openshift.io/v1?timeout=32s: (316.804µs) 200 [[integration.test/v1.10.0+b81c8f8 (linux/amd64) kubernetes/b81c8f8] 127.0.0.1:43088]
    		I0523 13:08:48.346977    1250 request.go:485] Throttling request took 159.617286ms, request: PUT:https://127.0.0.1:27205/api/v1/namespaces/openshift-infra/serviceaccounts/node-bootstrapper
    		I0523 13:08:48.347533    1250 wrap.go:42] GET /apis/image.openshift.io/v1?timeout=32s: (416.461µs) 200 [[integration.test/v1.10.0+b81c8f8 (linux/amd64) kubernetes/b81c8f8] 127.0.0.1:43088]
    		I0523 13:08:48.348144    1250 wrap.go:42] GET /api/v1/namespaces/openshift-web-console/configmaps/webconsole-config: (912.629µs) 404 [[integration.test/v1.10.0+b81c8f8 (linux/amd64) kubernetes/b81c8f8] 127.0.0.1:43088]
    		I0523 13:08:48.348628    1250 wrap.go:42] GET /api/v1/namespaces/default: (1.023827ms) 200 [[integration.test/v1.10.0+b81c8f8 (linux/amd64) kubernetes/b81c8f8] 127.0.0.1:43088]
    		I0523 13:08:48.348665    1250 wrap.go:42] GET /apis/network.openshift.io/v1?timeout=32s: (411.36µs) 200 [[integration.test/v1.10.0+b81c8f8 (linux/amd64) kubernetes/b81c8f8] 127.0.0.1:43088]
    		I0523 13:08:48.349006    1250 wrap.go:42] GET /apis/project.openshift.io/v1/projects/default?timeout=5m0s: (1.947576ms) 200 [[integration.test/v1.10.0+b81c8f8 (linux/amd64) kubernetes/b81c8f8] 127.0.0.1:43216]
    		I0523 13:08:48.349794    1250 wrap.go:42] GET /apis/oauth.openshift.io/v1?timeout=32s: (300.288µs) 200 [[integration.test/v1.10.0+b81c8f8 (linux/amd64) kubernetes/b81c8f8] 127.0.0.1:43088]
    		I0523 13:08:48.350037    1250 wrap.go:42] PUT /api/v1/namespaces/openshift-infra/serviceaccounts/node-bootstrapper: (2.777043ms) 200 [[integration.test/v1.10.0+b81c8f8 (linux/amd64) kubernetes/b81c8f8/system:serviceaccount:openshift-infra:serviceaccount-pull-secrets-controller] 127.0.0.1:43214]
    		I0523 13:08:48.350946    1250 create_dockercfg_secrets.go:441] Creating token secret "node-bootstrapper-token-bd2d5" for service account openshift-infra/node-bootstrapper
    		I0523 13:08:48.351634    1250 wrap.go:42] GET /apis/project.openshift.io/v1?timeout=32s: (237.077µs) 200 [[integration.test/v1.10.0+b81c8f8 (linux/amd64) kubernetes/b81c8f8] 127.0.0.1:43088]
    		I0523 13:08:48.351862    1250 wrap.go:42] GET /api/v1/namespaces/default: (2.084893ms) 200 [[integration.test/v1.10.0+b81c8f8 (linux/amd64) kubernetes/b81c8f8] 127.0.0.1:43074]
    		I0523 13:08:48.352295    1250 wrap.go:42] GET /apis/apiregistration.k8s.io/v1beta1/apiservices/v1.?timeout=5m0s: (2.181897ms) 200 [[integration.test/v1.10.0+b81c8f8 (linux/amd64) kubernetes/b81c8f8] 127.0.0.1:43216]
    		I0523 13:08:48.352418    1250 wrap.go:42] GET /api/v1/namespaces/openshift-web-console/configmaps/webconsole-config: (1.85008ms) 404 [[integration.test/v1.10.0+b81c8f8 (linux/amd64) kubernetes/b81c8f8] 127.0.0.1:43088]
    		I0523 13:08:48.352590    1250 wrap.go:42] GET /api/v1/namespaces/openshift-web-console/configmaps/webconsole-config: (2.455565ms) 404 [[integration.test/v1.10.0+b81c8f8 (linux/amd64) kubernetes/b81c8f8] 127.0.0.1:43088]
    		I0523 13:08:48.352750    1250 wrap.go:42] GET /api/v1/namespaces/openshift-web-console/configmaps/webconsole-config: (2.823358ms) 404 [[integration.test/v1.10.0+b81c8f8 (linux/amd64) kubernetes/b81c8f8] 127.0.0.1:43088]
    		I0523 13:08:48.352851    1250 wrap.go:42] GET /apis/quota.openshift.io/v1?timeout=32s: (333.672µs) 200 [[integration.test/v1.10.0+b81c8f8 (linux/amd64) kubernetes/b81c8f8] 127.0.0.1:43088]
    		I0523 13:08:48.352906    1250 wrap.go:42] GET /api/v1/namespaces/openshift-web-console/configmaps/webconsole-config: (2.531689ms) 404 [[integration.test/v1.10.0+b81c8f8 (linux/amd64) kubernetes/b81c8f8] 127.0.0.1:43088]
    		I0523 13:08:48.353425    1250 wrap.go:42] GET /api/v1/namespaces/default/services/kubernetes: (915.959µs) 200 [[integration.test/v1.10.0+b81c8f8 (linux/amd64) kubernetes/b81c8f8] 127.0.0.1:43074]
    		I0523 13:08:48.353717    1250 wrap.go:42] GET /apis/route.openshift.io/v1?timeout=32s: (322.777µs) 200 [[integration.test/v1.10.0+b81c8f8 (linux/amd64) kubernetes/b81c8f8] 127.0.0.1:43088]
    		I0523 13:08:48.354331    1250 wrap.go:42] GET /apis/apiregistration.k8s.io/v1beta1/apiservices/v1.project.openshift.io?timeout=5m0s: (1.271805ms) 200 [[integration.test/v1.10.0+b81c8f8 (linux/amd64) kubernetes/b81c8f8] 127.0.0.1:43216]
    		I0523 13:08:48.354455    1250 wrap.go:42] GET /apis/security.openshift.io/v1?timeout=32s: (354.928µs) 200 [[integration.test/v1.10.0+b81c8f8 (linux/amd64) kubernetes/b81c8f8] 127.0.0.1:43088]
    		I0523 13:08:48.355320    1250 wrap.go:42] GET /apis/template.openshift.io/v1?timeout=32s: (424.581µs) 200 [[integration.test/v1.10.0+b81c8f8 (linux/amd64) kubernetes/b81c8f8] 127.0.0.1:43088]
    		I0523 13:08:48.356098    1250 wrap.go:42] GET /apis/user.openshift.io/v1?timeout=32s: (365.79µs) 200 [[integration.test/v1.10.0+b81c8f8 (linux/amd64) kubernetes/b81c8f8] 127.0.0.1:43088]
    		I0523 13:08:48.356137    1250 wrap.go:42] GET /apis/apiregistration.k8s.io/v1beta1/apiservices/v1beta1.rbac.authorization.k8s.io?timeout=5m0s: (1.329391ms) 200 [[integration.test/v1.10.0+b81c8f8 (linux/amd64) kubernetes/b81c8f8] 127.0.0.1:43216]
    		INFO: 2018/05/23 13:08:48 ccBalancerWrapper: updating state and picker called by balancer: IDLE, 0xc42433e480
    		INFO: 2018/05/23 13:08:48 dialing to target with scheme: ""
    		INFO: 2018/05/23 13:08:48 could not get resolver for scheme: ""
    		INFO: 2018/05/23 13:08:48 balancerWrapper: is pickfirst: false
    		INFO: 2018/05/23 13:08:48 balancerWrapper: got update addr from Notify: [{127.0.0.1:12665 <nil>}]
    		INFO: 2018/05/23 13:08:48 ccBalancerWrapper: new subconn: [{127.0.0.1:12665 0  <nil>}]
    		INFO: 2018/05/23 13:08:48 balancerWrapper: handle subconn state change: 0xc42878e170, CONNECTING
    		INFO: 2018/05/23 13:08:48 ccBalancerWrapper: updating state and picker called by balancer: CONNECTING, 0xc42433e480
    		INFO: 2018/05/23 13:08:48 balancerWrapper: handle subconn state change: 0xc42878e170, READY
    		INFO: 2018/05/23 13:08:48 ccBalancerWrapper: updating state and picker called by balancer: READY, 0xc42433e480
    		INFO: 2018/05/23 13:08:48 balancerWrapper: got update addr from Notify: [{127.0.0.1:12665 <nil>}]
    		
    --- PASS: TestIntegration/TestAlwaysPullImagesOff (36.03s)
    	runner_test.go:187: 
    		
    		=== OUTPUT
    		
    		I0523 13:08:50.781033    1240 request.go:485] Throttling request took 62.254568ms, request: POST:https://127.0.0.1:18640/api/v1/namespaces/integration/secrets
    		I0523 13:08:50.782927    1240 wrap.go:42] POST /api/v1/namespaces/integration/secrets: (1.675195ms) 201 [[integration.test/v1.10.0+b81c8f8 (linux/amd64) kubernetes/b81c8f8/system:serviceaccount:openshift-infra:serviceaccount-pull-secrets-controller] 127.0.0.1:49972]
    		I0523 13:08:50.815553    1240 wrap.go:42] PUT /api/v1/namespaces/integration/serviceaccounts/builder: (1.979012ms) 200 [[integration.test/v1.10.0+b81c8f8 (linux/amd64) kubernetes/b81c8f8/system:serviceaccount:openshift-infra:serviceaccount-pull-secrets-controller] 127.0.0.1:49972]
    		I0523 13:08:50.845592    1240 request.go:485] Throttling request took 62.405036ms, request: POST:https://127.0.0.1:18640/api/v1/namespaces/integration/secrets
    		I0523 13:08:50.847365    1240 wrap.go:42] POST /api/v1/namespaces/integration/secrets: (1.550398ms) 201 [[integration.test/v1.10.0+b81c8f8 (linux/amd64) kubernetes/b81c8f8/system:serviceaccount:openshift-infra:serviceaccount-pull-secrets-controller] 127.0.0.1:49972]
    		I0523 13:08:50.880353    1240 wrap.go:42] PUT /api/v1/namespaces/integration/serviceaccounts/default: (2.245062ms) 200 [[integration.test/v1.10.0+b81c8f8 (linux/amd64) kubernetes/b81c8f8/system:serviceaccount:openshift-infra:serviceaccount-pull-secrets-controller] 127.0.0.1:49972]
    		I0523 13:08:50.910142    1240 request.go:485] Throttling request took 62.523353ms, request: POST:https://127.0.0.1:18640/api/v1/namespaces/integration/secrets
    		I0523 13:08:50.912190    1240 wrap.go:42] POST /api/v1/namespaces/integration/secrets: (1.851295ms) 201 [[integration.test/v1.10.0+b81c8f8 (linux/amd64) kubernetes/b81c8f8/system:serviceaccount:openshift-infra:serviceaccount-pull-secrets-controller] 127.0.0.1:49972]
    		I0523 13:08:50.944449    1240 wrap.go:42] PUT /api/v1/namespaces/integration/serviceaccounts/deployer: (1.88368ms) 200 [[integration.test/v1.10.0+b81c8f8 (linux/amd64) kubernetes/b81c8f8/system:serviceaccount:openshift-infra:serviceaccount-pull-secrets-controller] 127.0.0.1:49972]
    		I0523 13:08:51.035448    1240 wrap.go:42] GET /api/v1/namespaces/kube-system/configmaps/kube-controller-manager: (1.184275ms) 200 [[integration.test/v1.10.0+b81c8f8 (linux/amd64) kubernetes/b81c8f8/leader-election] 127.0.0.1:49740]
    		I0523 13:08:51.038189    1240 wrap.go:42] PUT /api/v1/namespaces/kube-system/configmaps/kube-controller-manager: (2.2558ms) 200 [[integration.test/v1.10.0+b81c8f8 (linux/amd64) kubernetes/b81c8f8/leader-election] 127.0.0.1:49740]
    		I0523 13:08:51.038410    1240 leaderelection.go:199] successfully renewed lease kube-system/kube-controller-manager
    		I0523 13:08:51.283631    1240 wrap.go:42] GET /api/v1/namespaces/kube-system/configmaps/openshift-master-controllers: (1.357818ms) 200 [[integration.test/v1.10.0+b81c8f8 (linux/amd64) kubernetes/b81c8f8] 127.0.0.1:49740]
    		I0523 13:08:51.286259    1240 wrap.go:42] PUT /api/v1/namespaces/kube-system/configmaps/openshift-master-controllers: (2.127734ms) 200 [[integration.test/v1.10.0+b81c8f8 (linux/amd64) kubernetes/b81c8f8] 127.0.0.1:49740]
    		I0523 13:08:51.286460    1240 leaderelection.go:199] successfully renewed lease kube-system/openshift-master-controllers
    		I0523 13:08:51.429875    1240 wrap.go:42] GET /api/v1/namespaces/openshift-web-console/configmaps/webconsole-config: (1.113093ms) 404 [[integration.test/v1.10.0+b81c8f8 (linux/amd64) kubernetes/b81c8f8] 127.0.0.1:49740]
    		I0523 13:08:51.451671    1240 wrap.go:42] GET /api/v1/namespaces/integration/serviceaccounts/default?timeout=5m0s: (1.057783ms) 200 [[integration.test/v1.10.0+b81c8f8 (linux/amd64) kubernetes/b81c8f8] 127.0.0.1:49980]
    		I0523 13:08:51.453454    1240 wrap.go:42] GET /api/v1/namespaces/integration/secrets/default-token-b8wkb?timeout=5m0s: (1.306861ms) 200 [[integration.test/v1.10.0+b81c8f8 (linux/amd64) kubernetes/b81c8f8] 127.0.0.1:49980]
    		I0523 13:08:51.454982    1240 wrap.go:42] GET /api/v1/namespaces/integration/secrets/default-dockercfg-2ngqd?timeout=5m0s: (958.655µs) 200 [[integration.test/v1.10.0+b81c8f8 (linux/amd64) kubernetes/b81c8f8] 127.0.0.1:49980]
    		I0523 13:08:51.457423    1240 wrap.go:42] GET /api/v1/namespaces/integration/limitranges: (994.044µs) 200 [[integration.test/v1.10.0+b81c8f8 (linux/amd64) kubernetes/b81c8f8] 127.0.0.1:49740]
    		I0523 13:08:51.457749    1240 admission.go:97] getting security context constraints for pod  (generate: test) in namespace integration with user info &{system:admin  [system:masters system:cluster-admins system:authenticated] map[]}
    		I0523 13:08:51.457823    1240 admission.go:108] getting security context constraints for pod  (generate: test) with service account info &{system:serviceaccount:integration:default  [system:serviceaccounts system:serviceaccounts:integration] map[]}
    		I0523 13:08:51.459621    1240 wrap.go:42] GET /api/v1/namespaces/integration: (938.822µs) 200 [[integration.test/v1.10.0+b81c8f8 (linux/amd64) kubernetes/b81c8f8] 127.0.0.1:49740]
    		I0523 13:08:51.459836    1240 matcher.go:292] got preallocated value for level: s0:c8,c2 for selinux options in namespace integration
    		I0523 13:08:51.459875    1240 matcher.go:279] got preallocated values for min: 1000060000, max: 1000069999 for uid range in namespace integration
    		I0523 13:08:51.459891    1240 matcher.go:292] got preallocated value for level: s0:c8,c2 for selinux options in namespace integration
    		I0523 13:08:51.459897    1240 matcher.go:322] got preallocated value for groups: 1000060000/10000 in namespace integration
    		I0523 13:08:51.459919    1240 matcher.go:292] got preallocated value for level: s0:c8,c2 for selinux options in namespace integration
    		I0523 13:08:51.459932    1240 matcher.go:292] got preallocated value for level: s0:c8,c2 for selinux options in namespace integration
    		I0523 13:08:51.459942    1240 matcher.go:279] got preallocated values for min: 1000060000, max: 1000069999 for uid range in namespace integration
    		I0523 13:08:51.459951    1240 matcher.go:292] got preallocated value for level: s0:c8,c2 for selinux options in namespace integration
    		I0523 13:08:51.459956    1240 matcher.go:322] got preallocated value for groups: 1000060000/10000 in namespace integration
    		I0523 13:08:51.459980    1240 matcher.go:342] got preallocated value for groups: 1000060000/10000 in namespace integration
    		I0523 13:08:51.460009    1240 matcher.go:279] got preallocated values for min: 1000060000, max: 1000069999 for uid range in namespace integration
    		I0523 13:08:51.460023    1240 matcher.go:292] got preallocated value for level: s0:c8,c2 for selinux options in namespace integration
    		I0523 13:08:51.460030    1240 matcher.go:322] got preallocated value for groups: 1000060000/10000 in namespace integration
    		I0523 13:08:51.460049    1240 admission.go:217] validating pod  (generate: test) against providers anyuid,restricted,nonroot,hostmount-anyuid,hostnetwork,hostaccess,privileged
    		I0523 13:08:51.460114    1240 admission.go:170] pod  (generate: test) validated against provider anyuid
    		I0523 13:08:51.461710    1240 wrap.go:42] POST /api/v1/namespaces/integration/pods?timeout=5m0s: (6.1029ms) 201 [[integration.test/v1.10.0+b81c8f8 (linux/amd64) kubernetes/b81c8f8] 127.0.0.1:49980]
    		I0523 13:08:51.462162    1240 factory.go:1147] About to try and schedule pod testptwtf
    		I0523 13:08:51.462185    1240 scheduler.go:439] Attempting to schedule pod: integration/testptwtf
    		I0523 13:08:51.462207    1240 scheduler.go:191] Failed to schedule pod: integration/testptwtf
    		I0523 13:08:51.462271    1240 factory.go:1262] Unable to schedule integration testptwtf: no nodes are registered to the cluster; waiting
    		I0523 13:08:51.462315    1240 factory.go:1375] Updating pod condition for integration/testptwtf to (PodScheduled==False)
    		I0523 13:08:51.462556    1240 backoff_utils.go:79] Backing off 1s
    		I0523 13:08:51.463049    1240 taint_manager.go:345] Noticed pod update: types.NamespacedName{Namespace:"integration", Name:"testptwtf"}
    		I0523 13:08:51.463123    1240 disruption.go:328] addPod called on pod "testptwtf"
    		I0523 13:08:51.463136    1240 disruption.go:403] No PodDisruptionBudgets found for pod testptwtf, PodDisruptionBudget controller will avoid syncing.
    		I0523 13:08:51.463143    1240 disruption.go:331] No matching pdb for pod "testptwtf"
    		I0523 13:08:51.463176    1240 pvc_protection_controller.go:276] Got event on pod integration/testptwtf
    		I0523 13:08:51.465736    1240 wrap.go:42] PUT /api/v1/namespaces/integration/pods/testptwtf/status: (3.127883ms) 200 [[integration.test/v1.10.0+b81c8f8 (linux/amd64) kubernetes/b81c8f8/scheduler] 127.0.0.1:49740]
    		I0523 13:08:51.466407    1240 store.go:370] GuaranteedUpdate of /kubernetes.io/pods/integration/testptwtf failed because of a conflict, going to retry
    		I0523 13:08:51.466503    1240 disruption.go:340] updatePod called on pod "testptwtf"
    		I0523 13:08:51.466527    1240 disruption.go:403] No PodDisruptionBudgets found for pod testptwtf, PodDisruptionBudget controller will avoid syncing.
    		I0523 13:08:51.466535    1240 disruption.go:343] No matching pdb for pod "testptwtf"
    		I0523 13:08:51.466552    1240 pvc_protection_controller.go:276] Got event on pod integration/testptwtf
    		I0523 13:08:51.467823    1240 wrap.go:42] POST /api/v1/namespaces/integration/events: (4.677843ms) 201 [[integration.test/v1.10.0+b81c8f8 (linux/amd64) kubernetes/b81c8f8/leader-election] 127.0.0.1:49740]
    		I0523 13:08:51.467861    1240 factory.go:1147] About to try and schedule pod testptwtf
    		I0523 13:08:51.467870    1240 scheduler.go:439] Attempting to schedule pod: integration/testptwtf
    		I0523 13:08:51.467881    1240 scheduler.go:191] Failed to schedule pod: integration/testptwtf
    		I0523 13:08:51.467903    1240 factory.go:1262] Unable to schedule integration testptwtf: no nodes are registered to the cluster; waiting
    		I0523 13:08:51.467930    1240 factory.go:1375] Updating pod condition for integration/testptwtf to (PodScheduled==False)
    		W0523 13:08:51.467993    1240 factory.go:1304] Request for pod integration/testptwtf already in flight, abandoning
    		I0523 13:08:51.468300    1240 wrap.go:42] GET /api/v1/namespaces/openshift-web-console/configmaps/webconsole-config: (2.113148ms) 404 [[integration.test/v1.10.0+b81c8f8 (linux/amd64) kubernetes/b81c8f8] 127.0.0.1:49740]
    		I0523 13:08:51.468465    1240 resource_quota_monitor.go:352] QuotaMonitor process object: /v1, Resource=pods, namespace integration, name testptwtf, uid 70227041-5e8a-11e8-bdd9-0242ac110002, event type update
    		I0523 13:08:51.468678    1240 factory.go:1147] About to try and schedule pod testptwtf
    		I0523 13:08:51.468704    1240 scheduler.go:435] Skip schedule deleting pod: integration/testptwtf
    		I0523 13:08:51.468786    1240 disruption.go:340] updatePod called on pod "testptwtf"
    		I0523 13:08:51.468796    1240 pvc_protection_controller.go:276] Got event on pod integration/testptwtf
    		I0523 13:08:51.468804    1240 disruption.go:403] No PodDisruptionBudgets found for pod testptwtf, PodDisruptionBudget controller will avoid syncing.
    		I0523 13:08:51.468816    1240 disruption.go:343] No matching pdb for pod "testptwtf"
    		I0523 13:08:51.468846    1240 resource_quota_monitor.go:352] QuotaMonitor process object: /v1, Resource=pods, namespace integration, name testptwtf, uid 70227041-5e8a-11e8-bdd9-0242ac110002, event type update
    		I0523 13:08:51.469461    1240 wrap.go:42] GET /api/v1/namespaces/openshift-web-console/configmaps/webconsole-config: (2.610129ms) 404 [[integration.test/v1.10.0+b81c8f8 (linux/amd64) kubernetes/b81c8f8] 127.0.0.1:49740]
    		I0523 13:08:51.470847    1240 deployment_controller.go:357] Pod testptwtf deleted.
    		I0523 13:08:51.470890    1240 taint_manager.go:338] Noticed pod deletion: types.NamespacedName{Namespace:"integration", Name:"testptwtf"}
    		I0523 13:08:51.470897    1240 wrap.go:42] DELETE /api/v1/namespaces/integration/pods/testptwtf?timeout=5m0s: (8.12831ms) 200 [[integration.test/v1.10.0+b81c8f8 (linux/amd64) kubernetes/b81c8f8] 127.0.0.1:49980]
    		I0523 13:08:51.471045    1240 disruption.go:369] deletePod called on pod "testptwtf"
    		I0523 13:08:51.471067    1240 disruption.go:403] No PodDisruptionBudgets found for pod testptwtf, PodDisruptionBudget controller will avoid syncing.
    		I0523 13:08:51.471075    1240 disruption.go:372] No matching pdb for pod "testptwtf"
    		I0523 13:08:51.471097    1240 pvc_protection_controller.go:276] Got event on pod integration/testptwtf
    		I0523 13:08:51.471129    1240 resource_quota_monitor.go:352] QuotaMonitor process object: /v1, Resource=pods, namespace integration, name testptwtf, uid 70227041-5e8a-11e8-bdd9-0242ac110002, event type delete
    		I0523 13:08:51.471178    1240 resource_quota_monitor.go:352] QuotaMonitor process object: /v1, Resource=pods, namespace integration, name testptwtf, uid 70227041-5e8a-11e8-bdd9-0242ac110002, event type delete
    		I0523 13:08:51.472065    1240 admission.go:97] getting security context constraints for pod  (generate: test) in namespace integration with user info &{system:admin  [system:masters system:cluster-admins system:authenticated] map[]}
    		I0523 13:08:51.472104    1240 admission.go:108] getting security context constraints for pod  (generate: test) with service account info &{system:serviceaccount:integration:default  [system:serviceaccounts system:serviceaccounts:integration] map[]}
    		I0523 13:08:51.474524    1240 wrap.go:42] GET /api/v1/namespaces/integration: (1.449833ms) 200 [[integration.test/v1.10.0+b81c8f8 (linux/amd64) kubernetes/b81c8f8] 127.0.0.1:49740]
    		I0523 13:08:51.474536    1240 wrap.go:42] PATCH /api/v1/namespaces/integration/events/testptwtf.153148042f1553dd: (5.138284ms) 200 [[integration.test/v1.10.0+b81c8f8 (linux/amd64) kubernetes/b81c8f8/leader-election] 127.0.0.1:49740]
    		I0523 13:08:51.474764    1240 matcher.go:292] got preallocated value for level: s0:c8,c2 for selinux options in namespace integration
    		I0523 13:08:51.474786    1240 matcher.go:279] got preallocated values for min: 1000060000, max: 1000069999 for uid range in namespace integration
    		I0523 13:08:51.474792    1240 matcher.go:292] got preallocated value for level: s0:c8,c2 for selinux options in namespace integration
    		I0523 13:08:51.474797    1240 matcher.go:322] got preallocated value for groups: 1000060000/10000 in namespace integration
    		I0523 13:08:51.474808    1240 matcher.go:292] got preallocated value for level: s0:c8,c2 for selinux options in namespace integration
    		I0523 13:08:51.474814    1240 matcher.go:292] got preallocated value for level: s0:c8,c2 for selinux options in namespace integration
    		I0523 13:08:51.474823    1240 matcher.go:279] got preallocated values for min: 1000060000, max: 1000069999 for uid range in namespace integration
    		I0523 13:08:51.474828    1240 matcher.go:292] got preallocated value for level: s0:c8,c2 for selinux options in namespace integration
    		I0523 13:08:51.474832    1240 matcher.go:322] got preallocated value for groups: 1000060000/10000 in namespace integration
    		I0523 13:08:51.474839    1240 matcher.go:342] got preallocated value for groups: 1000060000/10000 in namespace integration
    		I0523 13:08:51.474851    1240 matcher.go:279] got preallocated values for min: 1000060000, max: 1000069999 for uid range in namespace integration
    		I0523 13:08:51.474855    1240 matcher.go:292] got preallocated value for level: s0:c8,c2 for selinux options in namespace integration
    		I0523 13:08:51.474860    1240 matcher.go:322] got preallocated value for groups: 1000060000/10000 in namespace integration
    		I0523 13:08:51.474873    1240 admission.go:217] validating pod  (generate: test) against providers anyuid,restricted,nonroot,hostmount-anyuid,hostnetwork,hostaccess,privileged
    		I0523 13:08:51.474925    1240 admission.go:170] pod  (generate: test) validated against provider anyuid
    		I0523 13:08:51.476392    1240 wrap.go:42] POST /api/v1/namespaces/integration/pods?timeout=5m0s: (4.862185ms) 201 [[integration.test/v1.10.0+b81c8f8 (linux/amd64) kubernetes/b81c8f8] 127.0.0.1:49980]
    		I0523 13:08:51.476536    1240 factory.go:1147] About to try and schedule pod testh9fk2
    		I0523 13:08:51.476557    1240 scheduler.go:439] Attempting to schedule pod: integration/testh9fk2
    		I0523 13:08:51.476573    1240 scheduler.go:191] Failed to schedule pod: integration/testh9fk2
    		I0523 13:08:51.476589    1240 factory.go:1262] Unable to schedule integration testh9fk2: no nodes are registered to the cluster; waiting
    		I0523 13:08:51.476622    1240 factory.go:1375] Updating pod condition for integration/testh9fk2 to (PodScheduled==False)
    		I0523 13:08:51.476789    1240 taint_manager.go:345] Noticed pod update: types.NamespacedName{Namespace:"integration", Name:"testh9fk2"}
    		I0523 13:08:51.476844    1240 disruption.go:328] addPod called on pod "testh9fk2"
    		I0523 13:08:51.476856    1240 disruption.go:403] No PodDisruptionBudgets found for pod testh9fk2, PodDisruptionBudget controller will avoid syncing.
    		I0523 13:08:51.476863    1240 disruption.go:331] No matching pdb for pod "testh9fk2"
    		I0523 13:08:51.476885    1240 pvc_protection_controller.go:276] Got event on pod integration/testh9fk2
    		I0523 13:08:51.476917    1240 backoff_utils.go:79] Backing off 1s
    		INFO: 2018/05/23 13:08:51 ccBalancerWrapper: updating state and picker called by balancer: IDLE, 0xc43eefc720
    		INFO: 2018/05/23 13:08:51 dialing to target with scheme: ""
    		INFO: 2018/05/23 13:08:51 could not get resolver for scheme: ""
    		INFO: 2018/05/23 13:08:51 balancerWrapper: is pickfirst: false
    		INFO: 2018/05/23 13:08:51 balancerWrapper: got update addr from Notify: [{127.0.0.1:29836 <nil>}]
    		INFO: 2018/05/23 13:08:51 ccBalancerWrapper: new subconn: [{127.0.0.1:29836 0  <nil>}]
    		INFO: 2018/05/23 13:08:51 balancerWrapper: handle subconn state change: 0xc430f3e810, CONNECTING
    		INFO: 2018/05/23 13:08:51 ccBalancerWrapper: updating state and picker called by balancer: CONNECTING, 0xc43eefc720
    		I0523 13:08:51.478501    1240 wrap.go:42] POST /api/v1/namespaces/integration/events: (3.477877ms) 201 [[integration.test/v1.10.0+b81c8f8 (linux/amd64) kubernetes/b81c8f8/leader-election] 127.0.0.1:49740]
    		I0523 13:08:51.479264    1240 wrap.go:42] PUT /api/v1/namespaces/integration/pods/testh9fk2/status: (2.390405ms) 200 [[integration.test/v1.10.0+b81c8f8 (linux/amd64) kubernetes/b81c8f8/scheduler] 127.0.0.1:49740]
    		I0523 13:08:51.479589    1240 disruption.go:340] updatePod called on pod "testh9fk2"
    		I0523 13:08:51.479605    1240 disruption.go:403] No PodDisruptionBudgets found for pod testh9fk2, PodDisruptionBudget controller will avoid syncing.
    		I0523 13:08:51.479612    1240 disruption.go:343] No matching pdb for pod "testh9fk2"
    		I0523 13:08:51.479627    1240 pvc_protection_controller.go:276] Got event on pod integration/testh9fk2
    		I0523 13:08:51.479686    1240 factory.go:1147] About to try and schedule pod testh9fk2
    		I0523 13:08:51.479695    1240 scheduler.go:439] Attempting to schedule pod: integration/testh9fk2
    		I0523 13:08:51.479708    1240 scheduler.go:191] Failed to schedule pod: integration/testh9fk2
    		I0523 13:08:51.479723    1240 factory.go:1262] Unable to schedule integration testh9fk2: no nodes are registered to the cluster; waiting
    		I0523 13:08:51.479742    1240 factory.go:1375] Updating pod condition for integration/testh9fk2 to (PodScheduled==False)
    		W0523 13:08:51.479772    1240 factory.go:1304] Request for pod integration/testh9fk2 already in flight, abandoning
    		I0523 13:08:51.481418    1240 wrap.go:42] POST /api/v1/namespaces/integration/events: (2.482895ms) 201 [[integration.test/v1.10.0+b81c8f8 (linux/amd64) kubernetes/b81c8f8/leader-election] 127.0.0.1:49740]
    		I0523 13:08:51.485179    1240 wrap.go:42] PATCH /api/v1/namespaces/integration/events/testh9fk2.153148042fefa84b: (3.174044ms) 200 [[integration.test/v1.10.0+b81c8f8 (linux/amd64) kubernetes/b81c8f8/leader-election] 127.0.0.1:49740]
    		INFO: 2018/05/23 13:08:51 balancerWrapper: handle subconn state change: 0xc430f3e810, READY
    		INFO: 2018/05/23 13:08:51 ccBalancerWrapper: updating state and picker called by balancer: READY, 0xc43eefc720
    		INFO: 2018/05/23 13:08:51 balancerWrapper: got update addr from Notify: [{127.0.0.1:29836 <nil>}]
    		
FAIL
exit status 1
FAIL	github.com/openshift/origin/test/integration/runner	1916.714s
[INFO] [13:08:51+0000] jUnit XML report placed at _output/scripts/test-integration/artifacts/gotest_report_KtUpJ.xml
Of 203 tests executed in 1916.714s, 201 succeeded, 2 failed, and 0 were skipped.

In suite "github.com/openshift/origin/test/integration/runner", test case "TestIntegration" failed:
runner_test.go:84: using existing binary

In suite "github.com/openshift/origin/test/integration/runner", test case "TestIntegration/TestOAuthServiceAccountClientEvent" failed:
runner_test.go:129: FAILED TestOAuthServiceAccountClientEvent, retrying:

oauth_serviceaccount_client_events_test.go:141: test-bad-redirect-annotation-kind: annotationPrefix serviceaccounts.openshift.io/oauth-redirectreference.1, annotation {"kind":"foo","apiVersion":"oauth.openshift.io/v1","metadata":{"creationTimestamp":null},"reference":{"group":"foo","kind":"Route","name":"route1"}}
oauth_serviceaccount_client_events_test.go:371: GET https://127.0.0.1:22470/oauth/authorize?client_id=system%!A(MISSING)serviceaccount%!A(MISSING)test-project%!A(MISSING)default&redirect_uri=%!B(MISSING)%!k(MISSING)ind%3A%!f(MISSING)oo%2C%!a(MISSING)piVersion%3A%!o(MISSING)auth.openshift.io%!F(MISSING)v1%2C%!m(MISSING)etadata%3A%!B(MISSING)%!c(MISSING)reationTimestamp%3Anull%!D(MISSING)%!C(MISSING)%!r(MISSING)eference%3A%!B(MISSING)%!g(MISSING)roup%3A%!f(MISSING)oo%2C%!k(MISSING)ind%3A%!R(MISSING)oute%2C%!n(MISSING)ame%3A%!r(MISSING)oute1%7D%!D(MISSING)&response_type=code&scope=user%!A(MISSING)info+role%!A(MISSING)edit%!A(MISSING)test-project
oauth_serviceaccount_client_events_test.go:396: Bad Request: HTTP/2.0 400 Bad Request
Content-Length: 155
Cache-Control: no-cache, no-store, max-age=0, must-revalidate
Content-Type: application/json
Date: Wed, 23 May 2018 12:56:01 GMT
Expires: Fri, 01 Jan 1990 00:00:00 GMT
Pragma: no-cache

{"error":"server_error","error_description":"The authorization server encountered an unexpected condition that prevented it from fulfilling the request."}
oauth_serviceaccount_client_events_test.go:141: test-bad-redirect-reference-kind: annotationPrefix serviceaccounts.openshift.io/oauth-redirectreference.1, annotation {"kind":"OAuthRedirectReference","apiVersion":"oauth.openshift.io/v1","metadata":{"creationTimestamp":null},"reference":{"group":"route.openshift.io","kind":"foo","name":"route1"}}
oauth_serviceaccount_client_events_test.go:371: GET https://127.0.0.1:22470/oauth/authorize?client_id=system%!A(MISSING)serviceaccount%!A(MISSING)test-project%!A(MISSING)default&redirect_uri=%!B(MISSING)%!k(MISSING)ind%3A%!O(MISSING)AuthRedirectReference%2C%!a(MISSING)piVersion%3A%!o(MISSING)auth.openshift.io%!F(MISSING)v1%2C%!m(MISSING)etadata%3A%!B(MISSING)%!c(MISSING)reationTimestamp%3Anull%!D(MISSING)%!C(MISSING)%!r(MISSING)eference%3A%!B(MISSING)%!g(MISSING)roup%3A%!r(MISSING)oute.openshift.io%2C%!k(MISSING)ind%3A%!f(MISSING)oo%2C%!n(MISSING)ame%3A%!r(MISSING)oute1%7D%!D(MISSING)%!A(MISSING)&response_type=code&scope=user%!A(MISSING)info+role%!A(MISSING)edit%!A(MISSING)test-project
oauth_serviceaccount_client_events_test.go:396: Bad Request: HTTP/2.0 400 Bad Request
Content-Length: 155
Cache-Control: no-cache, no-store, max-age=0, must-revalidate
Content-Type: application/json
Date: Wed, 23 May 2018 12:56:01 GMT
Expires: Fri, 01 Jan 1990 00:00:00 GMT
Pragma: no-cache

{"error":"server_error","error_description":"The authorization server encountered an unexpected condition that prevented it from fulfilling the request."}
oauth_serviceaccount_client_events_test.go:141: test-good-url: annotationPrefix serviceaccounts.openshift.io/oauth-redirecturi.one, annotation /oauthcallback
oauth_serviceaccount_client_events_test.go:371: GET https://127.0.0.1:22470/oauth/authorize?client_id=system%!A(MISSING)serviceaccount%!A(MISSING)test-project%!A(MISSING)default&redirect_uri=http%!A(MISSING)%!F(MISSING)%!F(MISSING)127.0.0.1%!A(MISSING)41459%!F(MISSING)oauthcallback&response_type=code&scope=user%!A(MISSING)info+role%!A(MISSING)edit%!A(MISSING)test-project
oauth_serviceaccount_client_events_test.go:371: GET https://127.0.0.1:22470/oauth/authorize?client_id=system%!A(MISSING)serviceaccount%!A(MISSING)test-project%!A(MISSING)default&redirect_uri=http%!A(MISSING)%!F(MISSING)%!F(MISSING)127.0.0.1%!A(MISSING)41459%!F(MISSING)oauthcallback&response_type=code&scope=user%!A(MISSING)info+role%!A(MISSING)edit%!A(MISSING)test-project
oauth_serviceaccount_client_events_test.go:362: 302 Location: https://127.0.0.1:22470/oauth/authorize/approve?client_id=system%!A(MISSING)serviceaccount%!A(MISSING)test-project%!A(MISSING)default&redirect_uri=http%!A(MISSING)%!F(MISSING)%!F(MISSING)127.0.0.1%!A(MISSING)41459%!F(MISSING)oauthcallback&scope=user%!A(MISSING)info+role%!A(MISSING)edit%!A(MISSING)test-project&then=..%!F(MISSING)authorize%!F(MISSING)client_id%!D(MISSING)system%!A(MISSING)serviceaccount%!A(MISSING)test-project%!A(MISSING)default%!r(MISSING)edirect_uri%!D(MISSING)http%!A(MISSING)%!F(MISSING)%!F(MISSING)127.0.0.1%!A(MISSING)41459%!F(MISSING)oauthcallback%!r(MISSING)esponse_type%!D(MISSING)code%!s(MISSING)cope%!D(MISSING)user%!A(MISSING)info%!B(MISSING)role%!A(MISSING)edit%!A(MISSING)test-project
oauth_serviceaccount_client_events_test.go:371: POST https://127.0.0.1:22470/oauth/authorize/approve
oauth_serviceaccount_client_events_test.go:362: 302 Location: https://127.0.0.1:22470/oauth/authorize?client_id=system%!A(MISSING)serviceaccount%!A(MISSING)test-project%!A(MISSING)default&redirect_uri=http%!A(MISSING)%!F(MISSING)%!F(MISSING)127.0.0.1%!A(MISSING)41459%!F(MISSING)oauthcallback&response_type=code&scope=user%!A(MISSING)info+role%!A(MISSING)edit%!A(MISSING)test-project
oauth_serviceaccount_client_events_test.go:362: 302 Location: http://127.0.0.1:41459/oauthcallback?code=DUxw05VbSSVhjXft1AtNrN4-sDsbde3WLseW-pGQgX0&state=
oauth_serviceaccount_client_events_test.go:141: test-bad-url: annotationPrefix serviceaccounts.openshift.io/oauth-redirecturi.one, annotation foo:foo
oauth_serviceaccount_client_events_test.go:371: GET https://127.0.0.1:22470/oauth/authorize?client_id=system%!A(MISSING)serviceaccount%!A(MISSING)test-project%!A(MISSING)default&redirect_uri=foo%!A(MISSING)foo&response_type=code&scope=user%!A(MISSING)info+role%!A(MISSING)edit%!A(MISSING)test-project
oauth_serviceaccount_client_events_test.go:396: Bad Request: HTTP/2.0 400 Bad Request
Content-Length: 155
Cache-Control: no-cache, no-store, max-age=0, must-revalidate
Content-Type: application/json
Date: Wed, 23 May 2018 12:56:01 GMT
Expires: Fri, 01 Jan 1990 00:00:00 GMT
Pragma: no-cache

{"error":"server_error","error_description":"The authorization server encountered an unexpected condition that prevented it from fulfilling the request."}
oauth_serviceaccount_client_events_test.go:163: test-bad-url: expected 1 events, found 0
[ERROR] [13:08:52+0000] hack/test-go.sh exited with code 1 after 00h 31m 58s
[ERROR] [13:08:52+0000] PID 1252: hack/test-integration.sh:18: `COVERAGE_SPEC=" " DETECT_RACES=false TMPDIR="${BASETMPDIR}" TIMEOUT=45m GOTEST_FLAGS="${gotest_flags}" "${OS_ROOT}/hack/test-go.sh" "test/integration/runner"` exited with status 1.
[INFO] [13:08:52+0000] 		Stack Trace: 
[INFO] [13:08:52+0000] 		  1: hack/test-integration.sh:18: `COVERAGE_SPEC=" " DETECT_RACES=false TMPDIR="${BASETMPDIR}" TIMEOUT=45m GOTEST_FLAGS="${gotest_flags}" "${OS_ROOT}/hack/test-go.sh" "test/integration/runner"`
[INFO] [13:08:52+0000]   Exiting with code 1.
make: *** [test-integration] Error 1
[WARNING] [13:08:53+0000] Copying _output/local/releases from the container failed!
[WARNING] [13:08:53+0000] Error response from daemon: lstat /var/lib/docker/overlay2/c946d8a215ba95d97fdfd3e9605ab7baf8b5f874b4bc1dbaed63c69df400ebcd/merged/go/src/github.com/openshift/origin/_output/local/releases: no such file or directory
[ERROR] [13:08:53+0000] PID 10834: hack/lib/build/environment.sh:172: `return "${exitcode}"` exited with status 2.
[INFO] [13:08:53+0000] 		Stack Trace: 
[INFO] [13:08:53+0000] 		  1: hack/lib/build/environment.sh:172: `return "${exitcode}"`
[INFO] [13:08:53+0000] 		  2: hack/lib/build/environment.sh:281: os::build::environment::withsource
[INFO] [13:08:53+0000] 		  3: hack/env:42: os::build::environment::run
[INFO] [13:08:53+0000]   Exiting with code 2.
++ export status=FAILURE
++ status=FAILURE
+ set +o xtrace
########## FINISHED STAGE: FAILURE: RUN INTEGRATION TESTS [00h 44m 17s] ##########
Build step 'Execute shell' marked build as failure
[PostBuildScript] - Executing post build scripts.
[workspace@3] $ /bin/bash /tmp/jenkins2859706508738282949.sh
########## STARTING STAGE: DOWNLOAD ARTIFACTS FROM THE REMOTE HOST ##########
+ [[ -s /var/lib/jenkins/jobs/test_pull_request_origin_integration/workspace@3/activate ]]
+ source /var/lib/jenkins/jobs/test_pull_request_origin_integration/workspace@3/activate
++ export VIRTUAL_ENV=/var/lib/jenkins/origin-ci-tool/7a5c5e83c372ad2e6b3b64b3efa16fe2cb37ef83
++ VIRTUAL_ENV=/var/lib/jenkins/origin-ci-tool/7a5c5e83c372ad2e6b3b64b3efa16fe2cb37ef83
++ export PATH=/var/lib/jenkins/origin-ci-tool/7a5c5e83c372ad2e6b3b64b3efa16fe2cb37ef83/bin:/sbin:/usr/sbin:/bin:/usr/bin
++ PATH=/var/lib/jenkins/origin-ci-tool/7a5c5e83c372ad2e6b3b64b3efa16fe2cb37ef83/bin:/sbin:/usr/sbin:/bin:/usr/bin
++ unset PYTHON_HOME
++ export OCT_CONFIG_HOME=/var/lib/jenkins/jobs/test_pull_request_origin_integration/workspace@3/.config
++ OCT_CONFIG_HOME=/var/lib/jenkins/jobs/test_pull_request_origin_integration/workspace@3/.config
+ trap 'exit 0' EXIT
++ pwd
+ ARTIFACT_DIR=/var/lib/jenkins/jobs/test_pull_request_origin_integration/workspace@3/artifacts/gathered
+ rm -rf /var/lib/jenkins/jobs/test_pull_request_origin_integration/workspace@3/artifacts/gathered
+ mkdir -p /var/lib/jenkins/jobs/test_pull_request_origin_integration/workspace@3/artifacts/gathered
+ ssh -F /var/lib/jenkins/jobs/test_pull_request_origin_integration/workspace@3/.config/origin-ci-tool/inventory/.ssh_config openshiftdevel sudo stat /data/src/github.com/openshift/origin/_output/scripts
  File: ‘/data/src/github.com/openshift/origin/_output/scripts’
  Size: 61        	Blocks: 0          IO Block: 4096   directory
Device: ca02h/51714d	Inode: 105085519   Links: 5
Access: (2755/drwxr-sr-x)  Uid: ( 1001/  origin)   Gid: ( 1003/origin-git)
Context: unconfined_u:object_r:container_file_t:s0
Access: 1970-01-01 00:00:00.000000000 +0000
Modify: 2018-05-23 12:26:29.000000000 +0000
Change: 2018-05-23 13:08:53.357039954 +0000
 Birth: -
+ ssh -F /var/lib/jenkins/jobs/test_pull_request_origin_integration/workspace@3/.config/origin-ci-tool/inventory/.ssh_config openshiftdevel sudo chmod -R o+rX /data/src/github.com/openshift/origin/_output/scripts
+ scp -r -F /var/lib/jenkins/jobs/test_pull_request_origin_integration/workspace@3/.config/origin-ci-tool/inventory/.ssh_config openshiftdevel:/data/src/github.com/openshift/origin/_output/scripts /var/lib/jenkins/jobs/test_pull_request_origin_integration/workspace@3/artifacts/gathered
+ tree /var/lib/jenkins/jobs/test_pull_request_origin_integration/workspace@3/artifacts/gathered
/var/lib/jenkins/jobs/test_pull_request_origin_integration/workspace@3/artifacts/gathered
└── scripts
    ├── shell
    │   ├── artifacts
    │   ├── logs
    │   │   ├── 7d05cd9e49321a10feb4124cbea2ac1feb37268e1ce1c07529d0d6f0bd04c760.json
    │   │   └── scripts.log
    │   └── openshift.local.home
    ├── test-integration
    │   ├── artifacts
    │   │   ├── gotest_report_KtUpJ
    │   │   └── gotest_report_KtUpJ.xml
    │   ├── logs
    │   │   ├── raw_test_output.log
    │   │   ├── scripts.log
    │   │   └── test-go-err.log
    │   └── openshift.local.home
    └── test-tools
        ├── artifacts
        ├── logs
        │   ├── raw_test_output.log
        │   └── scripts.log
        └── openshift.local.home

13 directories, 9 files
+ exit 0
[workspace@3] $ /bin/bash /tmp/jenkins8219332856016012320.sh
########## STARTING STAGE: GENERATE ARTIFACTS FROM THE REMOTE HOST ##########
+ [[ -s /var/lib/jenkins/jobs/test_pull_request_origin_integration/workspace@3/activate ]]
+ source /var/lib/jenkins/jobs/test_pull_request_origin_integration/workspace@3/activate
++ export VIRTUAL_ENV=/var/lib/jenkins/origin-ci-tool/7a5c5e83c372ad2e6b3b64b3efa16fe2cb37ef83
++ VIRTUAL_ENV=/var/lib/jenkins/origin-ci-tool/7a5c5e83c372ad2e6b3b64b3efa16fe2cb37ef83
++ export PATH=/var/lib/jenkins/origin-ci-tool/7a5c5e83c372ad2e6b3b64b3efa16fe2cb37ef83/bin:/sbin:/usr/sbin:/bin:/usr/bin
++ PATH=/var/lib/jenkins/origin-ci-tool/7a5c5e83c372ad2e6b3b64b3efa16fe2cb37ef83/bin:/sbin:/usr/sbin:/bin:/usr/bin
++ unset PYTHON_HOME
++ export OCT_CONFIG_HOME=/var/lib/jenkins/jobs/test_pull_request_origin_integration/workspace@3/.config
++ OCT_CONFIG_HOME=/var/lib/jenkins/jobs/test_pull_request_origin_integration/workspace@3/.config
+ trap 'exit 0' EXIT
++ pwd
+ ARTIFACT_DIR=/var/lib/jenkins/jobs/test_pull_request_origin_integration/workspace@3/artifacts/generated
+ rm -rf /var/lib/jenkins/jobs/test_pull_request_origin_integration/workspace@3/artifacts/generated
+ mkdir /var/lib/jenkins/jobs/test_pull_request_origin_integration/workspace@3/artifacts/generated
+ ssh -F /var/lib/jenkins/jobs/test_pull_request_origin_integration/workspace@3/.config/origin-ci-tool/inventory/.ssh_config openshiftdevel 'sudo docker version && sudo docker info && sudo docker images && sudo docker ps -a 2>&1'
  WARNING: You're not using the default seccomp profile
+ ssh -F /var/lib/jenkins/jobs/test_pull_request_origin_integration/workspace@3/.config/origin-ci-tool/inventory/.ssh_config openshiftdevel 'sudo cat /etc/sysconfig/docker /etc/sysconfig/docker-network /etc/sysconfig/docker-storage /etc/sysconfig/docker-storage-setup /etc/systemd/system/docker.service 2>&1'
+ true
+ ssh -F /var/lib/jenkins/jobs/test_pull_request_origin_integration/workspace@3/.config/origin-ci-tool/inventory/.ssh_config openshiftdevel 'sudo find /var/lib/docker/containers -name *.log | sudo xargs tail -vn +1 2>&1'
+ ssh -F /var/lib/jenkins/jobs/test_pull_request_origin_integration/workspace@3/.config/origin-ci-tool/inventory/.ssh_config openshiftdevel 'oc get --raw /metrics --server=https://$( uname --nodename ):10250 --config=/etc/origin/master/admin.kubeconfig 2>&1'
+ true
+ ssh -F /var/lib/jenkins/jobs/test_pull_request_origin_integration/workspace@3/.config/origin-ci-tool/inventory/.ssh_config openshiftdevel 'sudo ausearch -m AVC -m SELINUX_ERR -m USER_AVC 2>&1'
+ true
+ ssh -F /var/lib/jenkins/jobs/test_pull_request_origin_integration/workspace@3/.config/origin-ci-tool/inventory/.ssh_config openshiftdevel 'oc get --raw /metrics --config=/etc/origin/master/admin.kubeconfig 2>&1'
+ true
+ ssh -F /var/lib/jenkins/jobs/test_pull_request_origin_integration/workspace@3/.config/origin-ci-tool/inventory/.ssh_config openshiftdevel 'sudo df -T -h && sudo pvs && sudo vgs && sudo lvs && sudo findmnt --all 2>&1'
+ ssh -F /var/lib/jenkins/jobs/test_pull_request_origin_integration/workspace@3/.config/origin-ci-tool/inventory/.ssh_config openshiftdevel 'sudo yum list installed 2>&1'
+ ssh -F /var/lib/jenkins/jobs/test_pull_request_origin_integration/workspace@3/.config/origin-ci-tool/inventory/.ssh_config openshiftdevel 'sudo journalctl --dmesg --no-pager --all --lines=all 2>&1'
+ ssh -F /var/lib/jenkins/jobs/test_pull_request_origin_integration/workspace@3/.config/origin-ci-tool/inventory/.ssh_config openshiftdevel 'sudo journalctl _PID=1 --no-pager --all --lines=all 2>&1'
+ tree /var/lib/jenkins/jobs/test_pull_request_origin_integration/workspace@3/artifacts/generated
/var/lib/jenkins/jobs/test_pull_request_origin_integration/workspace@3/artifacts/generated
├── avc_denials.log
├── containers.log
├── dmesg.log
├── docker.config
├── docker.info
├── filesystem.info
├── installed_packages.log
├── master-metrics.log
├── node-metrics.log
└── pid1.journal

0 directories, 10 files
+ exit 0
[workspace@3] $ /bin/bash /tmp/jenkins8031552826440065004.sh
########## STARTING STAGE: FETCH SYSTEMD JOURNALS FROM THE REMOTE HOST ##########
+ [[ -s /var/lib/jenkins/jobs/test_pull_request_origin_integration/workspace@3/activate ]]
+ source /var/lib/jenkins/jobs/test_pull_request_origin_integration/workspace@3/activate
++ export VIRTUAL_ENV=/var/lib/jenkins/origin-ci-tool/7a5c5e83c372ad2e6b3b64b3efa16fe2cb37ef83
++ VIRTUAL_ENV=/var/lib/jenkins/origin-ci-tool/7a5c5e83c372ad2e6b3b64b3efa16fe2cb37ef83
++ export PATH=/var/lib/jenkins/origin-ci-tool/7a5c5e83c372ad2e6b3b64b3efa16fe2cb37ef83/bin:/sbin:/usr/sbin:/bin:/usr/bin
++ PATH=/var/lib/jenkins/origin-ci-tool/7a5c5e83c372ad2e6b3b64b3efa16fe2cb37ef83/bin:/sbin:/usr/sbin:/bin:/usr/bin
++ unset PYTHON_HOME
++ export OCT_CONFIG_HOME=/var/lib/jenkins/jobs/test_pull_request_origin_integration/workspace@3/.config
++ OCT_CONFIG_HOME=/var/lib/jenkins/jobs/test_pull_request_origin_integration/workspace@3/.config
+ trap 'exit 0' EXIT
++ pwd
+ ARTIFACT_DIR=/var/lib/jenkins/jobs/test_pull_request_origin_integration/workspace@3/artifacts/journals
+ rm -rf /var/lib/jenkins/jobs/test_pull_request_origin_integration/workspace@3/artifacts/journals
+ mkdir /var/lib/jenkins/jobs/test_pull_request_origin_integration/workspace@3/artifacts/journals
+ ssh -F /var/lib/jenkins/jobs/test_pull_request_origin_integration/workspace@3/.config/origin-ci-tool/inventory/.ssh_config openshiftdevel sudo journalctl --unit docker.service --no-pager --all --lines=all
+ ssh -F /var/lib/jenkins/jobs/test_pull_request_origin_integration/workspace@3/.config/origin-ci-tool/inventory/.ssh_config openshiftdevel sudo journalctl --unit dnsmasq.service --no-pager --all --lines=all
+ ssh -F /var/lib/jenkins/jobs/test_pull_request_origin_integration/workspace@3/.config/origin-ci-tool/inventory/.ssh_config openshiftdevel sudo journalctl --unit systemd-journald.service --no-pager --all --lines=all
+ tree /var/lib/jenkins/jobs/test_pull_request_origin_integration/workspace@3/artifacts/journals
/var/lib/jenkins/jobs/test_pull_request_origin_integration/workspace@3/artifacts/journals
├── dnsmasq.service
├── docker.service
└── systemd-journald.service

0 directories, 3 files
+ exit 0
[workspace@3] $ /bin/bash /tmp/jenkins6160507000945703986.sh
########## STARTING STAGE: ASSEMBLE GCS OUTPUT ##########
+ [[ -s /var/lib/jenkins/jobs/test_pull_request_origin_integration/workspace@3/activate ]]
+ source /var/lib/jenkins/jobs/test_pull_request_origin_integration/workspace@3/activate
++ export VIRTUAL_ENV=/var/lib/jenkins/origin-ci-tool/7a5c5e83c372ad2e6b3b64b3efa16fe2cb37ef83
++ VIRTUAL_ENV=/var/lib/jenkins/origin-ci-tool/7a5c5e83c372ad2e6b3b64b3efa16fe2cb37ef83
++ export PATH=/var/lib/jenkins/origin-ci-tool/7a5c5e83c372ad2e6b3b64b3efa16fe2cb37ef83/bin:/sbin:/usr/sbin:/bin:/usr/bin
++ PATH=/var/lib/jenkins/origin-ci-tool/7a5c5e83c372ad2e6b3b64b3efa16fe2cb37ef83/bin:/sbin:/usr/sbin:/bin:/usr/bin
++ unset PYTHON_HOME
++ export OCT_CONFIG_HOME=/var/lib/jenkins/jobs/test_pull_request_origin_integration/workspace@3/.config
++ OCT_CONFIG_HOME=/var/lib/jenkins/jobs/test_pull_request_origin_integration/workspace@3/.config
+ trap 'exit 0' EXIT
+ mkdir -p gcs/artifacts gcs/artifacts/generated gcs/artifacts/journals gcs/artifacts/gathered
++ python -c 'import json; import urllib; print json.load(urllib.urlopen('\''https://ci.openshift.redhat.com/jenkins/job/test_pull_request_origin_integration/18075/api/json'\''))['\''result'\'']'
+ result=FAILURE
+ cat
++ date +%s
+ cat /var/lib/jenkins/jobs/test_pull_request_origin_integration/builds/18075/log
+ cp artifacts/generated/avc_denials.log artifacts/generated/containers.log artifacts/generated/dmesg.log artifacts/generated/docker.config artifacts/generated/docker.info artifacts/generated/filesystem.info artifacts/generated/installed_packages.log artifacts/generated/master-metrics.log artifacts/generated/node-metrics.log artifacts/generated/pid1.journal gcs/artifacts/generated/
+ cp artifacts/journals/dnsmasq.service artifacts/journals/docker.service artifacts/journals/systemd-journald.service gcs/artifacts/journals/
+ cp -r artifacts/gathered/scripts gcs/artifacts/
++ pwd
+ scp -F /var/lib/jenkins/jobs/test_pull_request_origin_integration/workspace@3/.config/origin-ci-tool/inventory/.ssh_config -r /var/lib/jenkins/jobs/test_pull_request_origin_integration/workspace@3/gcs openshiftdevel:/data
+ scp -F /var/lib/jenkins/jobs/test_pull_request_origin_integration/workspace@3/.config/origin-ci-tool/inventory/.ssh_config /var/lib/jenkins/.config/gcloud/gcs-publisher-credentials.json openshiftdevel:/data/credentials.json
+ exit 0
[workspace@3] $ /bin/bash /tmp/jenkins2027612343547130231.sh
########## STARTING STAGE: PUSH THE ARTIFACTS AND METADATA ##########
+ [[ -s /var/lib/jenkins/jobs/test_pull_request_origin_integration/workspace@3/activate ]]
+ source /var/lib/jenkins/jobs/test_pull_request_origin_integration/workspace@3/activate
++ export VIRTUAL_ENV=/var/lib/jenkins/origin-ci-tool/7a5c5e83c372ad2e6b3b64b3efa16fe2cb37ef83
++ VIRTUAL_ENV=/var/lib/jenkins/origin-ci-tool/7a5c5e83c372ad2e6b3b64b3efa16fe2cb37ef83
++ export PATH=/var/lib/jenkins/origin-ci-tool/7a5c5e83c372ad2e6b3b64b3efa16fe2cb37ef83/bin:/sbin:/usr/sbin:/bin:/usr/bin
++ PATH=/var/lib/jenkins/origin-ci-tool/7a5c5e83c372ad2e6b3b64b3efa16fe2cb37ef83/bin:/sbin:/usr/sbin:/bin:/usr/bin
++ unset PYTHON_HOME
++ export OCT_CONFIG_HOME=/var/lib/jenkins/jobs/test_pull_request_origin_integration/workspace@3/.config
++ OCT_CONFIG_HOME=/var/lib/jenkins/jobs/test_pull_request_origin_integration/workspace@3/.config
++ mktemp
+ script=/tmp/tmp.Umcj3uO5ED
+ cat
+ chmod +x /tmp/tmp.Umcj3uO5ED
+ scp -F /var/lib/jenkins/jobs/test_pull_request_origin_integration/workspace@3/.config/origin-ci-tool/inventory/.ssh_config /tmp/tmp.Umcj3uO5ED openshiftdevel:/tmp/tmp.Umcj3uO5ED
+ ssh -F /var/lib/jenkins/jobs/test_pull_request_origin_integration/workspace@3/.config/origin-ci-tool/inventory/.ssh_config -t openshiftdevel 'bash -l -c "timeout 300 /tmp/tmp.Umcj3uO5ED"'
+ cd /home/origin
+ trap 'exit 0' EXIT
+ [[ -n {"type":"presubmit","job":"test_pull_request_origin_integration","buildid":"6e77d41e-5e83-11e8-b81f-0a58ac100343","refs":{"org":"openshift","repo":"origin","base_ref":"master","base_sha":"b40a696820199679081f8f608dbeb78b8e07d9c0","pulls":[{"number":19759,"author":"wozniakjan","sha":"4ee7fb9b57dd7fc5fa0527d4f9a0b57d09a24757"}]}} ]]
++ jq --compact-output .buildid
Using BUILD_NUMBER
+ [[ "6e77d41e-5e83-11e8-b81f-0a58ac100343" =~ ^"[0-9]+"$ ]]
+ echo 'Using BUILD_NUMBER'
++ jq --compact-output '.buildid |= "18075"'
+ JOB_SPEC='{"type":"presubmit","job":"test_pull_request_origin_integration","buildid":"18075","refs":{"org":"openshift","repo":"origin","base_ref":"master","base_sha":"b40a696820199679081f8f608dbeb78b8e07d9c0","pulls":[{"number":19759,"author":"wozniakjan","sha":"4ee7fb9b57dd7fc5fa0527d4f9a0b57d09a24757"}]}}'
+ docker run -e 'JOB_SPEC={"type":"presubmit","job":"test_pull_request_origin_integration","buildid":"18075","refs":{"org":"openshift","repo":"origin","base_ref":"master","base_sha":"b40a696820199679081f8f608dbeb78b8e07d9c0","pulls":[{"number":19759,"author":"wozniakjan","sha":"4ee7fb9b57dd7fc5fa0527d4f9a0b57d09a24757"}]}}' -v /data:/data:z registry.svc.ci.openshift.org/ci/gcsupload:latest --dry-run=false --gcs-path=gs://origin-ci-test --gcs-credentials-file=/data/credentials.json --path-strategy=single --default-org=openshift --default-repo=origin /data/gcs/artifacts /data/gcs/build-log.txt /data/gcs/finished.json
Unable to find image 'registry.svc.ci.openshift.org/ci/gcsupload:latest' locally
Trying to pull repository registry.svc.ci.openshift.org/ci/gcsupload ... 
latest: Pulling from registry.svc.ci.openshift.org/ci/gcsupload
6d987f6f4279: Already exists
4cccebe844ee: Already exists
cafcba51f636: Pulling fs layer
cafcba51f636: Verifying Checksum
cafcba51f636: Download complete
cafcba51f636: Pull complete
Digest: sha256:c452798b56e3f4649c557c3ff7273126042065e3be152689a1ffb880638e617d
Status: Downloaded newer image for registry.svc.ci.openshift.org/ci/gcsupload:latest
{"component":"gcsupload","level":"info","msg":"Gathering artifacts from artifact directory: /data/gcs/artifacts","time":"2018-05-23T13:09:19Z"}
{"component":"gcsupload","level":"info","msg":"Found /data/gcs/artifacts/generated/avc_denials.log in artifact directory. Uploading as artifacts/generated/avc_denials.log\n","time":"2018-05-23T13:09:19Z"}
{"component":"gcsupload","level":"info","msg":"Found /data/gcs/artifacts/generated/containers.log in artifact directory. Uploading as artifacts/generated/containers.log\n","time":"2018-05-23T13:09:19Z"}
{"component":"gcsupload","level":"info","msg":"Found /data/gcs/artifacts/generated/dmesg.log in artifact directory. Uploading as artifacts/generated/dmesg.log\n","time":"2018-05-23T13:09:19Z"}
{"component":"gcsupload","level":"info","msg":"Found /data/gcs/artifacts/generated/docker.config in artifact directory. Uploading as artifacts/generated/docker.config\n","time":"2018-05-23T13:09:19Z"}
{"component":"gcsupload","level":"info","msg":"Found /data/gcs/artifacts/generated/docker.info in artifact directory. Uploading as artifacts/generated/docker.info\n","time":"2018-05-23T13:09:19Z"}
{"component":"gcsupload","level":"info","msg":"Found /data/gcs/artifacts/generated/filesystem.info in artifact directory. Uploading as artifacts/generated/filesystem.info\n","time":"2018-05-23T13:09:19Z"}
{"component":"gcsupload","level":"info","msg":"Found /data/gcs/artifacts/generated/installed_packages.log in artifact directory. Uploading as artifacts/generated/installed_packages.log\n","time":"2018-05-23T13:09:19Z"}
{"component":"gcsupload","level":"info","msg":"Found /data/gcs/artifacts/generated/master-metrics.log in artifact directory. Uploading as artifacts/generated/master-metrics.log\n","time":"2018-05-23T13:09:19Z"}
{"component":"gcsupload","level":"info","msg":"Found /data/gcs/artifacts/generated/node-metrics.log in artifact directory. Uploading as artifacts/generated/node-metrics.log\n","time":"2018-05-23T13:09:19Z"}
{"component":"gcsupload","level":"info","msg":"Found /data/gcs/artifacts/generated/pid1.journal in artifact directory. Uploading as artifacts/generated/pid1.journal\n","time":"2018-05-23T13:09:19Z"}
{"component":"gcsupload","level":"info","msg":"Found /data/gcs/artifacts/journals/dnsmasq.service in artifact directory. Uploading as artifacts/journals/dnsmasq.service\n","time":"2018-05-23T13:09:19Z"}
{"component":"gcsupload","level":"info","msg":"Found /data/gcs/artifacts/journals/docker.service in artifact directory. Uploading as artifacts/journals/docker.service\n","time":"2018-05-23T13:09:19Z"}
{"component":"gcsupload","level":"info","msg":"Found /data/gcs/artifacts/journals/systemd-journald.service in artifact directory. Uploading as artifacts/journals/systemd-journald.service\n","time":"2018-05-23T13:09:19Z"}
{"component":"gcsupload","level":"info","msg":"Found /data/gcs/artifacts/scripts/shell/logs/7d05cd9e49321a10feb4124cbea2ac1feb37268e1ce1c07529d0d6f0bd04c760.json in artifact directory. Uploading as artifacts/scripts/shell/logs/7d05cd9e49321a10feb4124cbea2ac1feb37268e1ce1c07529d0d6f0bd04c760.json\n","time":"2018-05-23T13:09:19Z"}
{"component":"gcsupload","level":"info","msg":"Found /data/gcs/artifacts/scripts/shell/logs/scripts.log in artifact directory. Uploading as artifacts/scripts/shell/logs/scripts.log\n","time":"2018-05-23T13:09:19Z"}
{"component":"gcsupload","level":"info","msg":"Found /data/gcs/artifacts/scripts/test-integration/artifacts/gotest_report_KtUpJ in artifact directory. Uploading as artifacts/scripts/test-integration/artifacts/gotest_report_KtUpJ\n","time":"2018-05-23T13:09:19Z"}
{"component":"gcsupload","level":"info","msg":"Found /data/gcs/artifacts/scripts/test-integration/artifacts/gotest_report_KtUpJ.xml in artifact directory. Uploading as artifacts/scripts/test-integration/artifacts/gotest_report_KtUpJ.xml\n","time":"2018-05-23T13:09:19Z"}
{"component":"gcsupload","level":"info","msg":"Found /data/gcs/artifacts/scripts/test-integration/logs/raw_test_output.log in artifact directory. Uploading as artifacts/scripts/test-integration/logs/raw_test_output.log\n","time":"2018-05-23T13:09:19Z"}
{"component":"gcsupload","level":"info","msg":"Found /data/gcs/artifacts/scripts/test-integration/logs/scripts.log in artifact directory. Uploading as artifacts/scripts/test-integration/logs/scripts.log\n","time":"2018-05-23T13:09:19Z"}
{"component":"gcsupload","level":"info","msg":"Found /data/gcs/artifacts/scripts/test-integration/logs/test-go-err.log in artifact directory. Uploading as artifacts/scripts/test-integration/logs/test-go-err.log\n","time":"2018-05-23T13:09:19Z"}
{"component":"gcsupload","level":"info","msg":"Found /data/gcs/artifacts/scripts/test-tools/logs/raw_test_output.log in artifact directory. Uploading as artifacts/scripts/test-tools/logs/raw_test_output.log\n","time":"2018-05-23T13:09:19Z"}
{"component":"gcsupload","level":"info","msg":"Found /data/gcs/artifacts/scripts/test-tools/logs/scripts.log in artifact directory. Uploading as artifacts/scripts/test-tools/logs/scripts.log\n","time":"2018-05-23T13:09:19Z"}
{"component":"gcsupload","dest":"pr-logs/directory/test_pull_request_origin_integration/18075.txt","level":"info","msg":"Queued for upload","time":"2018-05-23T13:09:19Z"}
{"component":"gcsupload","dest":"pr-logs/pull/19759/test_pull_request_origin_integration/18075/artifacts/scripts/test-integration/artifacts/gotest_report_KtUpJ","level":"info","msg":"Queued for upload","time":"2018-05-23T13:09:19Z"}
{"component":"gcsupload","dest":"pr-logs/pull/19759/test_pull_request_origin_integration/18075/artifacts/scripts/test-integration/artifacts/gotest_report_KtUpJ.xml","level":"info","msg":"Queued for upload","time":"2018-05-23T13:09:19Z"}
{"component":"gcsupload","dest":"pr-logs/pull/19759/test_pull_request_origin_integration/18075/build-log.txt","level":"info","msg":"Queued for upload","time":"2018-05-23T13:09:19Z"}
{"component":"gcsupload","dest":"pr-logs/pull/19759/test_pull_request_origin_integration/18075/artifacts/generated/docker.info","level":"info","msg":"Queued for upload","time":"2018-05-23T13:09:19Z"}
{"component":"gcsupload","dest":"pr-logs/pull/19759/test_pull_request_origin_integration/18075/artifacts/generated/master-metrics.log","level":"info","msg":"Queued for upload","time":"2018-05-23T13:09:19Z"}
{"component":"gcsupload","dest":"pr-logs/pull/19759/test_pull_request_origin_integration/18075/artifacts/scripts/shell/logs/7d05cd9e49321a10feb4124cbea2ac1feb37268e1ce1c07529d0d6f0bd04c760.json","level":"info","msg":"Queued for upload","time":"2018-05-23T13:09:19Z"}
{"component":"gcsupload","dest":"pr-logs/pull/19759/test_pull_request_origin_integration/18075/artifacts/scripts/test-integration/logs/scripts.log","level":"info","msg":"Queued for upload","time":"2018-05-23T13:09:19Z"}
{"component":"gcsupload","dest":"pr-logs/pull/19759/test_pull_request_origin_integration/18075/finished.json","level":"info","msg":"Queued for upload","time":"2018-05-23T13:09:19Z"}
{"component":"gcsupload","dest":"pr-logs/pull/19759/test_pull_request_origin_integration/18075/artifacts/generated/node-metrics.log","level":"info","msg":"Queued for upload","time":"2018-05-23T13:09:19Z"}
{"component":"gcsupload","dest":"pr-logs/pull/19759/test_pull_request_origin_integration/18075/artifacts/generated/pid1.journal","level":"info","msg":"Queued for upload","time":"2018-05-23T13:09:19Z"}
{"component":"gcsupload","dest":"pr-logs/pull/19759/test_pull_request_origin_integration/18075/artifacts/journals/dnsmasq.service","level":"info","msg":"Queued for upload","time":"2018-05-23T13:09:19Z"}
{"component":"gcsupload","dest":"pr-logs/pull/19759/test_pull_request_origin_integration/18075/artifacts/generated/filesystem.info","level":"info","msg":"Queued for upload","time":"2018-05-23T13:09:19Z"}
{"component":"gcsupload","dest":"pr-logs/pull/19759/test_pull_request_origin_integration/18075/artifacts/scripts/test-integration/logs/raw_test_output.log","level":"info","msg":"Queued for upload","time":"2018-05-23T13:09:19Z"}
{"component":"gcsupload","dest":"pr-logs/pull/19759/test_pull_request_origin_integration/18075/artifacts/generated/containers.log","level":"info","msg":"Queued for upload","time":"2018-05-23T13:09:19Z"}
{"component":"gcsupload","dest":"pr-logs/pull/19759/test_pull_request_origin_integration/18075/artifacts/generated/docker.config","level":"info","msg":"Queued for upload","time":"2018-05-23T13:09:19Z"}
{"component":"gcsupload","dest":"pr-logs/directory/test_pull_request_origin_integration/latest-build.txt","level":"info","msg":"Queued for upload","time":"2018-05-23T13:09:19Z"}
{"component":"gcsupload","dest":"pr-logs/pull/19759/test_pull_request_origin_integration/18075/artifacts/generated/avc_denials.log","level":"info","msg":"Queued for upload","time":"2018-05-23T13:09:20Z"}
{"component":"gcsupload","dest":"pr-logs/pull/19759/test_pull_request_origin_integration/18075/artifacts/journals/docker.service","level":"info","msg":"Queued for upload","time":"2018-05-23T13:09:20Z"}
{"component":"gcsupload","dest":"pr-logs/pull/19759/test_pull_request_origin_integration/18075/artifacts/scripts/test-integration/logs/test-go-err.log","level":"info","msg":"Queued for upload","time":"2018-05-23T13:09:20Z"}
{"component":"gcsupload","dest":"pr-logs/pull/19759/test_pull_request_origin_integration/18075/artifacts/scripts/test-tools/logs/scripts.log","level":"info","msg":"Queued for upload","time":"2018-05-23T13:09:20Z"}
{"component":"gcsupload","dest":"pr-logs/pull/19759/test_pull_request_origin_integration/18075/artifacts/generated/installed_packages.log","level":"info","msg":"Queued for upload","time":"2018-05-23T13:09:20Z"}
{"component":"gcsupload","dest":"pr-logs/pull/19759/test_pull_request_origin_integration/18075/artifacts/generated/dmesg.log","level":"info","msg":"Queued for upload","time":"2018-05-23T13:09:20Z"}
{"component":"gcsupload","dest":"pr-logs/pull/19759/test_pull_request_origin_integration/18075/artifacts/journals/systemd-journald.service","level":"info","msg":"Queued for upload","time":"2018-05-23T13:09:20Z"}
{"component":"gcsupload","dest":"pr-logs/pull/19759/test_pull_request_origin_integration/18075/artifacts/scripts/shell/logs/scripts.log","level":"info","msg":"Queued for upload","time":"2018-05-23T13:09:20Z"}
{"component":"gcsupload","dest":"pr-logs/pull/19759/test_pull_request_origin_integration/18075/artifacts/scripts/test-tools/logs/raw_test_output.log","level":"info","msg":"Queued for upload","time":"2018-05-23T13:09:20Z"}
{"component":"gcsupload","dest":"pr-logs/pull/19759/test_pull_request_origin_integration/latest-build.txt","level":"info","msg":"Queued for upload","time":"2018-05-23T13:09:20Z"}
{"component":"gcsupload","dest":"pr-logs/pull/19759/test_pull_request_origin_integration/18075/artifacts/journals/systemd-journald.service","level":"info","msg":"Finished upload","time":"2018-05-23T13:09:20Z"}
{"component":"gcsupload","dest":"pr-logs/pull/19759/test_pull_request_origin_integration/18075/artifacts/generated/dmesg.log","level":"info","msg":"Finished upload","time":"2018-05-23T13:09:20Z"}
{"component":"gcsupload","dest":"pr-logs/pull/19759/test_pull_request_origin_integration/latest-build.txt","level":"info","msg":"Finished upload","time":"2018-05-23T13:09:20Z"}
{"component":"gcsupload","dest":"pr-logs/pull/19759/test_pull_request_origin_integration/18075/artifacts/generated/containers.log","level":"info","msg":"Finished upload","time":"2018-05-23T13:09:20Z"}
{"component":"gcsupload","dest":"pr-logs/pull/19759/test_pull_request_origin_integration/18075/artifacts/generated/filesystem.info","level":"info","msg":"Finished upload","time":"2018-05-23T13:09:20Z"}
{"component":"gcsupload","dest":"pr-logs/pull/19759/test_pull_request_origin_integration/18075/artifacts/scripts/test-integration/artifacts/gotest_report_KtUpJ","level":"info","msg":"Finished upload","time":"2018-05-23T13:09:20Z"}
{"component":"gcsupload","dest":"pr-logs/pull/19759/test_pull_request_origin_integration/18075/artifacts/journals/dnsmasq.service","level":"info","msg":"Finished upload","time":"2018-05-23T13:09:20Z"}
{"component":"gcsupload","dest":"pr-logs/pull/19759/test_pull_request_origin_integration/18075/artifacts/journals/docker.service","level":"info","msg":"Finished upload","time":"2018-05-23T13:09:20Z"}
{"component":"gcsupload","dest":"pr-logs/pull/19759/test_pull_request_origin_integration/18075/artifacts/scripts/test-tools/logs/scripts.log","level":"info","msg":"Finished upload","time":"2018-05-23T13:09:20Z"}
{"component":"gcsupload","dest":"pr-logs/pull/19759/test_pull_request_origin_integration/18075/artifacts/scripts/shell/logs/7d05cd9e49321a10feb4124cbea2ac1feb37268e1ce1c07529d0d6f0bd04c760.json","level":"info","msg":"Finished upload","time":"2018-05-23T13:09:20Z"}
{"component":"gcsupload","dest":"pr-logs/pull/19759/test_pull_request_origin_integration/18075/artifacts/scripts/test-integration/logs/scripts.log","level":"info","msg":"Finished upload","time":"2018-05-23T13:09:20Z"}
{"component":"gcsupload","dest":"pr-logs/pull/19759/test_pull_request_origin_integration/18075/finished.json","level":"info","msg":"Finished upload","time":"2018-05-23T13:09:20Z"}
{"component":"gcsupload","dest":"pr-logs/pull/19759/test_pull_request_origin_integration/18075/artifacts/generated/docker.config","level":"info","msg":"Finished upload","time":"2018-05-23T13:09:20Z"}
{"component":"gcsupload","dest":"pr-logs/pull/19759/test_pull_request_origin_integration/18075/artifacts/scripts/test-tools/logs/raw_test_output.log","level":"info","msg":"Finished upload","time":"2018-05-23T13:09:20Z"}
{"component":"gcsupload","dest":"pr-logs/pull/19759/test_pull_request_origin_integration/18075/artifacts/generated/node-metrics.log","level":"info","msg":"Finished upload","time":"2018-05-23T13:09:20Z"}
{"component":"gcsupload","dest":"pr-logs/pull/19759/test_pull_request_origin_integration/18075/artifacts/scripts/test-integration/logs/test-go-err.log","level":"info","msg":"Finished upload","time":"2018-05-23T13:09:20Z"}
{"component":"gcsupload","dest":"pr-logs/pull/19759/test_pull_request_origin_integration/18075/artifacts/generated/pid1.journal","level":"info","msg":"Finished upload","time":"2018-05-23T13:09:20Z"}
{"component":"gcsupload","dest":"pr-logs/pull/19759/test_pull_request_origin_integration/18075/artifacts/generated/docker.info","level":"info","msg":"Finished upload","time":"2018-05-23T13:09:20Z"}
{"component":"gcsupload","dest":"pr-logs/directory/test_pull_request_origin_integration/latest-build.txt","level":"info","msg":"Finished upload","time":"2018-05-23T13:09:20Z"}
{"component":"gcsupload","dest":"pr-logs/directory/test_pull_request_origin_integration/18075.txt","level":"info","msg":"Finished upload","time":"2018-05-23T13:09:20Z"}
{"component":"gcsupload","dest":"pr-logs/pull/19759/test_pull_request_origin_integration/18075/artifacts/scripts/shell/logs/scripts.log","level":"info","msg":"Finished upload","time":"2018-05-23T13:09:20Z"}
{"component":"gcsupload","dest":"pr-logs/pull/19759/test_pull_request_origin_integration/18075/artifacts/generated/installed_packages.log","level":"info","msg":"Finished upload","time":"2018-05-23T13:09:20Z"}
{"component":"gcsupload","dest":"pr-logs/pull/19759/test_pull_request_origin_integration/18075/artifacts/generated/avc_denials.log","level":"info","msg":"Finished upload","time":"2018-05-23T13:09:20Z"}
{"component":"gcsupload","dest":"pr-logs/pull/19759/test_pull_request_origin_integration/18075/artifacts/scripts/test-integration/artifacts/gotest_report_KtUpJ.xml","level":"info","msg":"Finished upload","time":"2018-05-23T13:09:20Z"}
{"component":"gcsupload","dest":"pr-logs/pull/19759/test_pull_request_origin_integration/18075/artifacts/scripts/test-integration/logs/raw_test_output.log","level":"info","msg":"Finished upload","time":"2018-05-23T13:09:20Z"}
{"component":"gcsupload","dest":"pr-logs/pull/19759/test_pull_request_origin_integration/18075/build-log.txt","level":"info","msg":"Finished upload","time":"2018-05-23T13:09:20Z"}
{"component":"gcsupload","dest":"pr-logs/pull/19759/test_pull_request_origin_integration/18075/artifacts/generated/master-metrics.log","level":"info","msg":"Finished upload","time":"2018-05-23T13:09:21Z"}
{"component":"gcsupload","level":"info","msg":"Finished upload to GCS","time":"2018-05-23T13:09:21Z"}
+ exit 0
+ set +o xtrace
########## FINISHED STAGE: SUCCESS: PUSH THE ARTIFACTS AND METADATA [00h 00m 06s] ##########
[workspace@3] $ /bin/bash /tmp/jenkins1611661614978929459.sh
########## STARTING STAGE: DEPROVISION CLOUD RESOURCES ##########
+ [[ -s /var/lib/jenkins/jobs/test_pull_request_origin_integration/workspace@3/activate ]]
+ source /var/lib/jenkins/jobs/test_pull_request_origin_integration/workspace@3/activate
++ export VIRTUAL_ENV=/var/lib/jenkins/origin-ci-tool/7a5c5e83c372ad2e6b3b64b3efa16fe2cb37ef83
++ VIRTUAL_ENV=/var/lib/jenkins/origin-ci-tool/7a5c5e83c372ad2e6b3b64b3efa16fe2cb37ef83
++ export PATH=/var/lib/jenkins/origin-ci-tool/7a5c5e83c372ad2e6b3b64b3efa16fe2cb37ef83/bin:/sbin:/usr/sbin:/bin:/usr/bin
++ PATH=/var/lib/jenkins/origin-ci-tool/7a5c5e83c372ad2e6b3b64b3efa16fe2cb37ef83/bin:/sbin:/usr/sbin:/bin:/usr/bin
++ unset PYTHON_HOME
++ export OCT_CONFIG_HOME=/var/lib/jenkins/jobs/test_pull_request_origin_integration/workspace@3/.config
++ OCT_CONFIG_HOME=/var/lib/jenkins/jobs/test_pull_request_origin_integration/workspace@3/.config
+ oct deprovision

PLAYBOOK: main.yml *************************************************************
4 plays in /var/lib/jenkins/origin-ci-tool/7a5c5e83c372ad2e6b3b64b3efa16fe2cb37ef83/lib/python2.7/site-packages/oct/ansible/oct/playbooks/deprovision/main.yml

PLAY [ensure we have the parameters necessary to deprovision virtual hosts] ****

TASK [ensure all required variables are set] ***********************************
task path: /var/lib/jenkins/origin-ci-tool/7a5c5e83c372ad2e6b3b64b3efa16fe2cb37ef83/lib/python2.7/site-packages/oct/ansible/oct/playbooks/deprovision/main.yml:9
skipping: [localhost] => (item=origin_ci_aws_region)  => {
    "changed": false, 
    "generated_timestamp": "2018-05-23 09:09:24.459490", 
    "item": "origin_ci_aws_region", 
    "skip_reason": "Conditional check failed", 
    "skipped": true
}
skipping: [localhost] => (item=origin_ci_inventory_dir)  => {
    "changed": false, 
    "generated_timestamp": "2018-05-23 09:09:24.460740", 
    "item": "origin_ci_inventory_dir", 
    "skip_reason": "Conditional check failed", 
    "skipped": true
}

PLAY [deprovision virtual hosts in EC2] ****************************************

TASK [Gathering Facts] *********************************************************
ok: [localhost]

TASK [deprovision a virtual EC2 host] ******************************************
task path: /var/lib/jenkins/origin-ci-tool/7a5c5e83c372ad2e6b3b64b3efa16fe2cb37ef83/lib/python2.7/site-packages/oct/ansible/oct/playbooks/deprovision/main.yml:28
included: /var/lib/jenkins/origin-ci-tool/7a5c5e83c372ad2e6b3b64b3efa16fe2cb37ef83/lib/python2.7/site-packages/oct/ansible/oct/playbooks/deprovision/roles/aws-down/tasks/main.yml for localhost

TASK [update the SSH configuration to remove AWS EC2 specifics] ****************
task path: /var/lib/jenkins/origin-ci-tool/7a5c5e83c372ad2e6b3b64b3efa16fe2cb37ef83/lib/python2.7/site-packages/oct/ansible/oct/playbooks/deprovision/roles/aws-down/tasks/main.yml:2
ok: [localhost] => {
    "changed": false, 
    "generated_timestamp": "2018-05-23 09:09:29.322035", 
    "msg": ""
}

TASK [rename EC2 instance for termination reaper] ******************************
task path: /var/lib/jenkins/origin-ci-tool/7a5c5e83c372ad2e6b3b64b3efa16fe2cb37ef83/lib/python2.7/site-packages/oct/ansible/oct/playbooks/deprovision/roles/aws-down/tasks/main.yml:8
changed: [localhost] => {
    "changed": true, 
    "generated_timestamp": "2018-05-23 09:09:30.559793", 
    "msg": "Tags {'Name': 'oct-terminate'} created for resource i-04c6293fb1c52da23."
}

TASK [tear down the EC2 instance] **********************************************
task path: /var/lib/jenkins/origin-ci-tool/7a5c5e83c372ad2e6b3b64b3efa16fe2cb37ef83/lib/python2.7/site-packages/oct/ansible/oct/playbooks/deprovision/roles/aws-down/tasks/main.yml:15
changed: [localhost] => {
    "changed": true, 
    "generated_timestamp": "2018-05-23 09:09:32.522973", 
    "instance_ids": [
        "i-04c6293fb1c52da23"
    ], 
    "instances": [
        {
            "ami_launch_index": "0", 
            "architecture": "x86_64", 
            "block_device_mapping": {
                "/dev/sda1": {
                    "delete_on_termination": true, 
                    "status": "attached", 
                    "volume_id": "vol-02fc9f6f0bbd74bea"
                }, 
                "/dev/sdb": {
                    "delete_on_termination": true, 
                    "status": "attached", 
                    "volume_id": "vol-0aeaff026499d2bc9"
                }
            }, 
            "dns_name": "ec2-34-228-225-92.compute-1.amazonaws.com", 
            "ebs_optimized": false, 
            "groups": {
                "sg-7e73221a": "default"
            }, 
            "hypervisor": "xen", 
            "id": "i-04c6293fb1c52da23", 
            "image_id": "ami-0f07d2d9a03af96ec", 
            "instance_type": "m4.xlarge", 
            "kernel": null, 
            "key_name": "libra", 
            "launch_time": "2018-05-23T12:19:13.000Z", 
            "placement": "us-east-1d", 
            "private_dns_name": "ip-172-18-0-202.ec2.internal", 
            "private_ip": "172.18.0.202", 
            "public_dns_name": "ec2-34-228-225-92.compute-1.amazonaws.com", 
            "public_ip": "34.228.225.92", 
            "ramdisk": null, 
            "region": "us-east-1", 
            "root_device_name": "/dev/sda1", 
            "root_device_type": "ebs", 
            "state": "running", 
            "state_code": 16, 
            "tags": {
                "Name": "oct-terminate", 
                "openshift_etcd": "", 
                "openshift_master": "", 
                "openshift_node": ""
            }, 
            "tenancy": "default", 
            "virtualization_type": "hvm"
        }
    ], 
    "tagged_instances": []
}

TASK [remove the serialized host variables] ************************************
task path: /var/lib/jenkins/origin-ci-tool/7a5c5e83c372ad2e6b3b64b3efa16fe2cb37ef83/lib/python2.7/site-packages/oct/ansible/oct/playbooks/deprovision/roles/aws-down/tasks/main.yml:22
changed: [localhost] => {
    "changed": true, 
    "generated_timestamp": "2018-05-23 09:09:33.129321", 
    "path": "/var/lib/jenkins/jobs/test_pull_request_origin_integration/workspace@3/.config/origin-ci-tool/inventory/host_vars/172.18.0.202.yml", 
    "state": "absent"
}

PLAY [deprovision virtual hosts locally manged by Vagrant] *********************

TASK [Gathering Facts] *********************************************************
ok: [localhost]

PLAY [clean up local configuration for deprovisioned instances] ****************

TASK [remove inventory configuration directory] ********************************
task path: /var/lib/jenkins/origin-ci-tool/7a5c5e83c372ad2e6b3b64b3efa16fe2cb37ef83/lib/python2.7/site-packages/oct/ansible/oct/playbooks/deprovision/main.yml:61
changed: [localhost] => {
    "changed": true, 
    "generated_timestamp": "2018-05-23 09:09:34.391273", 
    "path": "/var/lib/jenkins/jobs/test_pull_request_origin_integration/workspace@3/.config/origin-ci-tool/inventory", 
    "state": "absent"
}

PLAY RECAP *********************************************************************
localhost                  : ok=8    changed=4    unreachable=0    failed=0   

+ set +o xtrace
########## FINISHED STAGE: SUCCESS: DEPROVISION CLOUD RESOURCES [00h 00m 13s] ##########
Archiving artifacts
[BFA] Scanning build for known causes...
[BFA] Found failure cause(s):
[BFA] Job Stage Failed
[BFA] Unit or Integration Test Failed
[BFA] Done. 14s
[WS-CLEANUP] Deleting project workspace...[WS-CLEANUP] done
Finished: FAILURE