Console Output

Skipping 56 KB.. Full Log
+ ssh -F /var/lib/jenkins/jobs/test_pull_request_crio_e2e_features_rhel/workspace/.config/origin-ci-tool/inventory/.ssh_config openshiftdevel 'echo '\''PULL_BASE_REF=main'\'' >> /etc/environment'
+ ssh -F /var/lib/jenkins/jobs/test_pull_request_crio_e2e_features_rhel/workspace/.config/origin-ci-tool/inventory/.ssh_config openshiftdevel 'echo '\''PULL_BASE_SHA=d427c58bde81020b267cf4b6375e353ff6c36d19'\'' >> /etc/environment'
+ ssh -F /var/lib/jenkins/jobs/test_pull_request_crio_e2e_features_rhel/workspace/.config/origin-ci-tool/inventory/.ssh_config openshiftdevel 'echo '\''PULL_REFS=main:d427c58bde81020b267cf4b6375e353ff6c36d19,6004:a2d1ca20423cf019a5397d0ca193e314132455e3'\'' >> /etc/environment'
+ ssh -F /var/lib/jenkins/jobs/test_pull_request_crio_e2e_features_rhel/workspace/.config/origin-ci-tool/inventory/.ssh_config openshiftdevel 'echo '\''PULL_NUMBER=6004'\'' >> /etc/environment'
+ ssh -F /var/lib/jenkins/jobs/test_pull_request_crio_e2e_features_rhel/workspace/.config/origin-ci-tool/inventory/.ssh_config openshiftdevel 'echo '\''PULL_PULL_SHA=a2d1ca20423cf019a5397d0ca193e314132455e3'\'' >> /etc/environment'
+ ssh -F /var/lib/jenkins/jobs/test_pull_request_crio_e2e_features_rhel/workspace/.config/origin-ci-tool/inventory/.ssh_config openshiftdevel 'echo '\''JOB_SPEC={"type":"presubmit","job":"test_pull_request_crio_e2e_features_rhel","buildid":"1543077077857603593","prowjobid":"a291d649-f9b8-11ec-9f8b-0a580a81080e","refs":{"org":"cri-o","repo":"cri-o","base_ref":"main","base_sha":"d427c58bde81020b267cf4b6375e353ff6c36d19","pulls":[{"number":6004,"author":"giuseppe","sha":"a2d1ca20423cf019a5397d0ca193e314132455e3","title":"server: userns support"}]}}'\'' >> /etc/environment'
+ ssh -F /var/lib/jenkins/jobs/test_pull_request_crio_e2e_features_rhel/workspace/.config/origin-ci-tool/inventory/.ssh_config openshiftdevel 'echo '\''PROW_JOB_ID=a291d649-f9b8-11ec-9f8b-0a580a81080e'\'' >> /etc/environment'
+ ssh -F /var/lib/jenkins/jobs/test_pull_request_crio_e2e_features_rhel/workspace/.config/origin-ci-tool/inventory/.ssh_config openshiftdevel 'echo '\''JOB_SPEC={"type":"presubmit","job":"test_pull_request_crio_e2e_features_rhel","buildid":"1543077077857603593","prowjobid":"a291d649-f9b8-11ec-9f8b-0a580a81080e","refs":{"org":"cri-o","repo":"cri-o","base_ref":"main","base_sha":"d427c58bde81020b267cf4b6375e353ff6c36d19","pulls":[{"number":6004,"author":"giuseppe","sha":"a2d1ca20423cf019a5397d0ca193e314132455e3","title":"server: userns support"}]}}'\'' >> /etc/environment'
+ ssh -F /var/lib/jenkins/jobs/test_pull_request_crio_e2e_features_rhel/workspace/.config/origin-ci-tool/inventory/.ssh_config openshiftdevel 'echo '\''BUILD_NUMBER=24313'\'' >> /etc/environment'
+ set +o xtrace
########## FINISHED STAGE: SUCCESS: FORWARD PARAMETERS TO THE REMOTE HOST [00h 00m 06s] ##########
[workspace] $ /bin/bash /tmp/jenkins5379637689057656486.sh
########## STARTING STAGE: UPLOAD GCS STARTING METADATA ##########
+ [[ -s /var/lib/jenkins/jobs/test_pull_request_crio_e2e_features_rhel/workspace/activate ]]
+ source /var/lib/jenkins/jobs/test_pull_request_crio_e2e_features_rhel/workspace/activate
++ export VIRTUAL_ENV=/var/lib/jenkins/origin-ci-tool/95a472392910104fc805c4ab8af39791105c956d
++ VIRTUAL_ENV=/var/lib/jenkins/origin-ci-tool/95a472392910104fc805c4ab8af39791105c956d
++ export PATH=/var/lib/jenkins/origin-ci-tool/95a472392910104fc805c4ab8af39791105c956d/bin:/sbin:/usr/sbin:/bin:/usr/bin
++ PATH=/var/lib/jenkins/origin-ci-tool/95a472392910104fc805c4ab8af39791105c956d/bin:/sbin:/usr/sbin:/bin:/usr/bin
++ unset PYTHON_HOME
++ export OCT_CONFIG_HOME=/var/lib/jenkins/jobs/test_pull_request_crio_e2e_features_rhel/workspace/.config
++ OCT_CONFIG_HOME=/var/lib/jenkins/jobs/test_pull_request_crio_e2e_features_rhel/workspace/.config
+ trap 'exit 0' EXIT
+ mkdir -p gcs/
+ [[ -n cri-o ]]
+ cat
++ date +%s
+ BUILD=24313
+ bucket=gs://origin-federated-results/
+ suffix=test_pull_request_crio_e2e_features_rhel/24313/
+ [[ -n cri-o ]]
+ segment=cri-o_cri-o/
+ [[ -n 6004 ]]
+ prefix=pr-logs/pull/
+ segment=cri-o_cri-o/6004/
+ path=gs://origin-federated-results/pr-logs/pull/cri-o_cri-o/6004/test_pull_request_crio_e2e_features_rhel/24313/
+ gsutil cp gcs/started.json gs://origin-federated-results/pr-logs/pull/cri-o_cri-o/6004/test_pull_request_crio_e2e_features_rhel/24313/started.json
Copying file://gcs/started.json [Content-Type=application/json]...
/ [0 files][    0.0 B/  280.0 B]                                                
/ [1 files][  280.0 B/  280.0 B]                                                
Operation completed over 1 objects/280.0 B.                                      
+ [[ -n 6004 ]]
+ echo gs://origin-federated-results/pr-logs/pull/cri-o_cri-o/6004/test_pull_request_crio_e2e_features_rhel/24313
+ gsutil cp 24313.txt gs://origin-federated-results/pr-logs/directory/test_pull_request_crio_e2e_features_rhel/24313.txt
Copying file://24313.txt [Content-Type=text/plain]...
/ [0 files][    0.0 B/  107.0 B]                                                
/ [1 files][  107.0 B/  107.0 B]                                                
Operation completed over 1 objects/107.0 B.                                      
+ echo 24313
++ jq --compact-output .type
+ job_type='"presubmit"'
+ [[ "presubmit" =~ presubmit ]]
+ gsutil cp latest-build.txt gs://origin-ci-test/pr-logs/directory/test_pull_request_crio_e2e_features_rhel/latest-build.txt
Copying file://latest-build.txt [Content-Type=text/plain]...
/ [0 files][    0.0 B/    6.0 B]                                                
/ [1 files][    6.0 B/    6.0 B]                                                
Operation completed over 1 objects/6.0 B.                                        
+ exit 0
[workspace] $ /bin/bash /tmp/jenkins4698240355401610045.sh
########## STARTING STAGE: FORWARD PARAMETERS TO THE REMOTE HOST ##########
+ [[ -s /var/lib/jenkins/jobs/test_pull_request_crio_e2e_features_rhel/workspace/activate ]]
+ source /var/lib/jenkins/jobs/test_pull_request_crio_e2e_features_rhel/workspace/activate
++ export VIRTUAL_ENV=/var/lib/jenkins/origin-ci-tool/95a472392910104fc805c4ab8af39791105c956d
++ VIRTUAL_ENV=/var/lib/jenkins/origin-ci-tool/95a472392910104fc805c4ab8af39791105c956d
++ export PATH=/var/lib/jenkins/origin-ci-tool/95a472392910104fc805c4ab8af39791105c956d/bin:/sbin:/usr/sbin:/bin:/usr/bin
++ PATH=/var/lib/jenkins/origin-ci-tool/95a472392910104fc805c4ab8af39791105c956d/bin:/sbin:/usr/sbin:/bin:/usr/bin
++ unset PYTHON_HOME
++ export OCT_CONFIG_HOME=/var/lib/jenkins/jobs/test_pull_request_crio_e2e_features_rhel/workspace/.config
++ OCT_CONFIG_HOME=/var/lib/jenkins/jobs/test_pull_request_crio_e2e_features_rhel/workspace/.config
+ ssh -F /var/lib/jenkins/jobs/test_pull_request_crio_e2e_features_rhel/workspace/.config/origin-ci-tool/inventory/.ssh_config openshiftdevel sudo chmod o+rw /etc/environment
+ ssh -F /var/lib/jenkins/jobs/test_pull_request_crio_e2e_features_rhel/workspace/.config/origin-ci-tool/inventory/.ssh_config openshiftdevel 'echo '\''PULL_NUMBER=6004'\'' >> /etc/environment'
+ ssh -F /var/lib/jenkins/jobs/test_pull_request_crio_e2e_features_rhel/workspace/.config/origin-ci-tool/inventory/.ssh_config openshiftdevel 'echo '\''PULL_BASE_SHA=d427c58bde81020b267cf4b6375e353ff6c36d19'\'' >> /etc/environment'
+ ssh -F /var/lib/jenkins/jobs/test_pull_request_crio_e2e_features_rhel/workspace/.config/origin-ci-tool/inventory/.ssh_config openshiftdevel 'echo '\''PULL_PULL_SHA=a2d1ca20423cf019a5397d0ca193e314132455e3'\'' >> /etc/environment'
+ set +o xtrace
########## FINISHED STAGE: SUCCESS: FORWARD PARAMETERS TO THE REMOTE HOST [00h 00m 02s] ##########
[workspace] $ /bin/bash /tmp/jenkins8032066696900252729.sh
########## STARTING STAGE: CLONE CRI-O AND CHECK OUT THE CORRECT REFS ##########
+ [[ -s /var/lib/jenkins/jobs/test_pull_request_crio_e2e_features_rhel/workspace/activate ]]
+ source /var/lib/jenkins/jobs/test_pull_request_crio_e2e_features_rhel/workspace/activate
++ export VIRTUAL_ENV=/var/lib/jenkins/origin-ci-tool/95a472392910104fc805c4ab8af39791105c956d
++ VIRTUAL_ENV=/var/lib/jenkins/origin-ci-tool/95a472392910104fc805c4ab8af39791105c956d
++ export PATH=/var/lib/jenkins/origin-ci-tool/95a472392910104fc805c4ab8af39791105c956d/bin:/sbin:/usr/sbin:/bin:/usr/bin
++ PATH=/var/lib/jenkins/origin-ci-tool/95a472392910104fc805c4ab8af39791105c956d/bin:/sbin:/usr/sbin:/bin:/usr/bin
++ unset PYTHON_HOME
++ export OCT_CONFIG_HOME=/var/lib/jenkins/jobs/test_pull_request_crio_e2e_features_rhel/workspace/.config
++ OCT_CONFIG_HOME=/var/lib/jenkins/jobs/test_pull_request_crio_e2e_features_rhel/workspace/.config
++ mktemp
+ script=/tmp/tmp.CTDmuEfI8b
+ cat
+ chmod +x /tmp/tmp.CTDmuEfI8b
+ scp -F /var/lib/jenkins/jobs/test_pull_request_crio_e2e_features_rhel/workspace/.config/origin-ci-tool/inventory/.ssh_config /tmp/tmp.CTDmuEfI8b openshiftdevel:/tmp/tmp.CTDmuEfI8b
+ ssh -F /var/lib/jenkins/jobs/test_pull_request_crio_e2e_features_rhel/workspace/.config/origin-ci-tool/inventory/.ssh_config -t openshiftdevel 'bash -l -c "timeout 14400 /tmp/tmp.CTDmuEfI8b"'
+ cd /home/origin
+ cd /go/src/github.com/cri-o/cri-o
+ git fetch origin
From https://github.com/cri-o/cri-o
 * [new branch]      add-debug  -> origin/add-debug
 * [new branch]      annotations-refactor -> origin/annotations-refactor
 * [new branch]      ci-v2      -> origin/ci-v2
 * [new branch]      dependabot/go_modules/github.com/coreos/go-systemd/v22-22.3.0 -> origin/dependabot/go_modules/github.com/coreos/go-systemd/v22-22.3.0
 * [new branch]      dependabot/go_modules/go.opentelemetry.io/otel/exporters/otlp/otlptrace/otlptracegrpc-1.4.1 -> origin/dependabot/go_modules/go.opentelemetry.io/otel/exporters/otlp/otlptrace/otlptracegrpc-1.4.1
   b60207c..391b25d  gh-pages   -> origin/gh-pages
 * [new branch]      main       -> origin/main
   5218c73..6e806b1  release-1.11 -> origin/release-1.11
   7f979af..f0bab49  release-1.17 -> origin/release-1.17
   be796d1..5566459  release-1.18 -> origin/release-1.18
   6377f68..f2c0434  release-1.19 -> origin/release-1.19
   b422fc2..ffd7f95  release-1.20 -> origin/release-1.20
   900bc42..d78036c  release-1.21 -> origin/release-1.21
 * [new branch]      release-1.22 -> origin/release-1.22
 * [new branch]      release-1.23 -> origin/release-1.23
 * [new branch]      release-1.24 -> origin/release-1.24
 * [new branch]      release-1.25 -> origin/release-1.25
 * [new tag]         v1.18.6    -> v1.18.6
From https://github.com/cri-o/cri-o
 * [new tag]         v1.18.5    -> v1.18.5
 * [new tag]         v1.19.2    -> v1.19.2
 * [new tag]         v1.19.3    -> v1.19.3
 * [new tag]         v1.19.4    -> v1.19.4
 * [new tag]         v1.19.5    -> v1.19.5
 * [new tag]         v1.19.6    -> v1.19.6
 * [new tag]         v1.20.1    -> v1.20.1
 * [new tag]         v1.20.2    -> v1.20.2
 * [new tag]         v1.20.3    -> v1.20.3
 * [new tag]         v1.20.4    -> v1.20.4
 * [new tag]         v1.20.5    -> v1.20.5
 * [new tag]         v1.20.6    -> v1.20.6
 * [new tag]         v1.20.7    -> v1.20.7
 * [new tag]         v1.21.0    -> v1.21.0
 * [new tag]         v1.21.1    -> v1.21.1
 * [new tag]         v1.21.2    -> v1.21.2
 * [new tag]         v1.21.3    -> v1.21.3
 * [new tag]         v1.21.4    -> v1.21.4
 * [new tag]         v1.21.5    -> v1.21.5
 * [new tag]         v1.21.6    -> v1.21.6
 * [new tag]         v1.21.7    -> v1.21.7
 * [new tag]         v1.22.0    -> v1.22.0
 * [new tag]         v1.22.1    -> v1.22.1
 * [new tag]         v1.22.2    -> v1.22.2
 * [new tag]         v1.22.3    -> v1.22.3
 * [new tag]         v1.22.4    -> v1.22.4
 * [new tag]         v1.22.5    -> v1.22.5
 * [new tag]         v1.23.0    -> v1.23.0
 * [new tag]         v1.23.1    -> v1.23.1
 * [new tag]         v1.23.2    -> v1.23.2
 * [new tag]         v1.23.3    -> v1.23.3
 * [new tag]         v1.24.0    -> v1.24.0
 * [new tag]         v1.24.1    -> v1.24.1
+ git checkout -f master
Already on 'master'
+ git branch -D target
error: branch 'target' not found.
+ true
+ git branch -D pr
error: branch 'pr' not found.
+ true
+ git branch target d427c58bde81020b267cf4b6375e353ff6c36d19
+ git checkout -f target
Switched to branch 'target'
+ git fetch origin pull/6004/head:pr
From https://github.com/cri-o/cri-o
 * [new ref]         refs/pull/6004/head -> pr
+ git merge a2d1ca20423cf019a5397d0ca193e314132455e3
Auto-merging vendor/modules.txt
Removing vendor/k8s.io/kubernetes/pkg/util/conntrack/conntrack.go
Removing vendor/k8s.io/kubernetes/pkg/util/async/runner.go
Removing vendor/k8s.io/kubernetes/pkg/util/async/bounded_frequency_runner.go
Removing vendor/k8s.io/kubernetes/pkg/proxy/util/iptables/traffic.go
Removing vendor/k8s.io/kubernetes/pkg/proxy/types.go
Removing vendor/k8s.io/kubernetes/pkg/proxy/topology.go
Removing vendor/k8s.io/kubernetes/pkg/proxy/service.go
Removing vendor/k8s.io/kubernetes/pkg/proxy/metrics/metrics.go
Removing vendor/k8s.io/kubernetes/pkg/proxy/metaproxier/meta_proxier.go
Removing vendor/k8s.io/kubernetes/pkg/proxy/iptables/proxier.go
Removing vendor/k8s.io/kubernetes/pkg/proxy/iptables/OWNERS
Removing vendor/k8s.io/kubernetes/pkg/proxy/healthcheck/service_health.go
Removing vendor/k8s.io/kubernetes/pkg/proxy/healthcheck/proxier_health.go
Removing vendor/k8s.io/kubernetes/pkg/proxy/healthcheck/doc.go
Removing vendor/k8s.io/kubernetes/pkg/proxy/healthcheck/common.go
Removing vendor/k8s.io/kubernetes/pkg/proxy/endpointslicecache.go
Removing vendor/k8s.io/kubernetes/pkg/proxy/endpoints.go
Removing vendor/k8s.io/kubernetes/pkg/proxy/doc.go
Removing vendor/k8s.io/kubernetes/pkg/proxy/config/doc.go
Removing vendor/k8s.io/kubernetes/pkg/proxy/config/config.go
Removing vendor/k8s.io/kubernetes/pkg/proxy/config/OWNERS
Removing vendor/k8s.io/kubernetes/pkg/proxy/OWNERS
Removing vendor/k8s.io/kubernetes/pkg/api/v1/service/util.go
Removing vendor/k8s.io/client-go/util/jsonpath/parser.go
Removing vendor/k8s.io/client-go/util/jsonpath/node.go
Removing vendor/k8s.io/client-go/util/jsonpath/jsonpath.go
Removing vendor/k8s.io/client-go/util/jsonpath/doc.go
Removing vendor/k8s.io/client-go/third_party/forked/golang/template/funcs.go
Removing vendor/k8s.io/client-go/third_party/forked/golang/template/exec.go
Removing vendor/k8s.io/client-go/third_party/forked/golang/PATENTS
Removing vendor/k8s.io/client-go/third_party/forked/golang/LICENSE
Removing vendor/k8s.io/client-go/plugin/pkg/client/auth/gcp/gcp.go
Removing vendor/k8s.io/client-go/plugin/pkg/client/auth/gcp/OWNERS
Removing vendor/k8s.io/client-go/plugin/pkg/client/auth/azure/azure.go
Removing vendor/k8s.io/client-go/plugin/pkg/client/auth/azure/README.md
Removing vendor/k8s.io/apimachinery/pkg/util/clock/clock.go
Removing vendor/github.com/lithammer/dedent/dedent.go
Removing vendor/github.com/lithammer/dedent/README.md
Removing vendor/github.com/lithammer/dedent/LICENSE
Removing vendor/github.com/lithammer/dedent/.travis.yml
Auto-merging go.sum
Auto-merging go.mod
Merge made by the 'recursive' strategy.
 go.mod                                             |   58 +-
 go.sum                                             |  128 +-
 internal/hostport/hostport_manager.go              |    5 +-
 internal/hostport/meta_hostport_manager.go         |    5 +-
 server/container_create_linux.go                   |    8 +-
 server/sandbox_run_linux.go                        |   26 +
 server/streaming/request_cache.go                  |    2 +-
 .../Azure/go-autorest/autorest/adal/README.md      |    8 +-
 .../Azure/go-autorest/autorest/adal/token.go       |   90 +-
 .../github.com/emicklei/go-restful/v3/.gitignore   |   71 +
 vendor/github.com/emicklei/go-restful/v3/.goconvey |    1 +
 .../github.com/emicklei/go-restful/v3/.travis.yml  |   13 +
 .../github.com/emicklei/go-restful/v3/CHANGES.md   |  372 ++++
 vendor/github.com/emicklei/go-restful/v3/LICENSE   |   22 +
 vendor/github.com/emicklei/go-restful/v3/Makefile  |    8 +
 vendor/github.com/emicklei/go-restful/v3/README.md |  110 ++
 .../github.com/emicklei/go-restful/v3/SECURITY.md  |   13 +
 vendor/github.com/emicklei/go-restful/v3/Srcfile   |    1 +
 .../emicklei/go-restful/v3/bench_test.sh           |   10 +
 .../github.com/emicklei/go-restful/v3/compress.go  |  127 ++
 .../emicklei/go-restful/v3/compressor_cache.go     |  103 ++
 .../emicklei/go-restful/v3/compressor_pools.go     |   91 +
 .../emicklei/go-restful/v3/compressors.go          |   54 +
 .../github.com/emicklei/go-restful/v3/constants.go |   30 +
 .../github.com/emicklei/go-restful/v3/container.go |  450 +++++
 .../emicklei/go-restful/v3/cors_filter.go          |  193 ++
 .../github.com/emicklei/go-restful/v3/coverage.sh  |    2 +
 vendor/github.com/emicklei/go-restful/v3/curly.go  |  173 ++
 .../emicklei/go-restful/v3/curly_route.go          |   54 +
 .../emicklei/go-restful/v3/custom_verb.go          |   29 +
 vendor/github.com/emicklei/go-restful/v3/doc.go    |  185 ++
 .../emicklei/go-restful/v3/entity_accessors.go     |  162 ++
 .../emicklei/go-restful/v3/extensions.go           |   21 +
 vendor/github.com/emicklei/go-restful/v3/filter.go |   37 +
 vendor/github.com/emicklei/go-restful/v3/json.go   |   11 +
 .../github.com/emicklei/go-restful/v3/jsoniter.go  |   12 +
 vendor/github.com/emicklei/go-restful/v3/jsr311.go |  326 ++++
 .../github.com/emicklei/go-restful/v3/log/log.go   |   34 +
 vendor/github.com/emicklei/go-restful/v3/logger.go |   32 +
 vendor/github.com/emicklei/go-restful/v3/mime.go   |   50 +
 .../emicklei/go-restful/v3/options_filter.go       |   34 +
 .../github.com/emicklei/go-restful/v3/parameter.go |  234 +++
 .../emicklei/go-restful/v3/path_expression.go      |   74 +
 .../emicklei/go-restful/v3/path_processor.go       |   74 +
 .../github.com/emicklei/go-restful/v3/request.go   |  132 ++
 .../github.com/emicklei/go-restful/v3/response.go  |  256 +++
 vendor/github.com/emicklei/go-restful/v3/route.go  |  178 ++
 .../emicklei/go-restful/v3/route_builder.go        |  376 ++++
 .../emicklei/go-restful/v3/route_reader.go         |   66 +
 vendor/github.com/emicklei/go-restful/v3/router.go |   20 +
 .../emicklei/go-restful/v3/service_error.go        |   32 +
 .../emicklei/go-restful/v3/web_service.go          |  293 +++
 .../go-restful/v3/web_service_container.go         |   39 +
 vendor/github.com/lithammer/dedent/.travis.yml     |   11 -
 vendor/github.com/lithammer/dedent/LICENSE         |   21 -
 vendor/github.com/lithammer/dedent/README.md       |   52 -
 vendor/github.com/lithammer/dedent/dedent.go       |   49 -
 .../k8s.io/api/authentication/v1/generated.proto   |    2 +-
 vendor/k8s.io/api/authentication/v1/types.go       |    2 +-
 .../v1/types_swagger_doc_generated.go              |    2 +-
 vendor/k8s.io/api/core/v1/generated.pb.go          | 1933 +++++++++++---------
 vendor/k8s.io/api/core/v1/generated.proto          |   68 +-
 vendor/k8s.io/api/core/v1/types.go                 |  100 +-
 .../api/core/v1/types_swagger_doc_generated.go     |   23 +-
 vendor/k8s.io/api/core/v1/zz_generated.deepcopy.go |   15 +
 vendor/k8s.io/api/networking/v1/generated.proto    |   20 +-
 vendor/k8s.io/api/networking/v1/types.go           |   22 +-
 .../networking/v1/types_swagger_doc_generated.go   |    2 +-
 vendor/k8s.io/api/networking/v1beta1/types.go      |    2 +-
 vendor/k8s.io/api/rbac/v1/generated.proto          |    2 +-
 vendor/k8s.io/api/rbac/v1/types.go                 |    2 +-
 .../api/rbac/v1/types_swagger_doc_generated.go     |    2 +-
 vendor/k8s.io/api/rbac/v1alpha1/generated.proto    |    2 +-
 vendor/k8s.io/api/rbac/v1alpha1/types.go           |    2 +-
 .../rbac/v1alpha1/types_swagger_doc_generated.go   |    2 +-
 vendor/k8s.io/api/rbac/v1beta1/generated.proto     |    2 +-
 vendor/k8s.io/api/rbac/v1beta1/types.go            |    2 +-
 .../rbac/v1beta1/types_swagger_doc_generated.go    |    2 +-
 vendor/k8s.io/apimachinery/pkg/api/meta/meta.go    |    1 -
 .../apimachinery/pkg/api/resource/generated.proto  |   15 +-
 .../apimachinery/pkg/api/resource/quantity.go      |   15 +-
 .../apimachinery/pkg/apis/meta/v1/generated.pb.go  |  400 ++--
 .../apimachinery/pkg/apis/meta/v1/generated.proto  |    9 -
 .../k8s.io/apimachinery/pkg/apis/meta/v1/meta.go   |    6 -
 .../k8s.io/apimachinery/pkg/apis/meta/v1/types.go  |   11 +-
 .../apis/meta/v1/types_swagger_doc_generated.go    |    1 -
 .../pkg/apis/meta/v1/unstructured/unstructured.go  |   12 -
 vendor/k8s.io/apimachinery/pkg/util/clock/clock.go |   86 -
 .../pkg/util/httpstream/spdy/roundtripper.go       |   84 +-
 .../apimachinery/pkg/util/validation/validation.go |    2 +-
 vendor/k8s.io/apimachinery/pkg/util/wait/wait.go   |   10 +-
 vendor/k8s.io/apimachinery/pkg/watch/mux.go        |   53 +-
 .../k8s.io/apiserver/pkg/features/kube_features.go |  235 +--
 .../core/v1/csipersistentvolumesource.go           |    9 +
 .../core/v1/topologyspreadconstraint.go            |   28 +-
 .../applyconfigurations/internal/internal.go       |   12 +-
 .../plugin/pkg/client/auth/azure/README.md         |   56 -
 .../plugin/pkg/client/auth/azure/azure.go          |  477 -----
 .../plugin/pkg/client/auth/azure/azure_stub.go     |   36 +
 .../client-go/plugin/pkg/client/auth/gcp/OWNERS    |    8 -
 .../client-go/plugin/pkg/client/auth/gcp/gcp.go    |  390 ----
 .../plugin/pkg/client/auth/gcp/gcp_stub.go         |   36 +
 vendor/k8s.io/client-go/rest/with_retry.go         |   21 +-
 .../client-go/third_party/forked/golang/LICENSE    |   27 -
 .../client-go/third_party/forked/golang/PATENTS    |   22 -
 .../third_party/forked/golang/template/exec.go     |   94 -
 .../third_party/forked/golang/template/funcs.go    |  599 ------
 vendor/k8s.io/client-go/tools/cache/index.go       |    2 +-
 vendor/k8s.io/client-go/tools/cache/reflector.go   |    2 +-
 vendor/k8s.io/client-go/tools/cache/store.go       |   13 +-
 .../client-go/tools/cache/thread_safe_store.go     |    4 +-
 .../k8s.io/client-go/tools/clientcmd/validation.go |   15 +-
 .../client-go/tools/events/event_broadcaster.go    |   10 +-
 vendor/k8s.io/client-go/tools/record/event.go      |   14 +-
 vendor/k8s.io/client-go/util/jsonpath/doc.go       |   20 -
 vendor/k8s.io/client-go/util/jsonpath/jsonpath.go  |  579 ------
 vendor/k8s.io/client-go/util/jsonpath/node.go      |  256 ---
 vendor/k8s.io/client-go/util/jsonpath/parser.go    |  527 ------
 vendor/k8s.io/component-base/metrics/counter.go    |   17 +-
 vendor/k8s.io/component-base/metrics/gauge.go      |   69 +-
 vendor/k8s.io/component-base/metrics/histogram.go  |   13 +-
 vendor/k8s.io/component-base/metrics/metric.go     |   25 +-
 vendor/k8s.io/component-base/metrics/opts.go       |   49 +
 .../prometheusextension/timing_histogram.go        |  189 ++
 .../prometheusextension/timing_histogram_vec.go    |  111 ++
 .../prometheusextension/weighted_histogram.go      |  203 ++
 .../prometheusextension/weighted_histogram_vec.go  |  106 ++
 vendor/k8s.io/component-base/metrics/summary.go    |   14 +-
 .../component-base/metrics/timing_histogram.go     |  267 +++
 vendor/k8s.io/component-base/metrics/wrappers.go   |   66 +
 .../k8s.io/cri-api/pkg/apis/runtime/v1/api.pb.go   | 1920 +++++++++++++------
 .../k8s.io/cri-api/pkg/apis/runtime/v1/api.proto   |   63 +-
 .../cri-api/pkg/apis/runtime/v1alpha2/api.pb.go    | 1930 +++++++++++++------
 .../cri-api/pkg/apis/runtime/v1alpha2/api.proto    |   79 +-
 vendor/k8s.io/kube-openapi/pkg/common/common.go    |    2 +-
 .../kube-openapi/pkg/validation/spec/gnostic.go    | 1515 +++++++++++++++
 vendor/k8s.io/kubernetes/pkg/api/v1/pod/util.go    |   23 +
 .../k8s.io/kubernetes/pkg/api/v1/service/util.go   |  105 --
 vendor/k8s.io/kubernetes/pkg/apis/core/types.go    |   99 +-
 .../pkg/apis/core/zz_generated.deepcopy.go         |   15 +
 .../kubernetes/pkg/features/kube_features.go       | 1474 +++++++--------
 .../kubernetes/pkg/kubelet/cri/streaming/server.go |    2 +-
 vendor/k8s.io/kubernetes/pkg/proxy/OWNERS          |    8 -
 vendor/k8s.io/kubernetes/pkg/proxy/config/OWNERS   |    8 -
 .../k8s.io/kubernetes/pkg/proxy/config/config.go   |  502 -----
 vendor/k8s.io/kubernetes/pkg/proxy/config/doc.go   |   25 -
 vendor/k8s.io/kubernetes/pkg/proxy/doc.go          |   18 -
 vendor/k8s.io/kubernetes/pkg/proxy/endpoints.go    |  596 ------
 .../kubernetes/pkg/proxy/endpointslicecache.go     |  423 -----
 .../kubernetes/pkg/proxy/healthcheck/common.go     |   63 -
 .../k8s.io/kubernetes/pkg/proxy/healthcheck/doc.go |   18 -
 .../pkg/proxy/healthcheck/proxier_health.go        |  160 --
 .../pkg/proxy/healthcheck/service_health.go        |  287 ---
 vendor/k8s.io/kubernetes/pkg/proxy/iptables/OWNERS |    8 -
 .../kubernetes/pkg/proxy/iptables/proxier.go       | 1577 ----------------
 .../pkg/proxy/metaproxier/meta_proxier.go          |  160 --
 .../k8s.io/kubernetes/pkg/proxy/metrics/metrics.go |  196 --
 vendor/k8s.io/kubernetes/pkg/proxy/service.go      |  471 -----
 vendor/k8s.io/kubernetes/pkg/proxy/topology.go     |  203 --
 vendor/k8s.io/kubernetes/pkg/proxy/types.go        |  146 --
 .../kubernetes/pkg/proxy/util/iptables/traffic.go  |  148 --
 .../pkg/util/async/bounded_frequency_runner.go     |  313 ----
 vendor/k8s.io/kubernetes/pkg/util/async/runner.go  |   58 -
 .../kubernetes/pkg/util/conntrack/conntrack.go     |  133 --
 vendor/k8s.io/kubernetes/pkg/volume/plugins.go     |    2 +-
 vendor/k8s.io/mount-utils/resizefs_unsupported.go  |    5 +
 vendor/modules.txt                                 |  117 +-
 167 files changed, 13074 insertions(+), 12401 deletions(-)
 create mode 100644 vendor/github.com/emicklei/go-restful/v3/.gitignore
 create mode 100644 vendor/github.com/emicklei/go-restful/v3/.goconvey
 create mode 100644 vendor/github.com/emicklei/go-restful/v3/.travis.yml
 create mode 100644 vendor/github.com/emicklei/go-restful/v3/CHANGES.md
 create mode 100644 vendor/github.com/emicklei/go-restful/v3/LICENSE
 create mode 100644 vendor/github.com/emicklei/go-restful/v3/Makefile
 create mode 100644 vendor/github.com/emicklei/go-restful/v3/README.md
 create mode 100644 vendor/github.com/emicklei/go-restful/v3/SECURITY.md
 create mode 100644 vendor/github.com/emicklei/go-restful/v3/Srcfile
 create mode 100644 vendor/github.com/emicklei/go-restful/v3/bench_test.sh
 create mode 100644 vendor/github.com/emicklei/go-restful/v3/compress.go
 create mode 100644 vendor/github.com/emicklei/go-restful/v3/compressor_cache.go
 create mode 100644 vendor/github.com/emicklei/go-restful/v3/compressor_pools.go
 create mode 100644 vendor/github.com/emicklei/go-restful/v3/compressors.go
 create mode 100644 vendor/github.com/emicklei/go-restful/v3/constants.go
 create mode 100644 vendor/github.com/emicklei/go-restful/v3/container.go
 create mode 100644 vendor/github.com/emicklei/go-restful/v3/cors_filter.go
 create mode 100644 vendor/github.com/emicklei/go-restful/v3/coverage.sh
 create mode 100644 vendor/github.com/emicklei/go-restful/v3/curly.go
 create mode 100644 vendor/github.com/emicklei/go-restful/v3/curly_route.go
 create mode 100644 vendor/github.com/emicklei/go-restful/v3/custom_verb.go
 create mode 100644 vendor/github.com/emicklei/go-restful/v3/doc.go
 create mode 100644 vendor/github.com/emicklei/go-restful/v3/entity_accessors.go
 create mode 100644 vendor/github.com/emicklei/go-restful/v3/extensions.go
 create mode 100644 vendor/github.com/emicklei/go-restful/v3/filter.go
 create mode 100644 vendor/github.com/emicklei/go-restful/v3/json.go
 create mode 100644 vendor/github.com/emicklei/go-restful/v3/jsoniter.go
 create mode 100644 vendor/github.com/emicklei/go-restful/v3/jsr311.go
 create mode 100644 vendor/github.com/emicklei/go-restful/v3/log/log.go
 create mode 100644 vendor/github.com/emicklei/go-restful/v3/logger.go
 create mode 100644 vendor/github.com/emicklei/go-restful/v3/mime.go
 create mode 100644 vendor/github.com/emicklei/go-restful/v3/options_filter.go
 create mode 100644 vendor/github.com/emicklei/go-restful/v3/parameter.go
 create mode 100644 vendor/github.com/emicklei/go-restful/v3/path_expression.go
 create mode 100644 vendor/github.com/emicklei/go-restful/v3/path_processor.go
 create mode 100644 vendor/github.com/emicklei/go-restful/v3/request.go
 create mode 100644 vendor/github.com/emicklei/go-restful/v3/response.go
 create mode 100644 vendor/github.com/emicklei/go-restful/v3/route.go
 create mode 100644 vendor/github.com/emicklei/go-restful/v3/route_builder.go
 create mode 100644 vendor/github.com/emicklei/go-restful/v3/route_reader.go
 create mode 100644 vendor/github.com/emicklei/go-restful/v3/router.go
 create mode 100644 vendor/github.com/emicklei/go-restful/v3/service_error.go
 create mode 100644 vendor/github.com/emicklei/go-restful/v3/web_service.go
 create mode 100644 vendor/github.com/emicklei/go-restful/v3/web_service_container.go
 delete mode 100644 vendor/github.com/lithammer/dedent/.travis.yml
 delete mode 100644 vendor/github.com/lithammer/dedent/LICENSE
 delete mode 100644 vendor/github.com/lithammer/dedent/README.md
 delete mode 100644 vendor/github.com/lithammer/dedent/dedent.go
 delete mode 100644 vendor/k8s.io/apimachinery/pkg/util/clock/clock.go
 delete mode 100644 vendor/k8s.io/client-go/plugin/pkg/client/auth/azure/README.md
 delete mode 100644 vendor/k8s.io/client-go/plugin/pkg/client/auth/azure/azure.go
 create mode 100644 vendor/k8s.io/client-go/plugin/pkg/client/auth/azure/azure_stub.go
 delete mode 100644 vendor/k8s.io/client-go/plugin/pkg/client/auth/gcp/OWNERS
 delete mode 100644 vendor/k8s.io/client-go/plugin/pkg/client/auth/gcp/gcp.go
 create mode 100644 vendor/k8s.io/client-go/plugin/pkg/client/auth/gcp/gcp_stub.go
 delete mode 100644 vendor/k8s.io/client-go/third_party/forked/golang/LICENSE
 delete mode 100644 vendor/k8s.io/client-go/third_party/forked/golang/PATENTS
 delete mode 100644 vendor/k8s.io/client-go/third_party/forked/golang/template/exec.go
 delete mode 100644 vendor/k8s.io/client-go/third_party/forked/golang/template/funcs.go
 delete mode 100644 vendor/k8s.io/client-go/util/jsonpath/doc.go
 delete mode 100644 vendor/k8s.io/client-go/util/jsonpath/jsonpath.go
 delete mode 100644 vendor/k8s.io/client-go/util/jsonpath/node.go
 delete mode 100644 vendor/k8s.io/client-go/util/jsonpath/parser.go
 create mode 100644 vendor/k8s.io/component-base/metrics/prometheusextension/timing_histogram.go
 create mode 100644 vendor/k8s.io/component-base/metrics/prometheusextension/timing_histogram_vec.go
 create mode 100644 vendor/k8s.io/component-base/metrics/prometheusextension/weighted_histogram.go
 create mode 100644 vendor/k8s.io/component-base/metrics/prometheusextension/weighted_histogram_vec.go
 create mode 100644 vendor/k8s.io/component-base/metrics/timing_histogram.go
 create mode 100644 vendor/k8s.io/kube-openapi/pkg/validation/spec/gnostic.go
 delete mode 100644 vendor/k8s.io/kubernetes/pkg/api/v1/service/util.go
 delete mode 100644 vendor/k8s.io/kubernetes/pkg/proxy/OWNERS
 delete mode 100644 vendor/k8s.io/kubernetes/pkg/proxy/config/OWNERS
 delete mode 100644 vendor/k8s.io/kubernetes/pkg/proxy/config/config.go
 delete mode 100644 vendor/k8s.io/kubernetes/pkg/proxy/config/doc.go
 delete mode 100644 vendor/k8s.io/kubernetes/pkg/proxy/doc.go
 delete mode 100644 vendor/k8s.io/kubernetes/pkg/proxy/endpoints.go
 delete mode 100644 vendor/k8s.io/kubernetes/pkg/proxy/endpointslicecache.go
 delete mode 100644 vendor/k8s.io/kubernetes/pkg/proxy/healthcheck/common.go
 delete mode 100644 vendor/k8s.io/kubernetes/pkg/proxy/healthcheck/doc.go
 delete mode 100644 vendor/k8s.io/kubernetes/pkg/proxy/healthcheck/proxier_health.go
 delete mode 100644 vendor/k8s.io/kubernetes/pkg/proxy/healthcheck/service_health.go
 delete mode 100644 vendor/k8s.io/kubernetes/pkg/proxy/iptables/OWNERS
 delete mode 100644 vendor/k8s.io/kubernetes/pkg/proxy/iptables/proxier.go
 delete mode 100644 vendor/k8s.io/kubernetes/pkg/proxy/metaproxier/meta_proxier.go
 delete mode 100644 vendor/k8s.io/kubernetes/pkg/proxy/metrics/metrics.go
 delete mode 100644 vendor/k8s.io/kubernetes/pkg/proxy/service.go
 delete mode 100644 vendor/k8s.io/kubernetes/pkg/proxy/topology.go
 delete mode 100644 vendor/k8s.io/kubernetes/pkg/proxy/types.go
 delete mode 100644 vendor/k8s.io/kubernetes/pkg/proxy/util/iptables/traffic.go
 delete mode 100644 vendor/k8s.io/kubernetes/pkg/util/async/bounded_frequency_runner.go
 delete mode 100644 vendor/k8s.io/kubernetes/pkg/util/async/runner.go
 delete mode 100644 vendor/k8s.io/kubernetes/pkg/util/conntrack/conntrack.go
+ set +o xtrace
########## FINISHED STAGE: SUCCESS: CLONE CRI-O AND CHECK OUT THE CORRECT REFS [00h 00m 20s] ##########
[workspace] $ /bin/bash /tmp/jenkins1553392102723617728.sh
########## STARTING STAGE: RUN THE CRI-O E2E FEATURES TESTS ##########
+ [[ -s /var/lib/jenkins/jobs/test_pull_request_crio_e2e_features_rhel/workspace/activate ]]
+ source /var/lib/jenkins/jobs/test_pull_request_crio_e2e_features_rhel/workspace/activate
++ export VIRTUAL_ENV=/var/lib/jenkins/origin-ci-tool/95a472392910104fc805c4ab8af39791105c956d
++ VIRTUAL_ENV=/var/lib/jenkins/origin-ci-tool/95a472392910104fc805c4ab8af39791105c956d
++ export PATH=/var/lib/jenkins/origin-ci-tool/95a472392910104fc805c4ab8af39791105c956d/bin:/sbin:/usr/sbin:/bin:/usr/bin
++ PATH=/var/lib/jenkins/origin-ci-tool/95a472392910104fc805c4ab8af39791105c956d/bin:/sbin:/usr/sbin:/bin:/usr/bin
++ unset PYTHON_HOME
++ export OCT_CONFIG_HOME=/var/lib/jenkins/jobs/test_pull_request_crio_e2e_features_rhel/workspace/.config
++ OCT_CONFIG_HOME=/var/lib/jenkins/jobs/test_pull_request_crio_e2e_features_rhel/workspace/.config
++ mktemp
+ script=/tmp/tmp.tJaQGdHZ8n
+ cat
+ chmod +x /tmp/tmp.tJaQGdHZ8n
+ scp -F /var/lib/jenkins/jobs/test_pull_request_crio_e2e_features_rhel/workspace/.config/origin-ci-tool/inventory/.ssh_config /tmp/tmp.tJaQGdHZ8n openshiftdevel:/tmp/tmp.tJaQGdHZ8n
+ ssh -F /var/lib/jenkins/jobs/test_pull_request_crio_e2e_features_rhel/workspace/.config/origin-ci-tool/inventory/.ssh_config -t openshiftdevel 'bash -l -c "timeout 21600 /tmp/tmp.tJaQGdHZ8n"'
+ cd /home/origin
+ ansible-playbook -vv --become -i localhost, --tags e2e-features --become-user root --connection local /go/src/github.com/cri-o/cri-o/contrib/test/integration/main.yml
ansible-playbook 2.4.2.0
  config file = /etc/ansible/ansible.cfg
  configured module search path = [u'/home/origin/.ansible/plugins/modules', u'/usr/share/ansible/plugins/modules']
  ansible python module location = /usr/lib/python2.7/site-packages/ansible
  executable location = /usr/bin/ansible-playbook
  python version = 2.7.5 (default, Aug 13 2020, 02:51:10) [GCC 4.8.5 20150623 (Red Hat 4.8.5-39)]
Using /etc/ansible/ansible.cfg as config file
[DEPRECATION WARNING]: The use of 'include' for tasks has been deprecated. Use 
'import_tasks' for static inclusions or 'include_tasks' for dynamic inclusions.
 This feature will be removed in a future release. Deprecation warnings can be 
disabled by setting deprecation_warnings=False in ansible.cfg.
[DEPRECATION WARNING]: include is kept for backwards compatibility but usage is
 discouraged. The module documentation details page may explain more about this
 rationale.. This feature will be removed in a future release. Deprecation 
warnings can be disabled by setting deprecation_warnings=False in ansible.cfg.
statically imported: /go/src/github.com/cri-o/cri-o/contrib/test/integration/system.yml
statically imported: /go/src/github.com/cri-o/cri-o/contrib/test/integration/system-packages.yml
statically imported: /go/src/github.com/cri-o/cri-o/contrib/test/integration/python3.yml
statically imported: /go/src/github.com/cri-o/cri-o/contrib/test/integration/golang.yml
statically imported: /go/src/github.com/cri-o/cri-o/contrib/test/integration/build/bats.yml
statically imported: /go/src/github.com/cri-o/cri-o/contrib/test/integration/build/cri-tools.yml
statically imported: /go/src/github.com/cri-o/cri-o/contrib/test/integration/build/kubernetes.yml
statically imported: /go/src/github.com/cri-o/cri-o/contrib/test/integration/build/kubernetes.yml
statically imported: /go/src/github.com/cri-o/cri-o/contrib/test/integration/build/kubetest.yml
statically imported: /go/src/github.com/cri-o/cri-o/contrib/test/integration/build/runc.yml
statically imported: /go/src/github.com/cri-o/cri-o/contrib/test/integration/build/crun.yml
statically imported: /go/src/github.com/cri-o/cri-o/contrib/test/integration/build/kata.yml
statically imported: /go/src/github.com/cri-o/cri-o/contrib/test/integration/build/plugins.yml
statically imported: /go/src/github.com/cri-o/cri-o/contrib/test/integration/build/jq.yml
statically imported: /go/src/github.com/cri-o/cri-o/contrib/test/integration/golang.yml
statically imported: /go/src/github.com/cri-o/cri-o/contrib/test/integration/build/cri-o.yml
statically imported: /go/src/github.com/cri-o/cri-o/contrib/test/integration/build/jq.yml
statically imported: /go/src/github.com/cri-o/cri-o/contrib/test/integration/build/crun.yml
statically imported: /go/src/github.com/cri-o/cri-o/contrib/test/integration/build/runc.yml
statically imported: /go/src/github.com/cri-o/cri-o/contrib/test/integration/build/kata.yml
statically imported: /go/src/github.com/cri-o/cri-o/contrib/test/integration/build/parallel.yml
statically imported: /go/src/github.com/cri-o/cri-o/contrib/test/integration/python3.yml
statically imported: /go/src/github.com/cri-o/cri-o/contrib/test/integration/build/bats.yml
statically imported: /go/src/github.com/cri-o/cri-o/contrib/test/integration/build/cri-tools.yml
statically imported: /go/src/github.com/cri-o/cri-o/contrib/test/integration/test.yml
statically imported: /go/src/github.com/cri-o/cri-o/contrib/test/integration/build/cri-tools.yml
statically imported: /go/src/github.com/cri-o/cri-o/contrib/test/integration/critest.yml
statically imported: /go/src/github.com/cri-o/cri-o/contrib/test/integration/build/kubernetes.yml
statically imported: /go/src/github.com/cri-o/cri-o/contrib/test/integration/build/kubetest.yml
statically imported: /go/src/github.com/cri-o/cri-o/contrib/test/integration/e2e.yml
statically imported: /go/src/github.com/cri-o/cri-o/contrib/test/integration/e2e-base.yml
statically imported: /go/src/github.com/cri-o/cri-o/contrib/test/integration/build/kubernetes.yml
statically imported: /go/src/github.com/cri-o/cri-o/contrib/test/integration/build/kubernetes.yml
statically imported: /go/src/github.com/cri-o/cri-o/contrib/test/integration/build/kubetest.yml
statically imported: /go/src/github.com/cri-o/cri-o/contrib/test/integration/e2e-features.yml
statically imported: /go/src/github.com/cri-o/cri-o/contrib/test/integration/e2e-base.yml

PLAYBOOK: main.yml *************************************************************
6 plays in /go/src/github.com/cri-o/cri-o/contrib/test/integration/main.yml

PLAY [all] *********************************************************************

TASK [Gathering Facts] *********************************************************
ok: [localhost]
META: ran handlers
META: ran handlers
META: ran handlers

PLAY [all] *********************************************************************

TASK [Gathering Facts] *********************************************************
ok: [localhost]
META: ran handlers

TASK [ensure Golang dir is empty first] ****************************************
task path: /go/src/github.com/cri-o/cri-o/contrib/test/integration/golang.yml:3
changed: [localhost] => {"changed": true, "path": "/usr/local/go", "state": "absent"}

TASK [fetch Golang] ************************************************************
task path: /go/src/github.com/cri-o/cri-o/contrib/test/integration/golang.yml:8
changed: [localhost] => {"changed": true, "dest": "/usr/local", "extract_results": {"cmd": ["/bin/gtar", "--extract", "-C", "/usr/local", "-z", "-f", "/tmp/ansible_w06j92/go1.18.1.linux-amd64.tar.gz"], "err": "", "out": "", "rc": 0}, "gid": 0, "group": "root", "handler": "TgzArchive", "mode": "0755", "owner": "root", "secontext": "system_u:object_r:usr_t:s0", "size": 141, "src": "/tmp/ansible_w06j92/go1.18.1.linux-amd64.tar.gz", "state": "directory", "uid": 0}

TASK [link go toolchain] *******************************************************
task path: /go/src/github.com/cri-o/cri-o/contrib/test/integration/golang.yml:14
ok: [localhost] => (item=go) => {"changed": false, "dest": "/usr/bin/go", "gid": 0, "group": "root", "item": "go", "mode": "0777", "owner": "root", "secontext": "unconfined_u:object_r:bin_t:s0", "size": 20, "src": "/usr/local/go/bin/go", "state": "link", "uid": 0}
ok: [localhost] => (item=gofmt) => {"changed": false, "dest": "/usr/bin/gofmt", "gid": 0, "group": "root", "item": "gofmt", "mode": "0777", "owner": "root", "secontext": "unconfined_u:object_r:bin_t:s0", "size": 23, "src": "/usr/local/go/bin/gofmt", "state": "link", "uid": 0}

TASK [ensure user profile exists] **********************************************
task path: /go/src/github.com/cri-o/cri-o/contrib/test/integration/golang.yml:23
changed: [localhost] => {"changed": true, "dest": "/root/.profile", "gid": 0, "group": "root", "mode": "0644", "owner": "root", "secontext": "unconfined_u:object_r:admin_home_t:s0", "size": 97, "state": "file", "uid": 0}

TASK [set up PATH for Go toolchain and built binaries] *************************
task path: /go/src/github.com/cri-o/cri-o/contrib/test/integration/golang.yml:28
changed: [localhost] => {"backup": "", "changed": true, "msg": "line replaced"}

TASK [set up directories] ******************************************************
task path: /go/src/github.com/cri-o/cri-o/contrib/test/integration/golang.yml:37
ok: [localhost] => (item=/go/src/github.com/containernetworking) => {"changed": false, "gid": 0, "group": "root", "item": "/go/src/github.com/containernetworking", "mode": "0755", "owner": "root", "path": "/go/src/github.com/containernetworking", "secontext": "unconfined_u:object_r:default_t:s0", "size": 21, "state": "directory", "uid": 0}
ok: [localhost] => (item=/go/src/github.com/kubernetes-incubator) => {"changed": false, "gid": 0, "group": "root", "item": "/go/src/github.com/kubernetes-incubator", "mode": "0755", "owner": "root", "path": "/go/src/github.com/kubernetes-incubator", "secontext": "unconfined_u:object_r:default_t:s0", "size": 6, "state": "directory", "uid": 0}
ok: [localhost] => (item=/go/src/github.com/kubernetes-sigs) => {"changed": false, "gid": 0, "group": "root", "item": "/go/src/github.com/kubernetes-sigs", "mode": "0755", "owner": "root", "path": "/go/src/github.com/kubernetes-sigs", "secontext": "unconfined_u:object_r:default_t:s0", "size": 23, "state": "directory", "uid": 0}
ok: [localhost] => (item=/go/src/github.com/cri-o) => {"changed": false, "gid": 1001, "group": "origin", "item": "/go/src/github.com/cri-o", "mode": "0775", "owner": "origin", "path": "/go/src/github.com/cri-o", "secontext": "unconfined_u:object_r:default_t:s0", "size": 19, "state": "directory", "uid": 1001}
ok: [localhost] => (item=/go/src/github.com/k8s.io) => {"changed": false, "gid": 0, "group": "root", "item": "/go/src/github.com/k8s.io", "mode": "0755", "owner": "root", "path": "/go/src/github.com/k8s.io", "secontext": "unconfined_u:object_r:default_t:s0", "size": 6, "state": "directory", "uid": 0}
ok: [localhost] => (item=/go/src/github.com/bats-core) => {"changed": false, "gid": 0, "group": "root", "item": "/go/src/github.com/bats-core", "mode": "0755", "owner": "root", "path": "/go/src/github.com/bats-core", "secontext": "unconfined_u:object_r:default_t:s0", "size": 23, "state": "directory", "uid": 0}
ok: [localhost] => (item=/go/src/github.com/opencontainers) => {"changed": false, "gid": 0, "group": "root", "item": "/go/src/github.com/opencontainers", "mode": "0755", "owner": "root", "path": "/go/src/github.com/opencontainers", "secontext": "unconfined_u:object_r:default_t:s0", "size": 18, "state": "directory", "uid": 0}
ok: [localhost] => (item=/go/src/k8s.io/test-infra) => {"changed": false, "gid": 0, "group": "root", "item": "/go/src/k8s.io/test-infra", "mode": "0755", "owner": "root", "path": "/go/src/k8s.io/test-infra", "secontext": "unconfined_u:object_r:default_t:s0", "size": 4096, "state": "directory", "uid": 0}

TASK [install Go tools and dependencies] ***************************************
task path: /go/src/github.com/cri-o/cri-o/contrib/test/integration/golang.yml:51
changed: [localhost] => (item=onsi/ginkgo/ginkgo) => {"changed": true, "cmd": "go install \"github.com/onsi/ginkgo/ginkgo@latest\"", "delta": "0:00:10.145764", "end": "2022-07-02 03:43:15.863271", "item": "onsi/ginkgo/ginkgo", "rc": 0, "start": "2022-07-02 03:43:05.717507", "stderr": "go: downloading github.com/onsi/ginkgo v1.16.5\ngo: downloading github.com/go-task/slim-sprig v0.0.0-20210107165309-348f09dbbbc0\ngo: downloading golang.org/x/tools v0.0.0-20201224043029-2b0845dc783e\ngo: downloading github.com/nxadm/tail v1.4.8\ngo: downloading golang.org/x/sys v0.0.0-20210112080510-489259a85091\ngo: downloading gopkg.in/tomb.v1 v1.0.0-20141024135613-dd632973f1e7\ngo: downloading github.com/fsnotify/fsnotify v1.4.9", "stderr_lines": ["go: downloading github.com/onsi/ginkgo v1.16.5", "go: downloading github.com/go-task/slim-sprig v0.0.0-20210107165309-348f09dbbbc0", "go: downloading golang.org/x/tools v0.0.0-20201224043029-2b0845dc783e", "go: downloading github.com/nxadm/tail v1.4.8", "go: downloading golang.org/x/sys v0.0.0-20210112080510-489259a85091", "go: downloading gopkg.in/tomb.v1 v1.0.0-20141024135613-dd632973f1e7", "go: downloading github.com/fsnotify/fsnotify v1.4.9"], "stdout": "", "stdout_lines": []}

TASK [stat the expected cri-o directory] ***************************************
task path: /go/src/github.com/cri-o/cri-o/contrib/test/integration/build/cri-o.yml:3
ok: [localhost] => {"changed": false, "stat": {"atime": 1613511762.7911787, "attr_flags": "", "attributes": [], "block_size": 4096, "blocks": 8, "charset": "binary", "ctime": 1656733359.3381462, "dev": 51714, "device_type": 0, "executable": true, "exists": true, "gid": 1001, "gr_name": "origin", "inode": 79692123, "isblk": false, "ischr": false, "isdir": true, "isfifo": false, "isgid": false, "islnk": false, "isreg": false, "issock": false, "isuid": false, "mimetype": "inode/directory", "mode": "0775", "mtime": 1656733359.3381462, "nlink": 24, "path": "/go/src/github.com/cri-o/cri-o", "pw_name": "origin", "readable": true, "rgrp": true, "roth": true, "rusr": true, "size": 4096, "uid": 1001, "version": "90638301", "wgrp": true, "woth": false, "writeable": true, "wusr": true, "xgrp": true, "xoth": true, "xusr": true}}

TASK [expect cri-o to be cloned already] ***************************************
task path: /go/src/github.com/cri-o/cri-o/contrib/test/integration/build/cri-o.yml:8
skipping: [localhost] => {"changed": false, "skip_reason": "Conditional result was False"}

TASK [build cri-o] *************************************************************
task path: /go/src/github.com/cri-o/cri-o/contrib/test/integration/build/cri-o.yml:13
changed: [localhost] => {"changed": true, "chdir": "/go/src/github.com/cri-o/cri-o", "params": null, "stderr": "time=\"2022-07-02T03:57:32Z\" level=warning msg=\"Failed to decode the keys [\\\"storage.options.override_kernel_check\\\"] from \\\"/etc/containers/storage.conf\\\".\"\ntime=\"2022-07-02 03:57:32.708254286Z\" level=info msg=\"Starting CRI-O, version: 1.25.0, git: f9c9f4211acb3962dde011200b3c8edb555aac6e(clean)\"\nlevel=info msg=\"Using default capabilities: CAP_CHOWN, CAP_DAC_OVERRIDE, CAP_FSETID, CAP_FOWNER, CAP_SETGID, CAP_SETUID, CAP_SETPCAP, CAP_NET_BIND_SERVICE, CAP_KILL\"", "stderr_lines": ["time=\"2022-07-02T03:57:32Z\" level=warning msg=\"Failed to decode the keys [\\\"storage.options.override_kernel_check\\\"] from \\\"/etc/containers/storage.conf\\\".\"", "time=\"2022-07-02 03:57:32.708254286Z\" level=info msg=\"Starting CRI-O, version: 1.25.0, git: f9c9f4211acb3962dde011200b3c8edb555aac6e(clean)\"", "level=info msg=\"Using default capabilities: CAP_CHOWN, CAP_DAC_OVERRIDE, CAP_FSETID, CAP_FOWNER, CAP_SETGID, CAP_SETUID, CAP_SETPCAP, CAP_NET_BIND_SERVICE, CAP_KILL\""], "stdout": "if [ ! -d \"/go\" ]; then mkdir -p /go; fi\ntouch \"/go/.gopathok\"\ngo build  -trimpath  -ldflags '-s -w -X github.com/cri-o/cri-o/internal/pkg/criocli.DefaultsPath=\"\" -X github.com/cri-o/cri-o/internal/version.buildDate='2022-07-02T03:55:00Z' ' -tags \"containers_image_ostree_stub  exclude_graphdriver_btrfs btrfs_noversion   containers_image_openpgp seccomp selinux \" -o bin/crio github.com/cri-o/cri-o/cmd/crio\ngo build  -trimpath  -ldflags '-s -w -X github.com/cri-o/cri-o/internal/pkg/criocli.DefaultsPath=\"\" -X github.com/cri-o/cri-o/internal/version.buildDate='2022-07-02T03:57:26Z' ' -tags \"containers_image_ostree_stub  exclude_graphdriver_btrfs btrfs_noversion   containers_image_openpgp seccomp selinux \" -o bin/crio-status github.com/cri-o/cri-o/cmd/crio-status\n/bin/make -C pinns\nmake[1]: Entering directory `/go/src/github.com/cri-o/cri-o/pinns'\ncc -std=c99 -Os -Wall -Werror -Wextra -static -O3 -o src/sysctl.o -c src/sysctl.c\ncc -std=c99 -Os -Wall -Werror -Wextra -static -O3 -o src/pinns.o -c src/pinns.c\ncc -o ../bin/pinns src/sysctl.o src/pinns.o -std=c99 -Os -Wall -Werror -Wextra -static  \nstrip -s ../bin/pinns\nmake[1]: Leaving directory `/go/src/github.com/cri-o/cri-o/pinns'\n./bin/crio -d \"\" --config=\"\"  config > crio.conf\n(/go/src/github.com/cri-o/cri-o/build/bin/go-md2man -in docs/crio-status.8.md -out docs/crio-status.8.tmp && touch docs/crio-status.8.tmp && mv docs/crio-status.8.tmp docs/crio-status.8) || \\\n\t(/go/src/github.com/cri-o/cri-o/build/bin/go-md2man -in docs/crio-status.8.md -out docs/crio-status.8.tmp && touch docs/crio-status.8.tmp && mv docs/crio-status.8.tmp docs/crio-status.8)\n(/go/src/github.com/cri-o/cri-o/build/bin/go-md2man -in docs/crio.conf.5.md -out docs/crio.conf.5.tmp && touch docs/crio.conf.5.tmp && mv docs/crio.conf.5.tmp docs/crio.conf.5) || \\\n\t(/go/src/github.com/cri-o/cri-o/build/bin/go-md2man -in docs/crio.conf.5.md -out docs/crio.conf.5.tmp && touch docs/crio.conf.5.tmp && mv docs/crio.conf.5.tmp docs/crio.conf.5)\n(/go/src/github.com/cri-o/cri-o/build/bin/go-md2man -in docs/crio.conf.d.5.md -out docs/crio.conf.d.5.tmp && touch docs/crio.conf.d.5.tmp && mv docs/crio.conf.d.5.tmp docs/crio.conf.d.5) || \\\n\t(/go/src/github.com/cri-o/cri-o/build/bin/go-md2man -in docs/crio.conf.d.5.md -out docs/crio.conf.d.5.tmp && touch docs/crio.conf.d.5.tmp && mv docs/crio.conf.d.5.tmp docs/crio.conf.d.5)\n(/go/src/github.com/cri-o/cri-o/build/bin/go-md2man -in docs/crio.8.md -out docs/crio.8.tmp && touch docs/crio.8.tmp && mv docs/crio.8.tmp docs/crio.8) || \\\n\t(/go/src/github.com/cri-o/cri-o/build/bin/go-md2man -in docs/crio.8.md -out docs/crio.8.tmp && touch docs/crio.8.tmp && mv docs/crio.8.tmp docs/crio.8)", "stdout_lines": ["if [ ! -d \"/go\" ]; then mkdir -p /go; fi", "touch \"/go/.gopathok\"", "go build  -trimpath  -ldflags '-s -w -X github.com/cri-o/cri-o/internal/pkg/criocli.DefaultsPath=\"\" -X github.com/cri-o/cri-o/internal/version.buildDate='2022-07-02T03:55:00Z' ' -tags \"containers_image_ostree_stub  exclude_graphdriver_btrfs btrfs_noversion   containers_image_openpgp seccomp selinux \" -o bin/crio github.com/cri-o/cri-o/cmd/crio", "go build  -trimpath  -ldflags '-s -w -X github.com/cri-o/cri-o/internal/pkg/criocli.DefaultsPath=\"\" -X github.com/cri-o/cri-o/internal/version.buildDate='2022-07-02T03:57:26Z' ' -tags \"containers_image_ostree_stub  exclude_graphdriver_btrfs btrfs_noversion   containers_image_openpgp seccomp selinux \" -o bin/crio-status github.com/cri-o/cri-o/cmd/crio-status", "/bin/make -C pinns", "make[1]: Entering directory `/go/src/github.com/cri-o/cri-o/pinns'", "cc -std=c99 -Os -Wall -Werror -Wextra -static -O3 -o src/sysctl.o -c src/sysctl.c", "cc -std=c99 -Os -Wall -Werror -Wextra -static -O3 -o src/pinns.o -c src/pinns.c", "cc -o ../bin/pinns src/sysctl.o src/pinns.o -std=c99 -Os -Wall -Werror -Wextra -static  ", "strip -s ../bin/pinns", "make[1]: Leaving directory `/go/src/github.com/cri-o/cri-o/pinns'", "./bin/crio -d \"\" --config=\"\"  config > crio.conf", "(/go/src/github.com/cri-o/cri-o/build/bin/go-md2man -in docs/crio-status.8.md -out docs/crio-status.8.tmp && touch docs/crio-status.8.tmp && mv docs/crio-status.8.tmp docs/crio-status.8) || \\", "\t(/go/src/github.com/cri-o/cri-o/build/bin/go-md2man -in docs/crio-status.8.md -out docs/crio-status.8.tmp && touch docs/crio-status.8.tmp && mv docs/crio-status.8.tmp docs/crio-status.8)", "(/go/src/github.com/cri-o/cri-o/build/bin/go-md2man -in docs/crio.conf.5.md -out docs/crio.conf.5.tmp && touch docs/crio.conf.5.tmp && mv docs/crio.conf.5.tmp docs/crio.conf.5) || \\", "\t(/go/src/github.com/cri-o/cri-o/build/bin/go-md2man -in docs/crio.conf.5.md -out docs/crio.conf.5.tmp && touch docs/crio.conf.5.tmp && mv docs/crio.conf.5.tmp docs/crio.conf.5)", "(/go/src/github.com/cri-o/cri-o/build/bin/go-md2man -in docs/crio.conf.d.5.md -out docs/crio.conf.d.5.tmp && touch docs/crio.conf.d.5.tmp && mv docs/crio.conf.d.5.tmp docs/crio.conf.d.5) || \\", "\t(/go/src/github.com/cri-o/cri-o/build/bin/go-md2man -in docs/crio.conf.d.5.md -out docs/crio.conf.d.5.tmp && touch docs/crio.conf.d.5.tmp && mv docs/crio.conf.d.5.tmp docs/crio.conf.d.5)", "(/go/src/github.com/cri-o/cri-o/build/bin/go-md2man -in docs/crio.8.md -out docs/crio.8.tmp && touch docs/crio.8.tmp && mv docs/crio.8.tmp docs/crio.8) || \\", "\t(/go/src/github.com/cri-o/cri-o/build/bin/go-md2man -in docs/crio.8.md -out docs/crio.8.tmp && touch docs/crio.8.tmp && mv docs/crio.8.tmp docs/crio.8)"], "target": null}

TASK [link pinns] **************************************************************
task path: /go/src/github.com/cri-o/cri-o/contrib/test/integration/build/cri-o.yml:17
changed: [localhost] => {"changed": true, "dest": "/bin/pinns", "gid": 0, "group": "root", "mode": "0777", "owner": "root", "secontext": "unconfined_u:object_r:bin_t:s0", "size": 40, "src": "/go/src/github.com/cri-o/cri-o/bin/pinns", "state": "link", "uid": 0}

TASK [set RestartPolicy in systemd unit appropriate for tests] *****************
task path: /go/src/github.com/cri-o/cri-o/contrib/test/integration/build/cri-o.yml:23
changed: [localhost] => {"backup": "", "changed": true, "msg": "line replaced"}

TASK [install cri-o] ***********************************************************
task path: /go/src/github.com/cri-o/cri-o/contrib/test/integration/build/cri-o.yml:29
changed: [localhost] => {"changed": true, "chdir": "/go/src/github.com/cri-o/cri-o", "params": null, "stderr": "", "stderr_lines": [], "stdout": "/bin/make -C pinns\nmake[1]: Entering directory `/go/src/github.com/cri-o/cri-o/pinns'\nmake[1]: Nothing to be done for `all'.\nmake[1]: Leaving directory `/go/src/github.com/cri-o/cri-o/pinns'\ninstall -Z -D -m 755 bin/crio /usr/local/bin/crio\ninstall -Z -D -m 755 bin/crio-status /usr/local/bin/crio-status\ninstall -Z -D -m 755 bin/pinns /usr/local/bin/pinns\ninstall -Z -d -m 755 /usr/local/share/man/man5\ninstall -Z -d -m 755 /usr/local/share/man/man8\ninstall -Z -m 644 docs/crio.conf.5 docs/crio.conf.d.5 -t /usr/local/share/man/man5\ninstall -Z -m 644 docs/crio-status.8 docs/crio.8 -t /usr/local/share/man/man8\ninstall -Z -d -m 755 /usr/local/share/bash-completion/completions\ninstall -Z -d -m 755 /usr/local/share/fish/completions\ninstall -Z -d -m 755 /usr/local/share/zsh/site-functions\ninstall -Z -D -m 644 -t /usr/local/share/bash-completion/completions completions/bash/crio\ninstall -Z -D -m 644 -t /usr/local/share/fish/completions completions/fish/crio.fish\ninstall -Z -D -m 644 -t /usr/local/share/zsh/site-functions  completions/zsh/_crio\ninstall -Z -D -m 644 -t /usr/local/share/bash-completion/completions completions/bash/crio-status\ninstall -Z -D -m 644 -t /usr/local/share/fish/completions completions/fish/crio-status.fish\ninstall -Z -D -m 644 -t /usr/local/share/zsh/site-functions  completions/zsh/_crio-status\ninstall -Z -D -m 644 contrib/systemd/crio.service /usr/local/lib/systemd/system/crio.service\ninstall -Z -D -m 644 contrib/systemd/crio-wipe.service /usr/local/lib/systemd/system/crio-wipe.service\ninstall -Z -d /usr/local/share/containers/oci/hooks.d\ninstall -Z -d /etc/crio/crio.conf.d\ninstall -Z -D -m 644 crio.conf /etc/crio/crio.conf\ninstall -Z -D -m 644 crio-umount.conf /usr/local/share/oci-umount/oci-umount.d/crio-umount.conf\ninstall -Z -D -m 644 crictl.yaml /etc", "stdout_lines": ["/bin/make -C pinns", "make[1]: Entering directory `/go/src/github.com/cri-o/cri-o/pinns'", "make[1]: Nothing to be done for `all'.", "make[1]: Leaving directory `/go/src/github.com/cri-o/cri-o/pinns'", "install -Z -D -m 755 bin/crio /usr/local/bin/crio", "install -Z -D -m 755 bin/crio-status /usr/local/bin/crio-status", "install -Z -D -m 755 bin/pinns /usr/local/bin/pinns", "install -Z -d -m 755 /usr/local/share/man/man5", "install -Z -d -m 755 /usr/local/share/man/man8", "install -Z -m 644 docs/crio.conf.5 docs/crio.conf.d.5 -t /usr/local/share/man/man5", "install -Z -m 644 docs/crio-status.8 docs/crio.8 -t /usr/local/share/man/man8", "install -Z -d -m 755 /usr/local/share/bash-completion/completions", "install -Z -d -m 755 /usr/local/share/fish/completions", "install -Z -d -m 755 /usr/local/share/zsh/site-functions", "install -Z -D -m 644 -t /usr/local/share/bash-completion/completions completions/bash/crio", "install -Z -D -m 644 -t /usr/local/share/fish/completions completions/fish/crio.fish", "install -Z -D -m 644 -t /usr/local/share/zsh/site-functions  completions/zsh/_crio", "install -Z -D -m 644 -t /usr/local/share/bash-completion/completions completions/bash/crio-status", "install -Z -D -m 644 -t /usr/local/share/fish/completions completions/fish/crio-status.fish", "install -Z -D -m 644 -t /usr/local/share/zsh/site-functions  completions/zsh/_crio-status", "install -Z -D -m 644 contrib/systemd/crio.service /usr/local/lib/systemd/system/crio.service", "install -Z -D -m 644 contrib/systemd/crio-wipe.service /usr/local/lib/systemd/system/crio-wipe.service", "install -Z -d /usr/local/share/containers/oci/hooks.d", "install -Z -d /etc/crio/crio.conf.d", "install -Z -D -m 644 crio.conf /etc/crio/crio.conf", "install -Z -D -m 644 crio-umount.conf /usr/local/share/oci-umount/oci-umount.d/crio-umount.conf", "install -Z -D -m 644 crictl.yaml /etc"], "target": "install"}

TASK [set manage network ns lifecycle and drop infra] **************************
task path: /go/src/github.com/cri-o/cri-o/contrib/test/integration/build/cri-o.yml:34
changed: [localhost] => {"changed": true, "checksum": "30fac5adc641b03336f6c51c1e87021307a5730b", "dest": "/etc/crio/crio.conf.d/01-ns-lifecycle.conf", "gid": 0, "group": "root", "md5sum": "9c43a235ddbf3a00264bb3e7b63186e2", "mode": "0644", "owner": "root", "secontext": "system_u:object_r:container_config_t:s0", "size": 64, "src": "/home/origin/.ansible/tmp/ansible-tmp-1656734943.95-132482879781520/source", "state": "file", "uid": 0}

TASK [use crun] ****************************************************************
task path: /go/src/github.com/cri-o/cri-o/contrib/test/integration/build/cri-o.yml:42
skipping: [localhost] => {"changed": false, "skip_reason": "Conditional result was False"}

TASK [use kata] ****************************************************************
task path: /go/src/github.com/cri-o/cri-o/contrib/test/integration/build/cri-o.yml:51
skipping: [localhost] => {"changed": false, "skip_reason": "Conditional result was False"}

TASK [install configs] *********************************************************
task path: /go/src/github.com/cri-o/cri-o/contrib/test/integration/build/cri-o.yml:63
changed: [localhost] => (item={u'dest': u'/etc/cni/net.d/10-crio-bridge.conf', u'src': u'contrib/cni/10-crio-bridge.conf'}) => {"changed": true, "checksum": "f02fc9546988db3da8fd15ca847f1f687c45d28f", "dest": "/etc/cni/net.d/10-crio-bridge.conf", "gid": 0, "group": "root", "item": {"dest": "/etc/cni/net.d/10-crio-bridge.conf", "src": "contrib/cni/10-crio-bridge.conf"}, "md5sum": "166dad5c7f744b8ef89db0d257dedb3c", "mode": "0644", "owner": "root", "secontext": "system_u:object_r:etc_t:s0", "size": 438, "src": "/go/src/github.com/cri-o/cri-o/contrib/cni/10-crio-bridge.conf", "state": "file", "uid": 0}
changed: [localhost] => (item={u'dest': u'/etc/cni/net.d/99-loopback.conf', u'src': u'contrib/cni/99-loopback.conf'}) => {"changed": true, "checksum": "c9669aa8c89717afc5ddbef5611b81e0f56401d3", "dest": "/etc/cni/net.d/99-loopback.conf", "gid": 0, "group": "root", "item": {"dest": "/etc/cni/net.d/99-loopback.conf", "src": "contrib/cni/99-loopback.conf"}, "md5sum": "395cf6671edceebafc3602c73d8647dd", "mode": "0644", "owner": "root", "secontext": "system_u:object_r:etc_t:s0", "size": 54, "src": "/go/src/github.com/cri-o/cri-o/contrib/cni/99-loopback.conf", "state": "file", "uid": 0}
changed: [localhost] => (item={u'dest': u'/etc/containers/registries.d/registry.access.redhat.com.yaml', u'src': u'test/redhat_sigstore.yaml'}) => {"changed": true, "checksum": "7fb85b838ce225307dcc630fd6bbaf3b5b3c159a", "dest": "/etc/containers/registries.d/registry.access.redhat.com.yaml", "gid": 0, "group": "root", "item": {"dest": "/etc/containers/registries.d/registry.access.redhat.com.yaml", "src": "test/redhat_sigstore.yaml"}, "md5sum": "c458a83d3c9e915490cb78e7da481731", "mode": "0644", "owner": "root", "secontext": "system_u:object_r:etc_t:s0", "size": 112, "src": "/go/src/github.com/cri-o/cri-o/test/redhat_sigstore.yaml", "state": "file", "uid": 0}

TASK [run with overlay] ********************************************************
task path: /go/src/github.com/cri-o/cri-o/contrib/test/integration/build/cri-o.yml:76
changed: [localhost] => {"changed": true, "checksum": "8ba9b88fae016d5f0ac1fbe2dc4dd8788f255906", "dest": "/etc/crio/crio.conf.d/01-overlay.conf", "gid": 0, "group": "root", "md5sum": "941d62d3e35f856e260abe9dcb940516", "mode": "0644", "owner": "root", "secontext": "system_u:object_r:container_config_t:s0", "size": 34, "src": "/home/origin/.ansible/tmp/ansible-tmp-1656734945.07-117910815697831/source", "state": "file", "uid": 0}

TASK [add quay.io and docker.io as default registries] *************************
task path: /go/src/github.com/cri-o/cri-o/contrib/test/integration/build/cri-o.yml:83
changed: [localhost] => {"changed": true, "checksum": "c5dae4dd339971de6933e35ae2bde2226a5f2f42", "dest": "/etc/crio/crio.conf.d/01-registries.conf", "gid": 0, "group": "root", "md5sum": "52494863d04fa64de6927b7cce03c937", "mode": "0644", "owner": "root", "secontext": "system_u:object_r:container_config_t:s0", "size": 53, "src": "/home/origin/.ansible/tmp/ansible-tmp-1656734945.42-244620927018558/source", "state": "file", "uid": 0}

TASK [remove storage.conf to avoid configuration conflicts] ********************
task path: /go/src/github.com/cri-o/cri-o/contrib/test/integration/build/cri-o.yml:90
changed: [localhost] => {"changed": true, "path": "/etc/containers/storage.conf", "state": "absent"}

TASK [install jq] **************************************************************
task path: /go/src/github.com/cri-o/cri-o/contrib/test/integration/build/jq.yml:2
ok: [localhost] => {"changed": false, "dest": "/usr/bin/jq", "gid": 0, "group": "root", "mode": "0775", "msg": "file already exists", "owner": "root", "secontext": "system_u:object_r:bin_t:s0", "size": 3953824, "state": "file", "uid": 0, "url": "https://github.com/stedolan/jq/releases/download/jq-1.6/jq-linux64"}

TASK [clone crun source repo] **************************************************
task path: /go/src/github.com/cri-o/cri-o/contrib/test/integration/build/crun.yml:3
skipping: [localhost] => {"changed": false, "skip_reason": "Conditional result was False"}

TASK [Install crun dependencies] ***********************************************
task path: /go/src/github.com/cri-o/cri-o/contrib/test/integration/build/crun.yml:10
skipping: [localhost] => {"changed": false, "skip_reason": "Conditional result was False"}

TASK [Run autogen.sh] **********************************************************
task path: /go/src/github.com/cri-o/cri-o/contrib/test/integration/build/crun.yml:31
skipping: [localhost] => {"changed": false, "skip_reason": "Conditional result was False"}

TASK [Run configure] ***********************************************************
task path: /go/src/github.com/cri-o/cri-o/contrib/test/integration/build/crun.yml:36
skipping: [localhost] => {"changed": false, "skip_reason": "Conditional result was False"}

TASK [run crun clean] **********************************************************
task path: /go/src/github.com/cri-o/cri-o/contrib/test/integration/build/crun.yml:41
skipping: [localhost] => {"changed": false, "skip_reason": "Conditional result was False"}

TASK [build crun] **************************************************************
task path: /go/src/github.com/cri-o/cri-o/contrib/test/integration/build/crun.yml:46
skipping: [localhost] => {"changed": false, "skip_reason": "Conditional result was False"}

TASK [install crun] ************************************************************
task path: /go/src/github.com/cri-o/cri-o/contrib/test/integration/build/crun.yml:50
skipping: [localhost] => {"changed": false, "skip_reason": "Conditional result was False"}

TASK [remove old runc binary] **************************************************
task path: /go/src/github.com/cri-o/cri-o/contrib/test/integration/build/crun.yml:55
skipping: [localhost] => {"changed": false, "skip_reason": "Conditional result was False"}

TASK [remove old runc binary under /usr/local/bin] *****************************
task path: /go/src/github.com/cri-o/cri-o/contrib/test/integration/build/crun.yml:60
skipping: [localhost] => {"changed": false, "skip_reason": "Conditional result was False"}

TASK [remove old runc binary under /usr/local/sbin] ****************************
task path: /go/src/github.com/cri-o/cri-o/contrib/test/integration/build/crun.yml:65
skipping: [localhost] => {"changed": false, "skip_reason": "Conditional result was False"}

TASK [crun state directory] ****************************************************
task path: /go/src/github.com/cri-o/cri-o/contrib/test/integration/build/crun.yml:70
skipping: [localhost] => {"changed": false, "skip_reason": "Conditional result was False"}

TASK [crun state directory] ****************************************************
task path: /go/src/github.com/cri-o/cri-o/contrib/test/integration/build/crun.yml:75
skipping: [localhost] => {"changed": false, "skip_reason": "Conditional result was False"}

TASK [link crun] ***************************************************************
task path: /go/src/github.com/cri-o/cri-o/contrib/test/integration/build/crun.yml:82
skipping: [localhost] => {"changed": false, "skip_reason": "Conditional result was False"}

TASK [link crun to /usr/local/bin] *********************************************
task path: /go/src/github.com/cri-o/cri-o/contrib/test/integration/build/crun.yml:89
skipping: [localhost] => {"changed": false, "skip_reason": "Conditional result was False"}

TASK [clone runc source repo] **************************************************
task path: /go/src/github.com/cri-o/cri-o/contrib/test/integration/build/runc.yml:3
changed: [localhost] => {"after": "eca233d286e8410d8c41119fc1f55ddf13590c00", "before": "824e4ad3b86a598245121df19484fa13bb0cba24", "changed": true, "remote_url_changed": false}

TASK [build runc] **************************************************************
task path: /go/src/github.com/cri-o/cri-o/contrib/test/integration/build/runc.yml:9
changed: [localhost] => {"changed": true, "chdir": "/go/src/github.com/opencontainers/runc", "params": null, "stderr": "", "stderr_lines": [], "stdout": "go build -trimpath \"-buildmode=pie\"  -tags \"seccomp urfave_cli_no_docs\" -ldflags \"-X main.gitCommit=v1.1.0-231-geca233d -X main.version=1.1.0+dev \" -o runc .", "stdout_lines": ["go build -trimpath \"-buildmode=pie\"  -tags \"seccomp urfave_cli_no_docs\" -ldflags \"-X main.gitCommit=v1.1.0-231-geca233d -X main.version=1.1.0+dev \" -o runc ."], "target": null}

TASK [install runc] ************************************************************
task path: /go/src/github.com/cri-o/cri-o/contrib/test/integration/build/runc.yml:13
changed: [localhost] => {"changed": true, "chdir": "/go/src/github.com/opencontainers/runc", "params": null, "stderr": "", "stderr_lines": [], "stdout": "install -D -m0755 runc /usr/local/sbin/runc", "stdout_lines": ["install -D -m0755 runc /usr/local/sbin/runc"], "target": "install"}

TASK [link runc] ***************************************************************
task path: /go/src/github.com/cri-o/cri-o/contrib/test/integration/build/runc.yml:18
ok: [localhost] => {"changed": false, "dest": "/usr/bin/runc", "gid": 0, "group": "root", "mode": "0777", "owner": "root", "secontext": "unconfined_u:object_r:bin_t:s0", "size": 20, "src": "/usr/local/sbin/runc", "state": "link", "uid": 0}

TASK [retrieve kvm module name (x86_64 arch)] **********************************
task path: /go/src/github.com/cri-o/cri-o/contrib/test/integration/build/kata.yml:4
skipping: [localhost] => {"changed": false, "skip_reason": "Conditional result was False"}

TASK [retrieve kvm module name (s390x arch)] ***********************************
task path: /go/src/github.com/cri-o/cri-o/contrib/test/integration/build/kata.yml:9
skipping: [localhost] => {"changed": false, "skip_reason": "Conditional result was False"}

TASK [retrieve kvm module name (unknown arch)] *********************************
task path: /go/src/github.com/cri-o/cri-o/contrib/test/integration/build/kata.yml:15
skipping: [localhost] => {"changed": false, "skip_reason": "Conditional result was False"}

TASK [set_fact] ****************************************************************
task path: /go/src/github.com/cri-o/cri-o/contrib/test/integration/build/kata.yml:19
skipping: [localhost] => {"changed": false, "skip_reason": "Conditional result was False"}

TASK [ensure kvm module is loaded] *********************************************
task path: /go/src/github.com/cri-o/cri-o/contrib/test/integration/build/kata.yml:28
skipping: [localhost] => {"changed": false, "skip_reason": "Conditional result was False"}

TASK [fail] ********************************************************************
task path: /go/src/github.com/cri-o/cri-o/contrib/test/integration/build/kata.yml:32
skipping: [localhost] => {"changed": false, "skip_reason": "Conditional result was False"}

TASK [check nested virtualization is enabled] **********************************
task path: /go/src/github.com/cri-o/cri-o/contrib/test/integration/build/kata.yml:38
skipping: [localhost] => {"changed": false, "skip_reason": "Conditional result was False"}

TASK [unload kvm module] *******************************************************
task path: /go/src/github.com/cri-o/cri-o/contrib/test/integration/build/kata.yml:44
skipping: [localhost] => {"changed": false, "skip_reason": "Conditional result was False"}

TASK [load kvm module with parameters] *****************************************
task path: /go/src/github.com/cri-o/cri-o/contrib/test/integration/build/kata.yml:47
skipping: [localhost] => {"changed": false, "skip_reason": "Conditional result was False"}

TASK [check nested virtualization activation] **********************************
task path: /go/src/github.com/cri-o/cri-o/contrib/test/integration/build/kata.yml:50
skipping: [localhost] => {"changed": false, "skip_reason": "Conditional result was False"}

TASK [fail] ********************************************************************
task path: /go/src/github.com/cri-o/cri-o/contrib/test/integration/build/kata.yml:54
skipping: [localhost] => {"changed": false, "skip_reason": "Conditional result was False"}

TASK [install dnf-plugins-core] ************************************************
task path: /go/src/github.com/cri-o/cri-o/contrib/test/integration/build/kata.yml:66
skipping: [localhost] => {"changed": false, "skip_reason": "Conditional result was False"}

TASK [add Kata Containers repo] ************************************************
task path: /go/src/github.com/cri-o/cri-o/contrib/test/integration/build/kata.yml:71
skipping: [localhost] => {"changed": false, "skip_reason": "Conditional result was False"}

TASK [add Advanced Virtualization repo] ****************************************
task path: /go/src/github.com/cri-o/cri-o/contrib/test/integration/build/kata.yml:86
skipping: [localhost] => {"changed": false, "skip_reason": "Conditional result was False"}

TASK [add the module_hotfixes option to the Advanced Virtualization repo] ******
task path: /go/src/github.com/cri-o/cri-o/contrib/test/integration/build/kata.yml:97
skipping: [localhost] => {"changed": false, "skip_reason": "Conditional result was False"}

TASK [add Kata Containers repo] ************************************************
task path: /go/src/github.com/cri-o/cri-o/contrib/test/integration/build/kata.yml:102
skipping: [localhost] => {"changed": false, "skip_reason": "Conditional result was False"}

TASK [install Kata Containers (old Fedora/CentOS versions)] ********************
task path: /go/src/github.com/cri-o/cri-o/contrib/test/integration/build/kata.yml:115
skipping: [localhost] => {"changed": false, "skip_reason": "Conditional result was False"}

TASK [install Kata Containers] *************************************************
task path: /go/src/github.com/cri-o/cri-o/contrib/test/integration/build/kata.yml:125
skipping: [localhost] => {"changed": false, "skip_reason": "Conditional result was False"}

TASK [fix qemu binary in Kata Containers configuration file] *******************
task path: /go/src/github.com/cri-o/cri-o/contrib/test/integration/build/kata.yml:137
skipping: [localhost] => {"changed": false, "skip_reason": "Conditional result was False"}

TASK [allow as many core as available to Qemu VM] ******************************
task path: /go/src/github.com/cri-o/cri-o/contrib/test/integration/build/kata.yml:144
skipping: [localhost] => {"changed": false, "skip_reason": "Conditional result was False"}

TASK [set fs.may_detach_mounts = 1] ********************************************
task path: /go/src/github.com/cri-o/cri-o/contrib/test/integration/main.yml:97
changed: [localhost] => {"changed": true}
META: ran handlers
META: ran handlers

PLAY [all] *********************************************************************

TASK [Gathering Facts] *********************************************************
ok: [localhost]
META: ran handlers
META: ran handlers
META: ran handlers

PLAY [all] *********************************************************************

TASK [Gathering Facts] *********************************************************
ok: [localhost]
META: ran handlers
META: ran handlers
META: ran handlers

PLAY [all] *********************************************************************

TASK [Gathering Facts] *********************************************************
ok: [localhost]
META: ran handlers
META: ran handlers
META: ran handlers

PLAY [all] *********************************************************************

TASK [Gathering Facts] *********************************************************
ok: [localhost]
META: ran handlers

TASK [clone kubernetes source repo] ********************************************
task path: /go/src/github.com/cri-o/cri-o/contrib/test/integration/build/kubernetes.yml:3
changed: [localhost] => {"after": "89aaf7c02dd33415ac994cecfddca7c02ed75834", "before": "2fffed102ddbb65fd4a242c7d711cbd250d91fc1", "changed": true, "msg": "Local modifications exist.", "remote_url_changed": false}

TASK [install etcd] ************************************************************
task path: /go/src/github.com/cri-o/cri-o/contrib/test/integration/build/kubernetes.yml:11
changed: [localhost] => {"changed": true, "cmd": ["hack/install-etcd.sh"], "delta": "0:00:01.139479", "end": "2022-07-02 04:10:21.822640", "rc": 0, "start": "2022-07-02 04:10:20.683161", "stderr": "", "stderr_lines": [], "stdout": "Downloading https://github.com/coreos/etcd/releases/download/v3.5.4/etcd-v3.5.4-linux-amd64.tar.gz succeed\netcd v3.5.4 installed. To use:\nexport PATH=\"/go/src/k8s.io/kubernetes/third_party/etcd:${PATH}\"", "stdout_lines": ["Downloading https://github.com/coreos/etcd/releases/download/v3.5.4/etcd-v3.5.4-linux-amd64.tar.gz succeed", "etcd v3.5.4 installed. To use:", "export PATH=\"/go/src/k8s.io/kubernetes/third_party/etcd:${PATH}\""]}

TASK [build kubernetes] ********************************************************
task path: /go/src/github.com/cri-o/cri-o/contrib/test/integration/build/kubernetes.yml:16
changed: [localhost] => {"changed": true, "chdir": "/go/src/k8s.io/kubernetes", "params": null, "stderr": "", "stderr_lines": [], "stdout": "+++ [0702 04:10:22] Verifying Prerequisites....\n+++ [0702 04:10:22] Removing _output directory\nRemoving test/e2e/generated/bindata.go ..", "stdout_lines": ["+++ [0702 04:10:22] Verifying Prerequisites....", "+++ [0702 04:10:22] Removing _output directory", "Removing test/e2e/generated/bindata.go .."], "target": "clean"}

TASK [build kubernetes] ********************************************************
task path: /go/src/github.com/cri-o/cri-o/contrib/test/integration/build/kubernetes.yml:21
changed: [localhost] => {"changed": true, "chdir": "/go/src/k8s.io/kubernetes", "params": null, "stderr": "", "stderr_lines": [], "stdout": "+++ [0702 04:12:36] Building go targets for linux/amd64\n    k8s.io/kubernetes/hack/make-rules/helpers/go2make (non-static)\n+++ [0702 04:12:40] Building go targets for linux/amd64\n    k8s.io/kubernetes/cmd/kube-proxy (static)\n    k8s.io/kubernetes/cmd/kube-apiserver (static)\n    k8s.io/kubernetes/cmd/kube-controller-manager (static)\n    k8s.io/kubernetes/cmd/kubelet (non-static)\n    k8s.io/kubernetes/cmd/kubeadm (static)\n    k8s.io/kubernetes/cmd/kube-scheduler (static)\n    k8s.io/component-base/logs/kube-log-runner (static)\n    k8s.io/kube-aggregator (non-static)\n    k8s.io/apiextensions-apiserver (non-static)\n    k8s.io/kubernetes/cluster/gce/gci/mounter (non-static)\n    k8s.io/kubernetes/cmd/kubectl (static)\n    k8s.io/kubernetes/cmd/kubectl-convert (non-static)\n    k8s.io/kubernetes/cmd/gendocs (non-static)\n    k8s.io/kubernetes/cmd/genkubedocs (non-static)\n    k8s.io/kubernetes/cmd/genman (non-static)\n    k8s.io/kubernetes/cmd/genyaml (non-static)\n    k8s.io/kubernetes/cmd/genswaggertypedocs (non-static)\n    k8s.io/kubernetes/cmd/linkcheck (non-static)\n    github.com/onsi/ginkgo/ginkgo (non-static)\n    k8s.io/kubernetes/test/e2e/e2e.test (test)\n    k8s.io/kubernetes/test/conformance/image/go-runner (non-static)\n    k8s.io/kubernetes/cmd/kubemark (static)\n    github.com/onsi/ginkgo/ginkgo (non-static)\n    k8s.io/kubernetes/test/e2e_node/e2e_node.test (test)", "stdout_lines": ["+++ [0702 04:12:36] Building go targets for linux/amd64", "    k8s.io/kubernetes/hack/make-rules/helpers/go2make (non-static)", "+++ [0702 04:12:40] Building go targets for linux/amd64", "    k8s.io/kubernetes/cmd/kube-proxy (static)", "    k8s.io/kubernetes/cmd/kube-apiserver (static)", "    k8s.io/kubernetes/cmd/kube-controller-manager (static)", "    k8s.io/kubernetes/cmd/kubelet (non-static)", "    k8s.io/kubernetes/cmd/kubeadm (static)", "    k8s.io/kubernetes/cmd/kube-scheduler (static)", "    k8s.io/component-base/logs/kube-log-runner (static)", "    k8s.io/kube-aggregator (non-static)", "    k8s.io/apiextensions-apiserver (non-static)", "    k8s.io/kubernetes/cluster/gce/gci/mounter (non-static)", "    k8s.io/kubernetes/cmd/kubectl (static)", "    k8s.io/kubernetes/cmd/kubectl-convert (non-static)", "    k8s.io/kubernetes/cmd/gendocs (non-static)", "    k8s.io/kubernetes/cmd/genkubedocs (non-static)", "    k8s.io/kubernetes/cmd/genman (non-static)", "    k8s.io/kubernetes/cmd/genyaml (non-static)", "    k8s.io/kubernetes/cmd/genswaggertypedocs (non-static)", "    k8s.io/kubernetes/cmd/linkcheck (non-static)", "    github.com/onsi/ginkgo/ginkgo (non-static)", "    k8s.io/kubernetes/test/e2e/e2e.test (test)", "    k8s.io/kubernetes/test/conformance/image/go-runner (non-static)", "    k8s.io/kubernetes/cmd/kubemark (static)", "    github.com/onsi/ginkgo/ginkgo (non-static)", "    k8s.io/kubernetes/test/e2e_node/e2e_node.test (test)"], "target": null}

TASK [Add custom cluster service file for the e2e testing] *********************
task path: /go/src/github.com/cri-o/cri-o/contrib/test/integration/build/kubernetes.yml:25
ok: [localhost] => {"changed": false, "checksum": "6eac4634e0e56cc8e358e785bac2ce8939e438f2", "gid": 0, "group": "root", "mode": "0644", "owner": "root", "path": "/etc/systemd/system/customcluster.service", "secontext": "system_u:object_r:systemd_unit_file_t:s0", "size": 205, "state": "file", "uid": 0}

TASK [Add create cluster background script for e2e testing] ********************
task path: /go/src/github.com/cri-o/cri-o/contrib/test/integration/build/kubernetes.yml:39
changed: [localhost] => {"changed": true, "checksum": "b412888f7b62fdf3e239cb36550e81394e19cf96", "dest": "/usr/local/bin/createcluster.sh", "gid": 0, "group": "root", "md5sum": "39913c5ca3f2ce09ba98e302e487411c", "mode": "0771", "owner": "root", "secontext": "system_u:object_r:bin_t:s0", "size": 1034, "src": "/home/origin/.ansible/tmp/ansible-tmp-1656736184.98-155374381785636/source", "state": "file", "uid": 0}

TASK [Set kubernetes_provider to be local] *************************************
task path: /go/src/github.com/cri-o/cri-o/contrib/test/integration/build/kubernetes.yml:68
changed: [localhost] => {"backup": "", "changed": true, "msg": "line replaced"}

TASK [Set KUBECONFIG] **********************************************************
task path: /go/src/github.com/cri-o/cri-o/contrib/test/integration/build/kubernetes.yml:77
changed: [localhost] => {"backup": "", "changed": true, "msg": "line replaced"}

TASK [install kubectl (for kubetest)] ******************************************
task path: /go/src/github.com/cri-o/cri-o/contrib/test/integration/build/kubernetes.yml:86
changed: [localhost] => {"changed": true, "checksum": "53bee40a3643dbce043dc1d0117e211a3da6ed0e", "dest": "/go/bin/kubectl", "gid": 0, "group": "root", "md5sum": "a89d88291d76bcb06500db1dfece4c6c", "mode": "0755", "owner": "root", "secontext": "system_u:object_r:default_t:s0", "size": 44040192, "src": "/home/origin/.ansible/tmp/ansible-tmp-1656736185.77-23328738614972/source", "state": "file", "uid": 0}

TASK [clone kubernetes source repo] ********************************************
task path: /go/src/github.com/cri-o/cri-o/contrib/test/integration/build/kubernetes.yml:3
skipping: [localhost] => {"changed": false, "skip_reason": "Conditional result was False"}

TASK [install etcd] ************************************************************
task path: /go/src/github.com/cri-o/cri-o/contrib/test/integration/build/kubernetes.yml:11
skipping: [localhost] => {"changed": false, "skip_reason": "Conditional result was False"}

TASK [build kubernetes] ********************************************************
task path: /go/src/github.com/cri-o/cri-o/contrib/test/integration/build/kubernetes.yml:16
skipping: [localhost] => {"changed": false, "skip_reason": "Conditional result was False"}

TASK [build kubernetes] ********************************************************
task path: /go/src/github.com/cri-o/cri-o/contrib/test/integration/build/kubernetes.yml:21
skipping: [localhost] => {"changed": false, "skip_reason": "Conditional result was False"}

TASK [Add custom cluster service file for the e2e testing] *********************
task path: /go/src/github.com/cri-o/cri-o/contrib/test/integration/build/kubernetes.yml:25
skipping: [localhost] => {"changed": false, "skip_reason": "Conditional result was False"}

TASK [Add create cluster background script for e2e testing] ********************
task path: /go/src/github.com/cri-o/cri-o/contrib/test/integration/build/kubernetes.yml:39
skipping: [localhost] => {"changed": false, "skip_reason": "Conditional result was False"}

TASK [Set kubernetes_provider to be local] *************************************
task path: /go/src/github.com/cri-o/cri-o/contrib/test/integration/build/kubernetes.yml:68
skipping: [localhost] => {"changed": false, "skip_reason": "Conditional result was False"}

TASK [Set KUBECONFIG] **********************************************************
task path: /go/src/github.com/cri-o/cri-o/contrib/test/integration/build/kubernetes.yml:77
skipping: [localhost] => {"changed": false, "skip_reason": "Conditional result was False"}

TASK [install kubectl (for kubetest)] ******************************************
task path: /go/src/github.com/cri-o/cri-o/contrib/test/integration/build/kubernetes.yml:86
skipping: [localhost] => {"changed": false, "skip_reason": "Conditional result was False"}

TASK [clone test-infra source repo] ********************************************
task path: /go/src/github.com/cri-o/cri-o/contrib/test/integration/build/kubetest.yml:3
changed: [localhost] => {"after": "ad3e4ab74c3247cb97f345ce8369c695ce73671e", "before": "9188da5e58d4d947b23cef3b863e340092e24d5c", "changed": true, "remote_url_changed": false}

TASK [install kubetest] ********************************************************
task path: /go/src/github.com/cri-o/cri-o/contrib/test/integration/build/kubetest.yml:13
changed: [localhost] => {"changed": true, "cmd": "GOPROXY=https://proxy.golang.org GOSUMDB=sum.golang.org GO111MODULE=on go get ./kubetest", "delta": "0:00:15.121702", "end": "2022-07-02 04:30:26.427267", "rc": 0, "start": "2022-07-02 04:30:11.305565", "stderr": "go: downloading cloud.google.com/go/storage v1.22.1\ngo: downloading github.com/Azure/go-autorest/autorest v0.11.18\ngo: downloading cloud.google.com/go v0.102.0\ngo: downloading github.com/Azure/go-autorest/autorest/adal v0.9.13\ngo: downloading github.com/aws/aws-sdk-go v1.37.22\ngo: downloading github.com/pelletier/go-toml v1.9.3\ngo: downloading golang.org/x/crypto v0.0.0-20220214200702-86341886e292\ngo: downloading sigs.k8s.io/boskos v0.0.0-20210730172138-093b54882439\ngo: downloading github.com/Azure/go-autorest/logger v0.2.1\ngo: downloading github.com/form3tech-oss/jwt-go v3.2.3+incompatible\ngo: downloading cloud.google.com/go/compute v1.6.1\ngo: downloading cloud.google.com/go/iam v0.3.0\ngo: downloading github.com/golang/protobuf v1.5.2\ngo: downloading github.com/google/uuid v1.2.0\ngo: downloading github.com/googleapis/gax-go/v2 v2.4.0\ngo: downloading github.com/googleapis/go-type-adapters v1.0.0\ngo: downloading golang.org/x/oauth2 v0.0.0-20220608161450-d0670ef3b1eb\ngo: downloading google.golang.org/api v0.83.0\ngo: downloading google.golang.org/genproto v0.0.0-20220608133413-ed9918b62aac\ngo: downloading google.golang.org/grpc v1.47.0\ngo: downloading google.golang.org/protobuf v1.28.0\ngo: downloading k8s.io/api v0.24.2\ngo: downloading k8s.io/apimachinery v0.24.2\ngo: downloading k8s.io/client-go v0.24.2\ngo: downloading github.com/sirupsen/logrus v1.8.1\ngo: downloading go.opencensus.io v0.23.0\ngo: downloading golang.org/x/xerrors v0.0.0-20220609144429-65e65417b02f\ngo: downloading google.golang.org/appengine v1.6.7\ngo: downloading golang.org/x/net v0.0.0-20220607020251-c690dde0001d\ngo: downloading golang.org/x/sys v0.0.0-20220608164250-635b8c9b7f68\ngo: downloading github.com/gogo/protobuf v1.3.2\ngo: downloading github.com/google/gofuzz v1.2.1-0.20210504230335-f78f29fc09ea\ngo: downloading github.com/imdario/mergo v0.3.12\ngo: downloading golang.org/x/term v0.0.0-20210927222741-03fcf44c2211\ngo: downloading k8s.io/klog/v2 v2.70.0\ngo: downloading sigs.k8s.io/yaml v1.3.0\ngo: downloading github.com/golang/groupcache v0.0.0-20210331224755-41bb18bfe9da\ngo: downloading github.com/jmespath/go-jmespath v0.4.0\ngo: downloading sigs.k8s.io/structured-merge-diff/v4 v4.2.1\ngo: downloading k8s.io/utils v0.0.0-20220210201930-3a6ce19ff2f9\ngo: downloading github.com/google/gnostic v0.5.7-v3refs\ngo: downloading golang.org/x/time v0.0.0-20220411224347-583f2d630306\ngo: downloading github.com/go-logr/logr v1.2.2\ngo: downloading go4.org v0.0.0-20201209231011-d4a079459e60\ngo: downloading gopkg.in/yaml.v2 v2.4.0\ngo: downloading github.com/google/go-cmp v0.5.8\ngo: downloading golang.org/x/text v0.3.7\ngo: downloading sigs.k8s.io/json v0.0.0-20211208200746-9f7c6b3444d2\ngo: downloading k8s.io/kube-openapi v0.0.0-20220328201542-3ee0da9b0b42\ngo: downloading github.com/json-iterator/go v1.1.12\ngo: downloading github.com/prometheus/client_golang v1.12.1\ngo: downloading gopkg.in/yaml.v3 v3.0.0-20190709130402-674ba3eaed22\ngo: downloading github.com/munnerz/goautoneg v0.0.0-20191010083416-a7dc8b61c822\ngo: downloading github.com/modern-go/reflect2 v1.0.2\ngo: downloading github.com/cespare/xxhash/v2 v2.1.2\ngo: downloading github.com/prometheus/common v0.32.1\ngo: downloading github.com/prometheus/procfs v0.7.3\ngo: downloading github.com/emicklei/go-restful v2.9.5+incompatible\ngo: downloading github.com/go-openapi/swag v0.19.14\ngo: downloading github.com/go-openapi/jsonreference v0.19.5\ngo: downloading github.com/PuerkitoBio/purell v1.1.1\ngo: downloading github.com/go-openapi/jsonpointer v0.19.5\ngo: downloading github.com/mailru/easyjson v0.7.6\ngo: downloading github.com/PuerkitoBio/urlesc v0.0.0-20170810143723-de5bf2ad4578\ngo: downloading github.com/josharian/intern v1.0.0", "stderr_lines": ["go: downloading cloud.google.com/go/storage v1.22.1", "go: downloading github.com/Azure/go-autorest/autorest v0.11.18", "go: downloading cloud.google.com/go v0.102.0", "go: downloading github.com/Azure/go-autorest/autorest/adal v0.9.13", "go: downloading github.com/aws/aws-sdk-go v1.37.22", "go: downloading github.com/pelletier/go-toml v1.9.3", "go: downloading golang.org/x/crypto v0.0.0-20220214200702-86341886e292", "go: downloading sigs.k8s.io/boskos v0.0.0-20210730172138-093b54882439", "go: downloading github.com/Azure/go-autorest/logger v0.2.1", "go: downloading github.com/form3tech-oss/jwt-go v3.2.3+incompatible", "go: downloading cloud.google.com/go/compute v1.6.1", "go: downloading cloud.google.com/go/iam v0.3.0", "go: downloading github.com/golang/protobuf v1.5.2", "go: downloading github.com/google/uuid v1.2.0", "go: downloading github.com/googleapis/gax-go/v2 v2.4.0", "go: downloading github.com/googleapis/go-type-adapters v1.0.0", "go: downloading golang.org/x/oauth2 v0.0.0-20220608161450-d0670ef3b1eb", "go: downloading google.golang.org/api v0.83.0", "go: downloading google.golang.org/genproto v0.0.0-20220608133413-ed9918b62aac", "go: downloading google.golang.org/grpc v1.47.0", "go: downloading google.golang.org/protobuf v1.28.0", "go: downloading k8s.io/api v0.24.2", "go: downloading k8s.io/apimachinery v0.24.2", "go: downloading k8s.io/client-go v0.24.2", "go: downloading github.com/sirupsen/logrus v1.8.1", "go: downloading go.opencensus.io v0.23.0", "go: downloading golang.org/x/xerrors v0.0.0-20220609144429-65e65417b02f", "go: downloading google.golang.org/appengine v1.6.7", "go: downloading golang.org/x/net v0.0.0-20220607020251-c690dde0001d", "go: downloading golang.org/x/sys v0.0.0-20220608164250-635b8c9b7f68", "go: downloading github.com/gogo/protobuf v1.3.2", "go: downloading github.com/google/gofuzz v1.2.1-0.20210504230335-f78f29fc09ea", "go: downloading github.com/imdario/mergo v0.3.12", "go: downloading golang.org/x/term v0.0.0-20210927222741-03fcf44c2211", "go: downloading k8s.io/klog/v2 v2.70.0", "go: downloading sigs.k8s.io/yaml v1.3.0", "go: downloading github.com/golang/groupcache v0.0.0-20210331224755-41bb18bfe9da", "go: downloading github.com/jmespath/go-jmespath v0.4.0", "go: downloading sigs.k8s.io/structured-merge-diff/v4 v4.2.1", "go: downloading k8s.io/utils v0.0.0-20220210201930-3a6ce19ff2f9", "go: downloading github.com/google/gnostic v0.5.7-v3refs", "go: downloading golang.org/x/time v0.0.0-20220411224347-583f2d630306", "go: downloading github.com/go-logr/logr v1.2.2", "go: downloading go4.org v0.0.0-20201209231011-d4a079459e60", "go: downloading gopkg.in/yaml.v2 v2.4.0", "go: downloading github.com/google/go-cmp v0.5.8", "go: downloading golang.org/x/text v0.3.7", "go: downloading sigs.k8s.io/json v0.0.0-20211208200746-9f7c6b3444d2", "go: downloading k8s.io/kube-openapi v0.0.0-20220328201542-3ee0da9b0b42", "go: downloading github.com/json-iterator/go v1.1.12", "go: downloading github.com/prometheus/client_golang v1.12.1", "go: downloading gopkg.in/yaml.v3 v3.0.0-20190709130402-674ba3eaed22", "go: downloading github.com/munnerz/goautoneg v0.0.0-20191010083416-a7dc8b61c822", "go: downloading github.com/modern-go/reflect2 v1.0.2", "go: downloading github.com/cespare/xxhash/v2 v2.1.2", "go: downloading github.com/prometheus/common v0.32.1", "go: downloading github.com/prometheus/procfs v0.7.3", "go: downloading github.com/emicklei/go-restful v2.9.5+incompatible", "go: downloading github.com/go-openapi/swag v0.19.14", "go: downloading github.com/go-openapi/jsonreference v0.19.5", "go: downloading github.com/PuerkitoBio/purell v1.1.1", "go: downloading github.com/go-openapi/jsonpointer v0.19.5", "go: downloading github.com/mailru/easyjson v0.7.6", "go: downloading github.com/PuerkitoBio/urlesc v0.0.0-20170810143723-de5bf2ad4578", "go: downloading github.com/josharian/intern v1.0.0"], "stdout": "", "stdout_lines": []}

TASK [add test-handler runtime handler for Runtimes test] **********************
task path: /go/src/github.com/cri-o/cri-o/contrib/test/integration/e2e-base.yml:3
changed: [localhost] => {"changed": true, "msg": "Block inserted"}

TASK [create ssh keys] *********************************************************
task path: /go/src/github.com/cri-o/cri-o/contrib/test/integration/e2e-base.yml:14
changed: [localhost] => {"changed": true, "cmd": "ssh-keygen -b 2048 -t rsa -f \"/home/origin/.ssh/id_rsa\" -q -N \"\"", "delta": "0:00:00.081123", "end": "2022-07-02 04:30:27.040319", "rc": 0, "start": "2022-07-02 04:30:26.959196", "stderr": "", "stderr_lines": [], "stdout": "", "stdout_lines": []}

TASK [add key file to authorized_users] ****************************************
task path: /go/src/github.com/cri-o/cri-o/contrib/test/integration/e2e-base.yml:19
changed: [localhost] => {"changed": true, "comment": null, "exclusive": false, "key": "ssh-rsa AAAAB3NzaC1yc2EAAAADAQABAAABAQCr8z8BIySbNye0duHBVBIBMWMS/0nTEIltCDJXWDcYOCshGbXPt9yI49SecB1g4+yr8indJ5AfpZ8fxDmkRGTGEvuJu/PP4gDbRnLA5YQvdqNNSjoP47XngsOqmy/cByZ56kj2eRj82GSSZqWYwqjECwFzznnt4NsvEx3Zf12yskM/TceD3Wxnxrqp/KqoLwYoF+7ozqBhUUzRaSTz76fNo2M1pN2YYhG62os31Q7K8lOgf2SIDh/WBTmgueJCa+NfX15+dDaDlDVjg4tJbFNrIzpCxZG569YJXAoNYcEjNO7ySDo9MCfofXNSXWNYMYXgRRaICAPWlzKlkCwAdV0Z root@ip-172-18-4-98.ec2.internal ", "key_options": null, "keyfile": "/home/origin/.ssh/authorized_keys", "manage_dir": true, "path": null, "state": "present", "unique": false, "user": "origin", "validate_certs": true}

TASK [enable and start CRI-O] **************************************************
task path: /go/src/github.com/cri-o/cri-o/contrib/test/integration/e2e-base.yml:25
changed: [localhost] => {"changed": true, "enabled": true, "name": "crio", "state": "started", "status": {"ActiveEnterTimestampMonotonic": "0", "ActiveExitTimestampMonotonic": "0", "ActiveState": "inactive", "After": "network-online.target basic.target system.slice systemd-journald.socket", "AllowIsolate": "no", "AmbientCapabilities": "0", "AssertResult": "no", "AssertTimestampMonotonic": "0", "Before": "kubelet.service shutdown.target", "BlockIOAccounting": "no", "BlockIOWeight": "18446744073709551615", "CPUAccounting": "no", "CPUQuotaPerSecUSec": "infinity", "CPUSchedulingPolicy": "0", "CPUSchedulingPriority": "0", "CPUSchedulingResetOnFork": "no", "CPUShares": "18446744073709551615", "CanIsolate": "no", "CanReload": "yes", "CanStart": "yes", "CanStop": "yes", "CapabilityBoundingSet": "18446744073709551615", "CollectMode": "inactive", "ConditionResult": "no", "ConditionTimestampMonotonic": "0", "Conflicts": "shutdown.target", "ControlPID": "0", "DefaultDependencies": "yes", "Delegate": "no", "Description": "Container Runtime Interface for OCI (CRI-O)", "DevicePolicy": "auto", "Documentation": "https://github.com/cri-o/cri-o", "Environment": "GOTRACEBACK=crash", "EnvironmentFile": "/etc/sysconfig/crio (ignore_errors=yes)", "ExecMainCode": "0", "ExecMainExitTimestampMonotonic": "0", "ExecMainPID": "0", "ExecMainStartTimestampMonotonic": "0", "ExecMainStatus": "0", "ExecReload": "{ path=/bin/kill ; argv[]=/bin/kill -s HUP $MAINPID ; ignore_errors=no ; start_time=[n/a] ; stop_time=[n/a] ; pid=0 ; code=(null) ; status=0/0 }", "ExecStart": "{ path=/usr/local/bin/crio ; argv[]=/usr/local/bin/crio $CRIO_CONFIG_OPTIONS $CRIO_RUNTIME_OPTIONS $CRIO_STORAGE_OPTIONS $CRIO_NETWORK_OPTIONS $CRIO_METRICS_OPTIONS ; ignore_errors=no ; start_time=[n/a] ; stop_time=[n/a] ; pid=0 ; code=(null) ; status=0/0 }", "FailureAction": "none", "FileDescriptorStoreMax": "0", "FragmentPath": "/usr/local/lib/systemd/system/crio.service", "GuessMainPID": "yes", "IOScheduling": "0", "Id": "crio.service", "IgnoreOnIsolate": "no", "IgnoreOnSnapshot": "no", "IgnoreSIGPIPE": "yes", "InactiveEnterTimestampMonotonic": "0", "InactiveExitTimestampMonotonic": "0", "JobTimeoutAction": "none", "JobTimeoutUSec": "0", "KillMode": "control-group", "KillSignal": "15", "LimitAS": "18446744073709551615", "LimitCORE": "18446744073709551615", "LimitCPU": "18446744073709551615", "LimitDATA": "18446744073709551615", "LimitFSIZE": "18446744073709551615", "LimitLOCKS": "18446744073709551615", "LimitMEMLOCK": "65536", "LimitMSGQUEUE": "819200", "LimitNICE": "0", "LimitNOFILE": "1048576", "LimitNPROC": "1048576", "LimitRSS": "18446744073709551615", "LimitRTPRIO": "0", "LimitRTTIME": "18446744073709551615", "LimitSIGPENDING": "63312", "LimitSTACK": "18446744073709551615", "LoadState": "loaded", "MainPID": "0", "MemoryAccounting": "no", "MemoryCurrent": "18446744073709551615", "MemoryLimit": "18446744073709551615", "MountFlags": "0", "Names": "crio.service", "NeedDaemonReload": "no", "Nice": "0", "NoNewPrivileges": "no", "NonBlocking": "no", "NotifyAccess": "main", "OOMScoreAdjust": "-999", "OnFailureJobMode": "replace", "PermissionsStartOnly": "no", "PrivateDevices": "no", "PrivateNetwork": "no", "PrivateTmp": "no", "ProtectHome": "no", "ProtectSystem": "no", "RefuseManualStart": "no", "RefuseManualStop": "no", "RemainAfterExit": "no", "Requires": "basic.target system.slice", "Restart": "no", "RestartUSec": "100ms", "Result": "success", "RootDirectoryStartOnly": "no", "RuntimeDirectoryMode": "0755", "SameProcessGroup": "no", "SecureBits": "0", "SendSIGHUP": "no", "SendSIGKILL": "yes", "Slice": "system.slice", "StandardError": "inherit", "StandardInput": "null", "StandardOutput": "journal", "StartLimitAction": "none", "StartLimitBurst": "5", "StartLimitInterval": "10000000", "StartupBlockIOWeight": "18446744073709551615", "StartupCPUShares": "18446744073709551615", "StatusErrno": "0", "StopWhenUnneeded": "no", "SubState": "dead", "SyslogLevelPrefix": "yes", "SyslogPriority": "30", "SystemCallErrorNumber": "0", "TTYReset": "no", "TTYVHangup": "no", "TTYVTDisallocate": "no", "TasksAccounting": "no", "TasksCurrent": "18446744073709551615", "TasksMax": "18446744073709551615", "TimeoutStartUSec": "0", "TimeoutStopUSec": "1min 30s", "TimerSlackNSec": "50000", "Transient": "no", "Type": "notify", "UMask": "0022", "UnitFilePreset": "disabled", "UnitFileState": "disabled", "Wants": "network-online.target", "WatchdogTimestampMonotonic": "0", "WatchdogUSec": "0"}}

TASK [update the server address for the custom cluster] ************************
task path: /go/src/github.com/cri-o/cri-o/contrib/test/integration/e2e-base.yml:32
changed: [localhost] => (item=DNS_SERVER_IP) => {"backup": "", "changed": true, "item": "DNS_SERVER_IP", "msg": "line replaced"}
changed: [localhost] => (item=API_HOST) => {"backup": "", "changed": true, "item": "API_HOST", "msg": "line replaced"}
changed: [localhost] => (item=API_HOST_IP) => {"backup": "", "changed": true, "item": "API_HOST_IP", "msg": "line replaced"}

TASK [enable and start the custom cluster] *************************************
task path: /go/src/github.com/cri-o/cri-o/contrib/test/integration/e2e-base.yml:45
changed: [localhost] => {"changed": true, "enabled": true, "name": "customcluster.service", "state": "started", "status": {"ActiveEnterTimestampMonotonic": "0", "ActiveExitTimestampMonotonic": "0", "ActiveState": "inactive", "After": "network-online.target system.slice -.mount systemd-journald.socket basic.target", "AllowIsolate": "no", "AmbientCapabilities": "0", "AssertResult": "no", "AssertTimestampMonotonic": "0", "Before": "shutdown.target", "BlockIOAccounting": "no", "BlockIOWeight": "18446744073709551615", "CPUAccounting": "no", "CPUQuotaPerSecUSec": "infinity", "CPUSchedulingPolicy": "0", "CPUSchedulingPriority": "0", "CPUSchedulingResetOnFork": "no", "CPUShares": "18446744073709551615", "CanIsolate": "no", "CanReload": "no", "CanStart": "yes", "CanStop": "yes", "CapabilityBoundingSet": "18446744073709551615", "CollectMode": "inactive", "ConditionResult": "no", "ConditionTimestampMonotonic": "0", "Conflicts": "shutdown.target", "ControlPID": "0", "DefaultDependencies": "yes", "Delegate": "no", "Description": "customcluster.service", "DevicePolicy": "auto", "ExecMainCode": "0", "ExecMainExitTimestampMonotonic": "0", "ExecMainPID": "0", "ExecMainStartTimestampMonotonic": "0", "ExecMainStatus": "0", "ExecStart": "{ path=/usr/local/bin/createcluster.sh ; argv[]=/usr/local/bin/createcluster.sh ; ignore_errors=no ; start_time=[n/a] ; stop_time=[n/a] ; pid=0 ; code=(null) ; status=0/0 }", "FailureAction": "none", "FileDescriptorStoreMax": "0", "FragmentPath": "/etc/systemd/system/customcluster.service", "GuessMainPID": "yes", "IOScheduling": "0", "Id": "customcluster.service", "IgnoreOnIsolate": "no", "IgnoreOnSnapshot": "no", "IgnoreSIGPIPE": "yes", "InactiveEnterTimestampMonotonic": "0", "InactiveExitTimestampMonotonic": "0", "JobTimeoutAction": "none", "JobTimeoutUSec": "0", "KillMode": "control-group", "KillSignal": "15", "LimitAS": "18446744073709551615", "LimitCORE": "18446744073709551615", "LimitCPU": "18446744073709551615", "LimitDATA": "18446744073709551615", "LimitFSIZE": "18446744073709551615", "LimitLOCKS": "18446744073709551615", "LimitMEMLOCK": "65536", "LimitMSGQUEUE": "819200", "LimitNICE": "0", "LimitNOFILE": "4096", "LimitNPROC": "63312", "LimitRSS": "18446744073709551615", "LimitRTPRIO": "0", "LimitRTTIME": "18446744073709551615", "LimitSIGPENDING": "63312", "LimitSTACK": "18446744073709551615", "LoadState": "loaded", "MainPID": "0", "MemoryAccounting": "no", "MemoryCurrent": "18446744073709551615", "MemoryLimit": "18446744073709551615", "MountFlags": "0", "Names": "customcluster.service", "NeedDaemonReload": "no", "Nice": "0", "NoNewPrivileges": "no", "NonBlocking": "no", "NotifyAccess": "none", "OOMScoreAdjust": "0", "OnFailureJobMode": "replace", "PermissionsStartOnly": "no", "PrivateDevices": "no", "PrivateNetwork": "no", "PrivateTmp": "no", "ProtectHome": "no", "ProtectSystem": "no", "RefuseManualStart": "no", "RefuseManualStop": "no", "RemainAfterExit": "no", "Requires": "-.mount system.slice basic.target", "RequiresMountsFor": "/go/src/k8s.io/kubernetes", "Restart": "no", "RestartUSec": "100ms", "Result": "success", "RootDirectoryStartOnly": "no", "RuntimeDirectoryMode": "0755", "SameProcessGroup": "no", "SecureBits": "0", "SendSIGHUP": "no", "SendSIGKILL": "yes", "Slice": "system.slice", "StandardError": "inherit", "StandardInput": "null", "StandardOutput": "journal", "StartLimitAction": "none", "StartLimitBurst": "5", "StartLimitInterval": "10000000", "StartupBlockIOWeight": "18446744073709551615", "StartupCPUShares": "18446744073709551615", "StatusErrno": "0", "StopWhenUnneeded": "no", "SubState": "dead", "SyslogLevelPrefix": "yes", "SyslogPriority": "30", "SystemCallErrorNumber": "0", "TTYReset": "no", "TTYVHangup": "no", "TTYVTDisallocate": "no", "TasksAccounting": "no", "TasksCurrent": "18446744073709551615", "TasksMax": "18446744073709551615", "TimeoutStartUSec": "1min 30s", "TimeoutStopUSec": "1min 30s", "TimerSlackNSec": "50000", "Transient": "no", "Type": "simple", "UMask": "0022", "UnitFilePreset": "disabled", "UnitFileState": "disabled", "User": "root", "Wants": "network-online.target", "WatchdogTimestampMonotonic": "0", "WatchdogUSec": "0", "WorkingDirectory": "/go/src/k8s.io/kubernetes"}}

TASK [wait for the cluster to be running] **************************************
task path: /go/src/github.com/cri-o/cri-o/contrib/test/integration/e2e-base.yml:52
FAILED - RETRYING: wait for the cluster to be running (100 retries left).
FAILED - RETRYING: wait for the cluster to be running (99 retries left).
FAILED - RETRYING: wait for the cluster to be running (98 retries left).
changed: [localhost] => {"attempts": 4, "changed": true, "cmd": "/go/src/k8s.io/kubernetes/_output/bin/kubectl get nodes -o jsonpath='{range .items[*]}{@.metadata.name}:{range @.status.conditions[*]}{@.type}={@.status};{end}{end}' 2>&1 | grep 'Ready=True'", "delta": "0:00:00.107136", "end": "2022-07-02 04:32:09.825862", "rc": 0, "start": "2022-07-02 04:32:09.718726", "stderr": "", "stderr_lines": [], "stdout": "172.18.4.98:MemoryPressure=False;DiskPressure=False;PIDPressure=False;Ready=True;", "stdout_lines": ["172.18.4.98:MemoryPressure=False;DiskPressure=False;PIDPressure=False;Ready=True;"]}

TASK [ensure directory exists for e2e reports] *********************************
task path: /go/src/github.com/cri-o/cri-o/contrib/test/integration/e2e-base.yml:60
changed: [localhost] => {"changed": true, "gid": 0, "group": "root", "mode": "0755", "owner": "root", "path": "/tmp/artifacts", "secontext": "unconfined_u:object_r:user_tmp_t:s0", "size": 6, "state": "directory", "uid": 0}

TASK [upgrade git package] *****************************************************
task path: /go/src/github.com/cri-o/cri-o/contrib/test/integration/e2e-base.yml:65
ok: [localhost] => {"changed": false, "msg": "", "rc": 0, "results": ["All packages providing git are up to date", ""]}

TASK [load br_netfilter module] ************************************************
task path: /go/src/github.com/cri-o/cri-o/contrib/test/integration/e2e-base.yml:71
changed: [localhost] => {"changed": true, "cmd": ["modprobe", "br_netfilter"], "delta": "0:00:00.020636", "end": "2022-07-02 04:49:33.279139", "rc": 0, "start": "2022-07-02 04:49:33.258503", "stderr": "", "stderr_lines": [], "stdout": "", "stdout_lines": []}

TASK [Enable iptables NAT for the bridge] **************************************
task path: /go/src/github.com/cri-o/cri-o/contrib/test/integration/e2e-base.yml:74
changed: [localhost] => {"changed": true}

TASK [Buffer the e2e testing command to workaround Ansible YAML folding "feature"] ***
task path: /go/src/github.com/cri-o/cri-o/contrib/test/integration/e2e-features.yml:6
ok: [localhost] => {"ansible_facts": {"e2e_shell_cmd": "KUBE_CONTAINER_RUNTIME=\"remote\" GINKGO_PARALLEL_NODES=6 GINKGO_PARALLEL=y\n    \"/go\"/bin/kubetest\n    --provider=local\n    --test\n    --test_args=\"-host=https://172.18.4.98:6443\n                --ginkgo.noColor\n                --ginkgo.succinct\n                --ginkgo.focus=\\[NodeFeature:.*\\]|\\[Feature:(Seccomp|ScopeSelectors|PodPriority|Ingress|ComprehensiveNamespaceDraining|Networking-IPv4|TokenRequestProjection)\\]\n                --ginkgo.skip=\\\\[Slow\\\\]|\\\\[Flaky\\\\]|\\\\[Serial\\\\]\n                --report-dir=/tmp/artifacts\"\n    &> /tmp/artifacts/e2e.log\n"}, "changed": false}

TASK [Disable selinux during e2e tests] ****************************************
task path: /go/src/github.com/cri-o/cri-o/contrib/test/integration/e2e-features.yml:29
changed: [localhost] => {"changed": true, "cmd": ["setenforce", "0"], "delta": "0:00:00.005201", "end": "2022-07-02 04:49:33.758721", "rc": 0, "start": "2022-07-02 04:49:33.753520", "stderr": "", "stderr_lines": [], "stdout": "", "stdout_lines": []}

TASK [run e2e tests] ***********************************************************
task path: /go/src/github.com/cri-o/cri-o/contrib/test/integration/e2e-features.yml:33
changed: [localhost] => {"ansible_job_id": "273938728660.24220", "changed": true, "cmd": "KUBE_CONTAINER_RUNTIME=\"remote\" GINKGO_PARALLEL_NODES=6 GINKGO_PARALLEL=y \"/go\"/bin/kubetest --provider=local --test --test_args=\"-host=https://172.18.4.98:6443 --ginkgo.noColor --ginkgo.succinct --ginkgo.focus=\\[NodeFeature:.*\\]|\\[Feature:(Seccomp|ScopeSelectors|PodPriority|Ingress|ComprehensiveNamespaceDraining|Networking-IPv4|TokenRequestProjection)\\] --ginkgo.skip=\\\\[Slow\\\\]|\\\\[Flaky\\\\]|\\\\[Serial\\\\] --report-dir=/tmp/artifacts\" &> /tmp/artifacts/e2e.log ", "delta": "0:00:57.462972", "end": "2022-07-02 04:50:31.458366", "finished": 1, "rc": 0, "start": "2022-07-02 04:49:33.995394", "stderr": "", "stderr_lines": [], "stdout": "", "stdout_lines": []}

TASK [Re-enable SELinux after e2e tests] ***************************************
task path: /go/src/github.com/cri-o/cri-o/contrib/test/integration/e2e-features.yml:42
changed: [localhost] => {"changed": true, "cmd": ["setenforce", "1"], "delta": "0:00:00.010343", "end": "2022-07-02 04:50:35.507140", "rc": 0, "start": "2022-07-02 04:50:35.496797", "stderr": "", "stderr_lines": [], "stdout": "", "stdout_lines": []}
META: ran handlers
META: ran handlers

PLAY RECAP *********************************************************************
localhost                  : ok=55   changed=41   unreachable=0    failed=0   

+ set +o xtrace
########## FINISHED STAGE: SUCCESS: RUN THE CRI-O E2E FEATURES TESTS [01h 07m 56s] ##########
[PostBuildScript] - [INFO] Executing post build scripts.
[workspace] $ /bin/bash /tmp/jenkins4501704802645722751.sh
########## STARTING STAGE: DOWNLOAD ARTIFACTS FROM THE REMOTE HOST ##########
+ [[ -s /var/lib/jenkins/jobs/test_pull_request_crio_e2e_features_rhel/workspace/activate ]]
+ source /var/lib/jenkins/jobs/test_pull_request_crio_e2e_features_rhel/workspace/activate
++ export VIRTUAL_ENV=/var/lib/jenkins/origin-ci-tool/95a472392910104fc805c4ab8af39791105c956d
++ VIRTUAL_ENV=/var/lib/jenkins/origin-ci-tool/95a472392910104fc805c4ab8af39791105c956d
++ export PATH=/var/lib/jenkins/origin-ci-tool/95a472392910104fc805c4ab8af39791105c956d/bin:/sbin:/usr/sbin:/bin:/usr/bin
++ PATH=/var/lib/jenkins/origin-ci-tool/95a472392910104fc805c4ab8af39791105c956d/bin:/sbin:/usr/sbin:/bin:/usr/bin
++ unset PYTHON_HOME
++ export OCT_CONFIG_HOME=/var/lib/jenkins/jobs/test_pull_request_crio_e2e_features_rhel/workspace/.config
++ OCT_CONFIG_HOME=/var/lib/jenkins/jobs/test_pull_request_crio_e2e_features_rhel/workspace/.config
+ trap 'exit 0' EXIT
++ pwd
+ ARTIFACT_DIR=/var/lib/jenkins/jobs/test_pull_request_crio_e2e_features_rhel/workspace/artifacts/gathered
+ rm -rf /var/lib/jenkins/jobs/test_pull_request_crio_e2e_features_rhel/workspace/artifacts/gathered
+ mkdir -p /var/lib/jenkins/jobs/test_pull_request_crio_e2e_features_rhel/workspace/artifacts/gathered
+ ssh -F /var/lib/jenkins/jobs/test_pull_request_crio_e2e_features_rhel/workspace/.config/origin-ci-tool/inventory/.ssh_config openshiftdevel sudo stat /go/src/k8s.io/kubernetes/artifacts
stat: cannot stat ‘/go/src/k8s.io/kubernetes/artifacts’: No such file or directory
+ ssh -F /var/lib/jenkins/jobs/test_pull_request_crio_e2e_features_rhel/workspace/.config/origin-ci-tool/inventory/.ssh_config openshiftdevel sudo stat /go/src/k8s.io/kubernetes/e2e.log
stat: cannot stat ‘/go/src/k8s.io/kubernetes/e2e.log’: No such file or directory
+ ssh -F /var/lib/jenkins/jobs/test_pull_request_crio_e2e_features_rhel/workspace/.config/origin-ci-tool/inventory/.ssh_config openshiftdevel sudo stat /go/src/github.com/cri-o/cri-o/testout.txt
stat: cannot stat ‘/go/src/github.com/cri-o/cri-o/testout.txt’: No such file or directory
+ ssh -F /var/lib/jenkins/jobs/test_pull_request_crio_e2e_features_rhel/workspace/.config/origin-ci-tool/inventory/.ssh_config openshiftdevel sudo stat /go/src/github.com/cri-o/cri-o/reports
stat: cannot stat ‘/go/src/github.com/cri-o/cri-o/reports’: No such file or directory
+ ssh -F /var/lib/jenkins/jobs/test_pull_request_crio_e2e_features_rhel/workspace/.config/origin-ci-tool/inventory/.ssh_config openshiftdevel sudo stat '/tmp/artifacts/*'
  File: ‘/tmp/artifacts/e2e.log’
  Size: 163904    	Blocks: 328        IO Block: 4096   regular file
Device: ca02h/51714d	Inode: 100707216   Links: 1
Access: (0644/-rw-r--r--)  Uid: (    0/    root)   Gid: (    0/    root)
Context: unconfined_u:object_r:user_tmp_t:s0
Access: 2022-07-02 04:49:34.000712806 +0000
Modify: 2022-07-02 04:50:31.455377219 +0000
Change: 2022-07-02 04:50:31.455377219 +0000
 Birth: -
  File: ‘/tmp/artifacts/junit_01.xml’
  Size: 404774    	Blocks: 792        IO Block: 4096   regular file
Device: ca02h/51714d	Inode: 100882610   Links: 1
Access: (0644/-rw-r--r--)  Uid: (    0/    root)   Gid: (    0/    root)
Context: unconfined_u:object_r:user_tmp_t:s0
Access: 2022-07-02 04:50:31.433377348 +0000
Modify: 2022-07-02 04:50:31.439377313 +0000
Change: 2022-07-02 04:50:31.439377313 +0000
 Birth: -
  File: ‘/tmp/artifacts/junit_02.xml’
  Size: 492601    	Blocks: 968        IO Block: 4096   regular file
Device: ca02h/51714d	Inode: 100882607   Links: 1
Access: (0644/-rw-r--r--)  Uid: (    0/    root)   Gid: (    0/    root)
Context: unconfined_u:object_r:user_tmp_t:s0
Access: 2022-07-02 04:50:26.069408678 +0000
Modify: 2022-07-02 04:50:26.077408632 +0000
Change: 2022-07-02 04:50:26.077408632 +0000
 Birth: -
  File: ‘/tmp/artifacts/junit_03.xml’
  Size: 208886    	Blocks: 408        IO Block: 4096   regular file
Device: ca02h/51714d	Inode: 100882609   Links: 1
Access: (0644/-rw-r--r--)  Uid: (    0/    root)   Gid: (    0/    root)
Context: unconfined_u:object_r:user_tmp_t:s0
Access: 2022-07-02 04:50:30.577382348 +0000
Modify: 2022-07-02 04:50:30.582382318 +0000
Change: 2022-07-02 04:50:30.582382318 +0000
 Birth: -
  File: ‘/tmp/artifacts/junit_04.xml’
  Size: 387557    	Blocks: 760        IO Block: 4096   regular file
Device: ca02h/51714d	Inode: 100707220   Links: 1
Access: (0644/-rw-r--r--)  Uid: (    0/    root)   Gid: (    0/    root)
Context: unconfined_u:object_r:user_tmp_t:s0
Access: 2022-07-02 04:50:25.783410349 +0000
Modify: 2022-07-02 04:50:25.793410290 +0000
Change: 2022-07-02 04:50:25.793410290 +0000
 Birth: -
  File: ‘/tmp/artifacts/junit_05.xml’
  Size: 127755    	Blocks: 256        IO Block: 4096   regular file
Device: ca02h/51714d	Inode: 100707221   Links: 1
Access: (0644/-rw-r--r--)  Uid: (    0/    root)   Gid: (    0/    root)
Context: unconfined_u:object_r:user_tmp_t:s0
Access: 2022-07-02 04:50:26.009409029 +0000
Modify: 2022-07-02 04:50:26.012409011 +0000
Change: 2022-07-02 04:50:26.012409011 +0000
 Birth: -
  File: ‘/tmp/artifacts/junit_06.xml’
  Size: 464781    	Blocks: 912        IO Block: 4096   regular file
Device: ca02h/51714d	Inode: 100882608   Links: 1
Access: (0644/-rw-r--r--)  Uid: (    0/    root)   Gid: (    0/    root)
Context: unconfined_u:object_r:user_tmp_t:s0
Access: 2022-07-02 04:50:29.589388118 +0000
Modify: 2022-07-02 04:50:29.598388066 +0000
Change: 2022-07-02 04:50:29.598388066 +0000
 Birth: -
+ ssh -F /var/lib/jenkins/jobs/test_pull_request_crio_e2e_features_rhel/workspace/.config/origin-ci-tool/inventory/.ssh_config openshiftdevel sudo chmod -R o+rX '/tmp/artifacts/*'
+ scp -r -F /var/lib/jenkins/jobs/test_pull_request_crio_e2e_features_rhel/workspace/.config/origin-ci-tool/inventory/.ssh_config 'openshiftdevel:/tmp/artifacts/*' /var/lib/jenkins/jobs/test_pull_request_crio_e2e_features_rhel/workspace/artifacts/gathered
+ ssh -F /var/lib/jenkins/jobs/test_pull_request_crio_e2e_features_rhel/workspace/.config/origin-ci-tool/inventory/.ssh_config openshiftdevel sudo stat /tmp/kubelet.log
  File: ‘/tmp/kubelet.log’
  Size: 1920594   	Blocks: 3968       IO Block: 4096   regular file
Device: ca02h/51714d	Inode: 13051185    Links: 1
Access: (0644/-rw-r--r--)  Uid: (    0/    root)   Gid: (    0/    root)
Context: system_u:object_r:tmp_t:s0
Access: 2022-07-02 04:31:41.818967263 +0000
Modify: 2022-07-02 04:50:38.430336479 +0000
Change: 2022-07-02 04:50:38.430336479 +0000
 Birth: -
+ ssh -F /var/lib/jenkins/jobs/test_pull_request_crio_e2e_features_rhel/workspace/.config/origin-ci-tool/inventory/.ssh_config openshiftdevel sudo chmod -R o+rX /tmp/kubelet.log
+ scp -r -F /var/lib/jenkins/jobs/test_pull_request_crio_e2e_features_rhel/workspace/.config/origin-ci-tool/inventory/.ssh_config openshiftdevel:/tmp/kubelet.log /var/lib/jenkins/jobs/test_pull_request_crio_e2e_features_rhel/workspace/artifacts/gathered
+ ssh -F /var/lib/jenkins/jobs/test_pull_request_crio_e2e_features_rhel/workspace/.config/origin-ci-tool/inventory/.ssh_config openshiftdevel sudo stat /tmp/kube-apiserver.log
  File: ‘/tmp/kube-apiserver.log’
  Size: 3812775   	Blocks: 8064       IO Block: 4096   regular file
Device: ca02h/51714d	Inode: 13051177    Links: 1
Access: (0644/-rw-r--r--)  Uid: (    0/    root)   Gid: (    0/    root)
Context: system_u:object_r:tmp_t:s0
Access: 2022-07-02 04:31:26.546053546 +0000
Modify: 2022-07-02 04:50:38.957333401 +0000
Change: 2022-07-02 04:50:38.957333401 +0000
 Birth: -
+ ssh -F /var/lib/jenkins/jobs/test_pull_request_crio_e2e_features_rhel/workspace/.config/origin-ci-tool/inventory/.ssh_config openshiftdevel sudo chmod -R o+rX /tmp/kube-apiserver.log
+ scp -r -F /var/lib/jenkins/jobs/test_pull_request_crio_e2e_features_rhel/workspace/.config/origin-ci-tool/inventory/.ssh_config openshiftdevel:/tmp/kube-apiserver.log /var/lib/jenkins/jobs/test_pull_request_crio_e2e_features_rhel/workspace/artifacts/gathered
+ ssh -F /var/lib/jenkins/jobs/test_pull_request_crio_e2e_features_rhel/workspace/.config/origin-ci-tool/inventory/.ssh_config openshiftdevel sudo stat /tmp/kube-controller-manager.log
  File: ‘/tmp/kube-controller-manager.log’
  Size: 82370     	Blocks: 384        IO Block: 4096   regular file
Device: ca02h/51714d	Inode: 13051181    Links: 1
Access: (0644/-rw-r--r--)  Uid: (    0/    root)   Gid: (    0/    root)
Context: system_u:object_r:tmp_t:s0
Access: 2022-07-02 04:31:39.799978669 +0000
Modify: 2022-07-02 04:50:41.586318046 +0000
Change: 2022-07-02 04:50:41.586318046 +0000
 Birth: -
+ ssh -F /var/lib/jenkins/jobs/test_pull_request_crio_e2e_features_rhel/workspace/.config/origin-ci-tool/inventory/.ssh_config openshiftdevel sudo chmod -R o+rX /tmp/kube-controller-manager.log
+ scp -r -F /var/lib/jenkins/jobs/test_pull_request_crio_e2e_features_rhel/workspace/.config/origin-ci-tool/inventory/.ssh_config openshiftdevel:/tmp/kube-controller-manager.log /var/lib/jenkins/jobs/test_pull_request_crio_e2e_features_rhel/workspace/artifacts/gathered
+ ssh -F /var/lib/jenkins/jobs/test_pull_request_crio_e2e_features_rhel/workspace/.config/origin-ci-tool/inventory/.ssh_config openshiftdevel sudo stat /tmp/kube-proxy.log
  File: ‘/tmp/kube-proxy.log’
  Size: 16993     	Blocks: 40         IO Block: 4096   regular file
Device: ca02h/51714d	Inode: 13051192    Links: 1
Access: (0644/-rw-r--r--)  Uid: (    0/    root)   Gid: (    0/    root)
Context: system_u:object_r:tmp_t:s0
Access: 2022-07-02 04:31:57.292879844 +0000
Modify: 2022-07-02 04:32:11.569799187 +0000
Change: 2022-07-02 04:32:11.569799187 +0000
 Birth: -
+ ssh -F /var/lib/jenkins/jobs/test_pull_request_crio_e2e_features_rhel/workspace/.config/origin-ci-tool/inventory/.ssh_config openshiftdevel sudo chmod -R o+rX /tmp/kube-proxy.log
+ scp -r -F /var/lib/jenkins/jobs/test_pull_request_crio_e2e_features_rhel/workspace/.config/origin-ci-tool/inventory/.ssh_config openshiftdevel:/tmp/kube-proxy.log /var/lib/jenkins/jobs/test_pull_request_crio_e2e_features_rhel/workspace/artifacts/gathered
+ ssh -F /var/lib/jenkins/jobs/test_pull_request_crio_e2e_features_rhel/workspace/.config/origin-ci-tool/inventory/.ssh_config openshiftdevel sudo stat /tmp/kube-proxy.yaml
  File: ‘/tmp/kube-proxy.yaml’
  Size: 489       	Blocks: 8          IO Block: 4096   regular file
Device: ca02h/51714d	Inode: 13051193    Links: 1
Access: (0644/-rw-r--r--)  Uid: (    0/    root)   Gid: (    0/    root)
Context: system_u:object_r:tmp_t:s0
Access: 2022-07-02 04:31:57.352879505 +0000
Modify: 2022-07-02 04:31:57.097880945 +0000
Change: 2022-07-02 04:31:57.097880945 +0000
 Birth: -
+ ssh -F /var/lib/jenkins/jobs/test_pull_request_crio_e2e_features_rhel/workspace/.config/origin-ci-tool/inventory/.ssh_config openshiftdevel sudo chmod -R o+rX /tmp/kube-proxy.yaml
+ scp -r -F /var/lib/jenkins/jobs/test_pull_request_crio_e2e_features_rhel/workspace/.config/origin-ci-tool/inventory/.ssh_config openshiftdevel:/tmp/kube-proxy.yaml /var/lib/jenkins/jobs/test_pull_request_crio_e2e_features_rhel/workspace/artifacts/gathered
+ ssh -F /var/lib/jenkins/jobs/test_pull_request_crio_e2e_features_rhel/workspace/.config/origin-ci-tool/inventory/.ssh_config openshiftdevel sudo stat /tmp/kube-scheduler.log
  File: ‘/tmp/kube-scheduler.log’
  Size: 65620     	Blocks: 256        IO Block: 4096   regular file
Device: ca02h/51714d	Inode: 13051183    Links: 1
Access: (0644/-rw-r--r--)  Uid: (    0/    root)   Gid: (    0/    root)
Context: system_u:object_r:tmp_t:s0
Access: 2022-07-02 04:31:39.801978657 +0000
Modify: 2022-07-02 04:50:31.390377599 +0000
Change: 2022-07-02 04:50:31.390377599 +0000
 Birth: -
+ ssh -F /var/lib/jenkins/jobs/test_pull_request_crio_e2e_features_rhel/workspace/.config/origin-ci-tool/inventory/.ssh_config openshiftdevel sudo chmod -R o+rX /tmp/kube-scheduler.log
+ scp -r -F /var/lib/jenkins/jobs/test_pull_request_crio_e2e_features_rhel/workspace/.config/origin-ci-tool/inventory/.ssh_config openshiftdevel:/tmp/kube-scheduler.log /var/lib/jenkins/jobs/test_pull_request_crio_e2e_features_rhel/workspace/artifacts/gathered
+ ssh -F /var/lib/jenkins/jobs/test_pull_request_crio_e2e_features_rhel/workspace/.config/origin-ci-tool/inventory/.ssh_config openshiftdevel sudo stat /etc/crio/crio.conf
  File: ‘/etc/crio/crio.conf’
  Size: 23744     	Blocks: 48         IO Block: 4096   regular file
Device: ca02h/51714d	Inode: 13051168    Links: 1
Access: (0644/-rw-r--r--)  Uid: (    0/    root)   Gid: (    0/    root)
Context: unconfined_u:object_r:container_config_t:s0
Access: 2022-07-02 04:30:28.092383776 +0000
Modify: 2022-07-02 04:30:26.763391284 +0000
Change: 2022-07-02 04:30:26.763391284 +0000
 Birth: -
+ ssh -F /var/lib/jenkins/jobs/test_pull_request_crio_e2e_features_rhel/workspace/.config/origin-ci-tool/inventory/.ssh_config openshiftdevel sudo chmod -R o+rX /etc/crio/crio.conf
+ scp -r -F /var/lib/jenkins/jobs/test_pull_request_crio_e2e_features_rhel/workspace/.config/origin-ci-tool/inventory/.ssh_config openshiftdevel:/etc/crio/crio.conf /var/lib/jenkins/jobs/test_pull_request_crio_e2e_features_rhel/workspace/artifacts/gathered
+ tree /var/lib/jenkins/jobs/test_pull_request_crio_e2e_features_rhel/workspace/artifacts/gathered
/var/lib/jenkins/jobs/test_pull_request_crio_e2e_features_rhel/workspace/artifacts/gathered
├── crio.conf
├── e2e.log
├── junit_01.xml
├── junit_02.xml
├── junit_03.xml
├── junit_04.xml
├── junit_05.xml
├── junit_06.xml
├── kube-apiserver.log
├── kube-controller-manager.log
├── kubelet.log
├── kube-proxy.log
├── kube-proxy.yaml
└── kube-scheduler.log

0 directories, 14 files
+ exit 0
[workspace] $ /bin/bash /tmp/jenkins4378238703449863030.sh
########## STARTING STAGE: GENERATE ARTIFACTS FROM THE REMOTE HOST ##########
+ [[ -s /var/lib/jenkins/jobs/test_pull_request_crio_e2e_features_rhel/workspace/activate ]]
+ source /var/lib/jenkins/jobs/test_pull_request_crio_e2e_features_rhel/workspace/activate
++ export VIRTUAL_ENV=/var/lib/jenkins/origin-ci-tool/95a472392910104fc805c4ab8af39791105c956d
++ VIRTUAL_ENV=/var/lib/jenkins/origin-ci-tool/95a472392910104fc805c4ab8af39791105c956d
++ export PATH=/var/lib/jenkins/origin-ci-tool/95a472392910104fc805c4ab8af39791105c956d/bin:/sbin:/usr/sbin:/bin:/usr/bin
++ PATH=/var/lib/jenkins/origin-ci-tool/95a472392910104fc805c4ab8af39791105c956d/bin:/sbin:/usr/sbin:/bin:/usr/bin
++ unset PYTHON_HOME
++ export OCT_CONFIG_HOME=/var/lib/jenkins/jobs/test_pull_request_crio_e2e_features_rhel/workspace/.config
++ OCT_CONFIG_HOME=/var/lib/jenkins/jobs/test_pull_request_crio_e2e_features_rhel/workspace/.config
+ trap 'exit 0' EXIT
++ pwd
+ ARTIFACT_DIR=/var/lib/jenkins/jobs/test_pull_request_crio_e2e_features_rhel/workspace/artifacts/generated
+ rm -rf /var/lib/jenkins/jobs/test_pull_request_crio_e2e_features_rhel/workspace/artifacts/generated
+ mkdir /var/lib/jenkins/jobs/test_pull_request_crio_e2e_features_rhel/workspace/artifacts/generated
+ ssh -F /var/lib/jenkins/jobs/test_pull_request_crio_e2e_features_rhel/workspace/.config/origin-ci-tool/inventory/.ssh_config openshiftdevel 'sudo pvs && sudo vgs && sudo lvs 2>&1'
+ ssh -F /var/lib/jenkins/jobs/test_pull_request_crio_e2e_features_rhel/workspace/.config/origin-ci-tool/inventory/.ssh_config openshiftdevel 'sudo yum list installed 2>&1'
+ ssh -F /var/lib/jenkins/jobs/test_pull_request_crio_e2e_features_rhel/workspace/.config/origin-ci-tool/inventory/.ssh_config openshiftdevel 'sudo ausearch -m AVC -m SELINUX_ERR -m USER_AVC 2>&1'
+ true
+ ssh -F /var/lib/jenkins/jobs/test_pull_request_crio_e2e_features_rhel/workspace/.config/origin-ci-tool/inventory/.ssh_config openshiftdevel 'sudo journalctl --no-pager --boot 2>&1'
+ ssh -F /var/lib/jenkins/jobs/test_pull_request_crio_e2e_features_rhel/workspace/.config/origin-ci-tool/inventory/.ssh_config openshiftdevel 'sudo journalctl _PID=1 --no-pager --all --lines=all 2>&1'
+ tree /var/lib/jenkins/jobs/test_pull_request_crio_e2e_features_rhel/workspace/artifacts/generated
/var/lib/jenkins/jobs/test_pull_request_crio_e2e_features_rhel/workspace/artifacts/generated
├── avc_denials.log
├── filesystem.info
├── installed_packages.log
├── pid1.journal
└── system.journal

0 directories, 5 files
+ exit 0
[workspace] $ /bin/bash /tmp/jenkins7274505302299299347.sh
########## STARTING STAGE: FETCH SYSTEMD JOURNALS FROM THE REMOTE HOST ##########
+ [[ -s /var/lib/jenkins/jobs/test_pull_request_crio_e2e_features_rhel/workspace/activate ]]
+ source /var/lib/jenkins/jobs/test_pull_request_crio_e2e_features_rhel/workspace/activate
++ export VIRTUAL_ENV=/var/lib/jenkins/origin-ci-tool/95a472392910104fc805c4ab8af39791105c956d
++ VIRTUAL_ENV=/var/lib/jenkins/origin-ci-tool/95a472392910104fc805c4ab8af39791105c956d
++ export PATH=/var/lib/jenkins/origin-ci-tool/95a472392910104fc805c4ab8af39791105c956d/bin:/sbin:/usr/sbin:/bin:/usr/bin
++ PATH=/var/lib/jenkins/origin-ci-tool/95a472392910104fc805c4ab8af39791105c956d/bin:/sbin:/usr/sbin:/bin:/usr/bin
++ unset PYTHON_HOME
++ export OCT_CONFIG_HOME=/var/lib/jenkins/jobs/test_pull_request_crio_e2e_features_rhel/workspace/.config
++ OCT_CONFIG_HOME=/var/lib/jenkins/jobs/test_pull_request_crio_e2e_features_rhel/workspace/.config
+ trap 'exit 0' EXIT
++ pwd
+ ARTIFACT_DIR=/var/lib/jenkins/jobs/test_pull_request_crio_e2e_features_rhel/workspace/artifacts/journals
+ rm -rf /var/lib/jenkins/jobs/test_pull_request_crio_e2e_features_rhel/workspace/artifacts/journals
+ mkdir /var/lib/jenkins/jobs/test_pull_request_crio_e2e_features_rhel/workspace/artifacts/journals
+ ssh -F /var/lib/jenkins/jobs/test_pull_request_crio_e2e_features_rhel/workspace/.config/origin-ci-tool/inventory/.ssh_config openshiftdevel sudo journalctl --unit crio.service --no-pager --all --lines=all
+ ssh -F /var/lib/jenkins/jobs/test_pull_request_crio_e2e_features_rhel/workspace/.config/origin-ci-tool/inventory/.ssh_config openshiftdevel sudo journalctl --unit customcluster.service --no-pager --all --lines=all
+ ssh -F /var/lib/jenkins/jobs/test_pull_request_crio_e2e_features_rhel/workspace/.config/origin-ci-tool/inventory/.ssh_config openshiftdevel sudo journalctl --unit systemd-journald.service --no-pager --all --lines=all
+ tree /var/lib/jenkins/jobs/test_pull_request_crio_e2e_features_rhel/workspace/artifacts/journals
/var/lib/jenkins/jobs/test_pull_request_crio_e2e_features_rhel/workspace/artifacts/journals
├── crio.service
├── customcluster.service
└── systemd-journald.service

0 directories, 3 files
+ exit 0
[workspace] $ /bin/bash /tmp/jenkins8418062986127738262.sh
########## STARTING STAGE: CREATE /DATA, INSTALL JQ, DOCKER, AND START DOCKERD ##########
+ [[ -s /var/lib/jenkins/jobs/test_pull_request_crio_e2e_features_rhel/workspace/activate ]]
+ source /var/lib/jenkins/jobs/test_pull_request_crio_e2e_features_rhel/workspace/activate
++ export VIRTUAL_ENV=/var/lib/jenkins/origin-ci-tool/95a472392910104fc805c4ab8af39791105c956d
++ VIRTUAL_ENV=/var/lib/jenkins/origin-ci-tool/95a472392910104fc805c4ab8af39791105c956d
++ export PATH=/var/lib/jenkins/origin-ci-tool/95a472392910104fc805c4ab8af39791105c956d/bin:/sbin:/usr/sbin:/bin:/usr/bin
++ PATH=/var/lib/jenkins/origin-ci-tool/95a472392910104fc805c4ab8af39791105c956d/bin:/sbin:/usr/sbin:/bin:/usr/bin
++ unset PYTHON_HOME
++ export OCT_CONFIG_HOME=/var/lib/jenkins/jobs/test_pull_request_crio_e2e_features_rhel/workspace/.config
++ OCT_CONFIG_HOME=/var/lib/jenkins/jobs/test_pull_request_crio_e2e_features_rhel/workspace/.config
++ mktemp
+ script=/tmp/tmp.NmtGl1uN1K
+ cat
+ chmod +x /tmp/tmp.NmtGl1uN1K
+ scp -F /var/lib/jenkins/jobs/test_pull_request_crio_e2e_features_rhel/workspace/.config/origin-ci-tool/inventory/.ssh_config /tmp/tmp.NmtGl1uN1K openshiftdevel:/tmp/tmp.NmtGl1uN1K
+ ssh -F /var/lib/jenkins/jobs/test_pull_request_crio_e2e_features_rhel/workspace/.config/origin-ci-tool/inventory/.ssh_config -t openshiftdevel 'bash -l -c "timeout 300 /tmp/tmp.NmtGl1uN1K"'
+ cd /home/origin
+ trap 'exit 0' EXIT
+ sudo mkdir -p /data/gcs
+ sudo chown -R origin:origin /data
+ grep -q 'ID="centos"' /etc/os-release
+ grep -q 'ID="rhel"' /etc/os-release
+ sudo yum install -y https://dl.fedoraproject.org/pub/epel/epel-release-latest-7.noarch.rpm
Loaded plugins: amazon-id, search-disabled-repos
Examining /var/tmp/yum-root-lHxYj0/epel-release-latest-7.noarch.rpm: epel-release-7-14.noarch
Marking /var/tmp/yum-root-lHxYj0/epel-release-latest-7.noarch.rpm to be installed
Resolving Dependencies
--> Running transaction check
---> Package epel-release.noarch 0:7-14 will be installed
--> Finished Dependency Resolution

Dependencies Resolved

================================================================================
 Package          Arch       Version    Repository                         Size
================================================================================
Installing:
 epel-release     noarch     7-14       /epel-release-latest-7.noarch      25 k

Transaction Summary
================================================================================
Install  1 Package

Total size: 25 k
Installed size: 25 k
Downloading packages:
Running transaction check
Running transaction test
Transaction test succeeded
Running transaction
  Installing : epel-release-7-14.noarch                                     1/1 
  Verifying  : epel-release-7-14.noarch                                     1/1 

Installed:
  epel-release.noarch 0:7-14                                                    

Complete!
+ sudo yum install -y jq docker
Loaded plugins: amazon-id, search-disabled-repos
https://mirror.openshift.com/enterprise/rhel/aos-cd/tools/charlie/repodata/repomd.xml: [Errno 14] HTTPS Error 401 - Unauthorized
Trying other mirror.
http://mirror.es.its.nyu.edu/epel/7/x86_64/repodata/repomd.xml: [Errno 12] Timeout on http://mirror.es.its.nyu.edu/epel/7/x86_64/repodata/repomd.xml: (28, 'Connection timed out after 30001 milliseconds')
Trying other mirror.
https://use-mirror2.ops.rhcloud.com/libra/rhui-rhel-server-7-extras/repodata/repomd.xml: [Errno 14] curl#58 - "SSL peer rejected your certificate as expired."
Trying other mirror.
https://use-mirror1.ops.rhcloud.com/libra/rhui-rhel-server-7-extras/repodata/repomd.xml: [Errno 14] curl#58 - "SSL peer rejected your certificate as expired."
Trying other mirror.
https://mirror.ops.rhcloud.com/libra/rhui-rhel-server-7-extras/repodata/repomd.xml: [Errno 14] curl#58 - "SSL peer rejected your certificate as expired."
Trying other mirror.
https://gce-mirror2.ops.rhcloud.com/libra/rhui-rhel-server-7-extras/repodata/repomd.xml: [Errno 12] Timeout on https://gce-mirror2.ops.rhcloud.com/libra/rhui-rhel-server-7-extras/repodata/repomd.xml: (28, 'Connection timed out after 30001 milliseconds')
Trying other mirror.
https://gce-mirror1.ops.rhcloud.com/libra/rhui-rhel-server-7-extras/repodata/repomd.xml: [Errno 12] Timeout on https://gce-mirror1.ops.rhcloud.com/libra/rhui-rhel-server-7-extras/repodata/repomd.xml: (28, 'Connection timed out after 30001 milliseconds')
Trying other mirror.
https://euw-mirror1.ops.rhcloud.com/libra/rhui-rhel-server-7-extras/repodata/repomd.xml: [Errno 12] Timeout on https://euw-mirror1.ops.rhcloud.com/libra/rhui-rhel-server-7-extras/repodata/repomd.xml: (28, 'Connection timed out after 30001 milliseconds')
Trying other mirror.
https://gce-mirror2.ops.rhcloud.com/libra/rhui-rhel-server-7-extras/repodata/repomd.xml: [Errno 12] Timeout on https://gce-mirror2.ops.rhcloud.com/libra/rhui-rhel-server-7-extras/repodata/repomd.xml: (28, 'Connection timed out after 30001 milliseconds')
Trying other mirror.
https://use-mirror2.ops.rhcloud.com/libra/rhui-rhel-server-7-releases/repodata/repomd.xml: [Errno 14] curl#58 - "SSL peer rejected your certificate as expired."
Trying other mirror.
https://use-mirror1.ops.rhcloud.com/libra/rhui-rhel-server-7-releases/repodata/repomd.xml: [Errno 14] curl#58 - "SSL peer rejected your certificate as expired."
Trying other mirror.
https://mirror.ops.rhcloud.com/libra/rhui-rhel-server-7-releases/repodata/repomd.xml: [Errno 14] curl#58 - "SSL peer rejected your certificate as expired."
Trying other mirror.
https://euw-mirror1.ops.rhcloud.com/libra/rhui-rhel-server-7-releases/repodata/repomd.xml: [Errno 12] Timeout on https://euw-mirror1.ops.rhcloud.com/libra/rhui-rhel-server-7-releases/repodata/repomd.xml: (28, 'Connection timed out after 30001 milliseconds')
Trying other mirror.
https://euw-mirror1.ops.rhcloud.com/libra/rhui-rhel-server-7-releases/repodata/repomd.xml: [Errno 12] Timeout on https://euw-mirror1.ops.rhcloud.com/libra/rhui-rhel-server-7-releases/repodata/repomd.xml: (28, 'Connection timed out after 30001 milliseconds')
Trying other mirror.
https://euw-mirror1.ops.rhcloud.com/libra/rhui-rhel-server-7-releases/repodata/repomd.xml: [Errno 12] Timeout on https://euw-mirror1.ops.rhcloud.com/libra/rhui-rhel-server-7-releases/repodata/repomd.xml: (28, 'Connection timed out after 30001 milliseconds')
Trying other mirror.
https://euw-mirror1.ops.rhcloud.com/libra/rhui-rhel-server-7-releases/repodata/repomd.xml: [Errno 12] Timeout on https://euw-mirror1.ops.rhcloud.com/libra/rhui-rhel-server-7-releases/repodata/repomd.xml: (28, 'Connection timed out after 30001 milliseconds')
Trying other mirror.
https://use-mirror2.ops.rhcloud.com/libra/rhui-rhel-server-7-releases-optional/repodata/repomd.xml: [Errno 14] curl#58 - "SSL peer rejected your certificate as expired."
Trying other mirror.
https://use-mirror1.ops.rhcloud.com/libra/rhui-rhel-server-7-releases-optional/repodata/repomd.xml: [Errno 14] curl#58 - "SSL peer rejected your certificate as expired."
Trying other mirror.
https://mirror.ops.rhcloud.com/libra/rhui-rhel-server-7-releases-optional/repodata/repomd.xml: [Errno 14] curl#58 - "SSL peer rejected your certificate as expired."
Trying other mirror.
++ exit 0
Resolving Dependencies
--> Running transaction check
---> Package docker.x86_64 2:1.13.1-203.git0be3e21.el7_9 will be installed
--> Processing Dependency: docker-common = 2:1.13.1-203.git0be3e21.el7_9 for package: 2:docker-1.13.1-203.git0be3e21.el7_9.x86_64
--> Processing Dependency: docker-client = 2:1.13.1-203.git0be3e21.el7_9 for package: 2:docker-1.13.1-203.git0be3e21.el7_9.x86_64
---> Package jq.x86_64 0:1.6-2.el7 will be installed
--> Processing Dependency: libonig.so.5()(64bit) for package: jq-1.6-2.el7.x86_64
--> Running transaction check
---> Package docker-client.x86_64 2:1.13.1-203.git0be3e21.el7_9 will be installed
---> Package docker-common.x86_64 2:1.13.1-203.git0be3e21.el7_9 will be installed
--> Processing Dependency: docker-rhel-push-plugin = 2:1.13.1-203.git0be3e21.el7_9 for package: 2:docker-common-1.13.1-203.git0be3e21.el7_9.x86_64
--> Processing Dependency: container-storage-setup >= 0.9.0-1 for package: 2:docker-common-1.13.1-203.git0be3e21.el7_9.x86_64
---> Package oniguruma.x86_64 0:6.8.2-2.el7 will be installed
--> Running transaction check
---> Package container-storage-setup.noarch 0:0.11.0-2.git5eaf76c.el7 will be installed
---> Package docker-rhel-push-plugin.x86_64 2:1.13.1-203.git0be3e21.el7_9 will be installed
--> Finished Dependency Resolution

Dependencies Resolved

================================================================================
 Package Arch   Version                       Repository                   Size
================================================================================
Installing:
 docker  x86_64 2:1.13.1-203.git0be3e21.el7_9 oso-rhui-rhel-server-extras  18 M
 jq      x86_64 1.6-2.el7                     epel                        167 k
Installing for dependencies:
 container-storage-setup
         noarch 0.11.0-2.git5eaf76c.el7       oso-rhui-rhel-server-extras  35 k
 docker-client
         x86_64 2:1.13.1-203.git0be3e21.el7_9 oso-rhui-rhel-server-extras 3.9 M
 docker-common
         x86_64 2:1.13.1-203.git0be3e21.el7_9 oso-rhui-rhel-server-extras 100 k
 docker-rhel-push-plugin
         x86_64 2:1.13.1-203.git0be3e21.el7_9 oso-rhui-rhel-server-extras 2.0 M
 oniguruma
         x86_64 6.8.2-2.el7                   epel                        181 k

Transaction Summary
================================================================================
Install  2 Packages (+5 Dependent packages)

Total download size: 24 M
Installed size: 85 M
Downloading packages:
Public key for jq-1.6-2.el7.x86_64.rpm is not installed
++ export status=FAILURE
++ status=FAILURE
+ set +o xtrace
########## FINISHED STAGE: FAILURE: CREATE /DATA, INSTALL JQ, DOCKER, AND START DOCKERD [00h 13m 12s] ##########
[workspace] $ /bin/bash /tmp/jenkins607624792823794419.sh
########## STARTING STAGE: ASSEMBLE GCS OUTPUT ##########
+ [[ -s /var/lib/jenkins/jobs/test_pull_request_crio_e2e_features_rhel/workspace/activate ]]
+ source /var/lib/jenkins/jobs/test_pull_request_crio_e2e_features_rhel/workspace/activate
++ export VIRTUAL_ENV=/var/lib/jenkins/origin-ci-tool/95a472392910104fc805c4ab8af39791105c956d
++ VIRTUAL_ENV=/var/lib/jenkins/origin-ci-tool/95a472392910104fc805c4ab8af39791105c956d
++ export PATH=/var/lib/jenkins/origin-ci-tool/95a472392910104fc805c4ab8af39791105c956d/bin:/sbin:/usr/sbin:/bin:/usr/bin
++ PATH=/var/lib/jenkins/origin-ci-tool/95a472392910104fc805c4ab8af39791105c956d/bin:/sbin:/usr/sbin:/bin:/usr/bin
++ unset PYTHON_HOME
++ export OCT_CONFIG_HOME=/var/lib/jenkins/jobs/test_pull_request_crio_e2e_features_rhel/workspace/.config
++ OCT_CONFIG_HOME=/var/lib/jenkins/jobs/test_pull_request_crio_e2e_features_rhel/workspace/.config
+ trap 'exit 0' EXIT
+ mkdir -p gcs/artifacts gcs/artifacts/generated gcs/artifacts/journals gcs/artifacts/gathered
++ python -c 'import json; import urllib; print json.load(urllib.urlopen('\''https://ci.openshift.redhat.com/jenkins/job/test_pull_request_crio_e2e_features_rhel/24313/api/json'\''))['\''result'\'']'
+ result=SUCCESS
+ cat
++ date +%s
+ cat /var/lib/jenkins/jobs/test_pull_request_crio_e2e_features_rhel/builds/24313/log
+ cp -r artifacts/gathered/crio.conf artifacts/gathered/e2e.log artifacts/gathered/junit_01.xml artifacts/gathered/junit_02.xml artifacts/gathered/junit_03.xml artifacts/gathered/junit_04.xml artifacts/gathered/junit_05.xml artifacts/gathered/junit_06.xml artifacts/gathered/kube-apiserver.log artifacts/gathered/kube-controller-manager.log artifacts/gathered/kubelet.log artifacts/gathered/kube-proxy.log artifacts/gathered/kube-proxy.yaml artifacts/gathered/kube-scheduler.log gcs/artifacts/
+ cp artifacts/generated/avc_denials.log artifacts/generated/filesystem.info artifacts/generated/installed_packages.log artifacts/generated/pid1.journal artifacts/generated/system.journal gcs/artifacts/generated/
+ cp artifacts/journals/crio.service artifacts/journals/customcluster.service artifacts/journals/systemd-journald.service gcs/artifacts/journals/
++ pwd
+ scp -F /var/lib/jenkins/jobs/test_pull_request_crio_e2e_features_rhel/workspace/.config/origin-ci-tool/inventory/.ssh_config -r /var/lib/jenkins/jobs/test_pull_request_crio_e2e_features_rhel/workspace/gcs openshiftdevel:/data
+ scp -F /var/lib/jenkins/jobs/test_pull_request_crio_e2e_features_rhel/workspace/.config/origin-ci-tool/inventory/.ssh_config /var/lib/jenkins/.config/gcloud/gcs-publisher-credentials.json openshiftdevel:/data/credentials.json
+ exit 0
[workspace] $ /bin/bash /tmp/jenkins5038214224183914061.sh
########## STARTING STAGE: PUSH THE ARTIFACTS AND METADATA ##########
+ [[ -s /var/lib/jenkins/jobs/test_pull_request_crio_e2e_features_rhel/workspace/activate ]]
+ source /var/lib/jenkins/jobs/test_pull_request_crio_e2e_features_rhel/workspace/activate
++ export VIRTUAL_ENV=/var/lib/jenkins/origin-ci-tool/95a472392910104fc805c4ab8af39791105c956d
++ VIRTUAL_ENV=/var/lib/jenkins/origin-ci-tool/95a472392910104fc805c4ab8af39791105c956d
++ export PATH=/var/lib/jenkins/origin-ci-tool/95a472392910104fc805c4ab8af39791105c956d/bin:/sbin:/usr/sbin:/bin:/usr/bin
++ PATH=/var/lib/jenkins/origin-ci-tool/95a472392910104fc805c4ab8af39791105c956d/bin:/sbin:/usr/sbin:/bin:/usr/bin
++ unset PYTHON_HOME
++ export OCT_CONFIG_HOME=/var/lib/jenkins/jobs/test_pull_request_crio_e2e_features_rhel/workspace/.config
++ OCT_CONFIG_HOME=/var/lib/jenkins/jobs/test_pull_request_crio_e2e_features_rhel/workspace/.config
++ mktemp
+ script=/tmp/tmp.DsvRa4FYhv
+ cat
+ chmod +x /tmp/tmp.DsvRa4FYhv
+ scp -F /var/lib/jenkins/jobs/test_pull_request_crio_e2e_features_rhel/workspace/.config/origin-ci-tool/inventory/.ssh_config /tmp/tmp.DsvRa4FYhv openshiftdevel:/tmp/tmp.DsvRa4FYhv
+ ssh -F /var/lib/jenkins/jobs/test_pull_request_crio_e2e_features_rhel/workspace/.config/origin-ci-tool/inventory/.ssh_config -t openshiftdevel 'bash -l -c "timeout 300 /tmp/tmp.DsvRa4FYhv"'
+ cd /home/origin
+ trap 'exit 0' EXIT
+ [[ -n {"type":"presubmit","job":"test_pull_request_crio_e2e_features_rhel","buildid":"1543077077857603593","prowjobid":"a291d649-f9b8-11ec-9f8b-0a580a81080e","refs":{"org":"cri-o","repo":"cri-o","base_ref":"main","base_sha":"d427c58bde81020b267cf4b6375e353ff6c36d19","pulls":[{"number":6004,"author":"giuseppe","sha":"a2d1ca20423cf019a5397d0ca193e314132455e3","title":"server: userns support"}]}} ]]
++ jq --compact-output '.buildid |= "24313"'
+ JOB_SPEC='{"type":"presubmit","job":"test_pull_request_crio_e2e_features_rhel","buildid":"24313","prowjobid":"a291d649-f9b8-11ec-9f8b-0a580a81080e","refs":{"org":"cri-o","repo":"cri-o","base_ref":"main","base_sha":"d427c58bde81020b267cf4b6375e353ff6c36d19","pulls":[{"number":6004,"author":"giuseppe","sha":"a2d1ca20423cf019a5397d0ca193e314132455e3","title":"server: userns support"}]}}'
+ sudo docker run -e 'JOB_SPEC={"type":"presubmit","job":"test_pull_request_crio_e2e_features_rhel","buildid":"24313","prowjobid":"a291d649-f9b8-11ec-9f8b-0a580a81080e","refs":{"org":"cri-o","repo":"cri-o","base_ref":"main","base_sha":"d427c58bde81020b267cf4b6375e353ff6c36d19","pulls":[{"number":6004,"author":"giuseppe","sha":"a2d1ca20423cf019a5397d0ca193e314132455e3","title":"server: userns support"}]}}' -v /data:/data:z registry.ci.openshift.org/ci/gcsupload:latest --dry-run=false --gcs-path=gs://origin-federated-results --gcs-credentials-file=/data/credentials.json /data/gcs/artifacts /data/gcs/build-log.txt /data/gcs/finished.json /data/gcs/started.json
sudo: docker: command not found
+ exit 0
+ set +o xtrace
########## FINISHED STAGE: SUCCESS: PUSH THE ARTIFACTS AND METADATA [00h 00m 01s] ##########
[workspace] $ /bin/bash /tmp/jenkins100401097844018513.sh
########## STARTING STAGE: DEPROVISION CLOUD RESOURCES ##########
+ [[ -s /var/lib/jenkins/jobs/test_pull_request_crio_e2e_features_rhel/workspace/activate ]]
+ source /var/lib/jenkins/jobs/test_pull_request_crio_e2e_features_rhel/workspace/activate
++ export VIRTUAL_ENV=/var/lib/jenkins/origin-ci-tool/95a472392910104fc805c4ab8af39791105c956d
++ VIRTUAL_ENV=/var/lib/jenkins/origin-ci-tool/95a472392910104fc805c4ab8af39791105c956d
++ export PATH=/var/lib/jenkins/origin-ci-tool/95a472392910104fc805c4ab8af39791105c956d/bin:/sbin:/usr/sbin:/bin:/usr/bin
++ PATH=/var/lib/jenkins/origin-ci-tool/95a472392910104fc805c4ab8af39791105c956d/bin:/sbin:/usr/sbin:/bin:/usr/bin
++ unset PYTHON_HOME
++ export OCT_CONFIG_HOME=/var/lib/jenkins/jobs/test_pull_request_crio_e2e_features_rhel/workspace/.config
++ OCT_CONFIG_HOME=/var/lib/jenkins/jobs/test_pull_request_crio_e2e_features_rhel/workspace/.config
+ oct deprovision

PLAYBOOK: main.yml *************************************************************
4 plays in /var/lib/jenkins/origin-ci-tool/95a472392910104fc805c4ab8af39791105c956d/lib/python2.7/site-packages/oct/ansible/oct/playbooks/deprovision/main.yml

PLAY [ensure we have the parameters necessary to deprovision virtual hosts] ****

TASK [ensure all required variables are set] ***********************************
task path: /var/lib/jenkins/origin-ci-tool/95a472392910104fc805c4ab8af39791105c956d/lib/python2.7/site-packages/oct/ansible/oct/playbooks/deprovision/main.yml:9
skipping: [localhost] => (item=origin_ci_inventory_dir)  => {
    "changed": false, 
    "generated_timestamp": "2022-07-02 01:04:14.165018", 
    "item": "origin_ci_inventory_dir", 
    "skip_reason": "Conditional check failed", 
    "skipped": true
}
skipping: [localhost] => (item=origin_ci_aws_region)  => {
    "changed": false, 
    "generated_timestamp": "2022-07-02 01:04:14.168363", 
    "item": "origin_ci_aws_region", 
    "skip_reason": "Conditional check failed", 
    "skipped": true
}

PLAY [deprovision virtual hosts in EC2] ****************************************

TASK [Gathering Facts] *********************************************************
ok: [localhost]

TASK [deprovision a virtual EC2 host] ******************************************
task path: /var/lib/jenkins/origin-ci-tool/95a472392910104fc805c4ab8af39791105c956d/lib/python2.7/site-packages/oct/ansible/oct/playbooks/deprovision/main.yml:28
included: /var/lib/jenkins/origin-ci-tool/95a472392910104fc805c4ab8af39791105c956d/lib/python2.7/site-packages/oct/ansible/oct/playbooks/deprovision/roles/aws-down/tasks/main.yml for localhost

TASK [update the SSH configuration to remove AWS EC2 specifics] ****************
task path: /var/lib/jenkins/origin-ci-tool/95a472392910104fc805c4ab8af39791105c956d/lib/python2.7/site-packages/oct/ansible/oct/playbooks/deprovision/roles/aws-down/tasks/main.yml:2
ok: [localhost] => {
    "changed": false, 
    "generated_timestamp": "2022-07-02 01:04:15.143439", 
    "msg": ""
}

TASK [rename EC2 instance for termination reaper] ******************************
task path: /var/lib/jenkins/origin-ci-tool/95a472392910104fc805c4ab8af39791105c956d/lib/python2.7/site-packages/oct/ansible/oct/playbooks/deprovision/roles/aws-down/tasks/main.yml:8
changed: [localhost] => {
    "changed": true, 
    "generated_timestamp": "2022-07-02 01:04:15.854173", 
    "msg": "Tags {'Name': 'oct-terminate'} created for resource i-092a83248460582df."
}

TASK [tear down the EC2 instance] **********************************************
task path: /var/lib/jenkins/origin-ci-tool/95a472392910104fc805c4ab8af39791105c956d/lib/python2.7/site-packages/oct/ansible/oct/playbooks/deprovision/roles/aws-down/tasks/main.yml:15
changed: [localhost] => {
    "changed": true, 
    "generated_timestamp": "2022-07-02 01:04:17.035131", 
    "instance_ids": [
        "i-092a83248460582df"
    ], 
    "instances": [
        {
            "ami_launch_index": "0", 
            "architecture": "x86_64", 
            "block_device_mapping": {
                "/dev/sda1": {
                    "delete_on_termination": true, 
                    "status": "attached", 
                    "volume_id": "vol-063f730ef726a2279"
                }, 
                "/dev/sdb": {
                    "delete_on_termination": true, 
                    "status": "attached", 
                    "volume_id": "vol-0487e9e5b6d9b0bc3"
                }
            }, 
            "dns_name": "ec2-54-173-197-126.compute-1.amazonaws.com", 
            "ebs_optimized": false, 
            "groups": {
                "sg-7e73221a": "default"
            }, 
            "hypervisor": "xen", 
            "id": "i-092a83248460582df", 
            "image_id": "ami-0db1bcec6bfd5a39f", 
            "instance_type": "m4.xlarge", 
            "kernel": null, 
            "key_name": "openshift-dev", 
            "launch_time": "2022-07-02T03:40:46.000Z", 
            "placement": "us-east-1d", 
            "private_dns_name": "ip-172-18-4-98.ec2.internal", 
            "private_ip": "172.18.4.98", 
            "public_dns_name": "ec2-54-173-197-126.compute-1.amazonaws.com", 
            "public_ip": "54.173.197.126", 
            "ramdisk": null, 
            "region": "us-east-1", 
            "root_device_name": "/dev/sda1", 
            "root_device_type": "ebs", 
            "state": "running", 
            "state_code": 16, 
            "tags": {
                "Name": "oct-terminate", 
                "openshift_etcd": "", 
                "openshift_master": "", 
                "openshift_node": ""
            }, 
            "tenancy": "default", 
            "virtualization_type": "hvm"
        }
    ], 
    "tagged_instances": []
}

TASK [remove the serialized host variables] ************************************
task path: /var/lib/jenkins/origin-ci-tool/95a472392910104fc805c4ab8af39791105c956d/lib/python2.7/site-packages/oct/ansible/oct/playbooks/deprovision/roles/aws-down/tasks/main.yml:22
changed: [localhost] => {
    "changed": true, 
    "generated_timestamp": "2022-07-02 01:04:17.309576", 
    "path": "/var/lib/jenkins/jobs/test_pull_request_crio_e2e_features_rhel/workspace/.config/origin-ci-tool/inventory/host_vars/172.18.4.98.yml", 
    "state": "absent"
}

PLAY [deprovision virtual hosts locally manged by Vagrant] *********************

TASK [Gathering Facts] *********************************************************
ok: [localhost]

PLAY [clean up local configuration for deprovisioned instances] ****************

TASK [remove inventory configuration directory] ********************************
task path: /var/lib/jenkins/origin-ci-tool/95a472392910104fc805c4ab8af39791105c956d/lib/python2.7/site-packages/oct/ansible/oct/playbooks/deprovision/main.yml:61
changed: [localhost] => {
    "changed": true, 
    "generated_timestamp": "2022-07-02 01:04:17.861825", 
    "path": "/var/lib/jenkins/jobs/test_pull_request_crio_e2e_features_rhel/workspace/.config/origin-ci-tool/inventory", 
    "state": "absent"
}

PLAY RECAP *********************************************************************
localhost                  : ok=8    changed=4    unreachable=0    failed=0   

+ set +o xtrace
########## FINISHED STAGE: SUCCESS: DEPROVISION CLOUD RESOURCES [00h 00m 05s] ##########
Build step 'Execute scripts' changed build result to FAILURE
Build step 'Execute scripts' marked build as failure
Archiving artifacts
Recording test results
[Checks API] No suitable checks publisher found.
sent [/var/lib/jenkins/jobs/test_pull_request_crio_e2e_features_rhel/workspace/artifacts/gathered/e2e.log, /var/lib/jenkins/jobs/test_pull_request_crio_e2e_features_rhel/workspace/artifacts/gathered/kube-apiserver.log, /var/lib/jenkins/jobs/test_pull_request_crio_e2e_features_rhel/workspace/artifacts/gathered/kube-controller-manager.log, /var/lib/jenkins/jobs/test_pull_request_crio_e2e_features_rhel/workspace/artifacts/gathered/kube-proxy.log, /var/lib/jenkins/jobs/test_pull_request_crio_e2e_features_rhel/workspace/artifacts/gathered/kube-scheduler.log, /var/lib/jenkins/jobs/test_pull_request_crio_e2e_features_rhel/workspace/artifacts/gathered/kubelet.log, /var/lib/jenkins/jobs/test_pull_request_crio_e2e_features_rhel/workspace/artifacts/generated/avc_denials.log, /var/lib/jenkins/jobs/test_pull_request_crio_e2e_features_rhel/workspace/artifacts/generated/installed_packages.log, /var/lib/jenkins/jobs/test_pull_request_crio_e2e_features_rhel/workspace/gcs/artifacts/e2e.log, /var/lib/jenkins/jobs/test_pull_request_crio_e2e_features_rhel/workspace/gcs/artifacts/generated/avc_denials.log, /var/lib/jenkins/jobs/test_pull_request_crio_e2e_features_rhel/workspace/gcs/artifacts/generated/installed_packages.log, /var/lib/jenkins/jobs/test_pull_request_crio_e2e_features_rhel/workspace/gcs/artifacts/kube-apiserver.log, /var/lib/jenkins/jobs/test_pull_request_crio_e2e_features_rhel/workspace/gcs/artifacts/kube-controller-manager.log, /var/lib/jenkins/jobs/test_pull_request_crio_e2e_features_rhel/workspace/gcs/artifacts/kube-proxy.log, /var/lib/jenkins/jobs/test_pull_request_crio_e2e_features_rhel/workspace/gcs/artifacts/kube-scheduler.log, /var/lib/jenkins/jobs/test_pull_request_crio_e2e_features_rhel/workspace/gcs/artifacts/kubelet.log] to splunk in 58 events
[WS-CLEANUP] Deleting project workspace...
[WS-CLEANUP] Deferred wipeout is used...
[WS-CLEANUP] done
Finished: FAILURE